CopyrightOntology
type: Ontology
date: 2013-09-02
description: Copyright Ontology, http://rhizomik.net/ontologies/copyrightonto
preferred namespace prefix: co
license: http://creativecommons.org/licenses/by/3.0/
creator: ~roberto
imports: all

Broadcasting Right
type: Class
subclass of: Communication Right

Communication Right
type: Class
subclass of: Economic Rights
comment: It regulates the realisation of Communications of works, including wire or wireless means and those realised from a place and at a time individually selected. This right is concretised into Broadcasting Right, when the communication is massive, and Make Available Right, when the communication is individually chosen.
subclass of: http://lodlaundromat.org/.well-known/genid/samples/pellet///predicate//bf34a4b6a1fda1c874f5f519ec0f7687/bf34a4b6a1fda1c874f5f519ec0f7687#73

Copyright
type: Class
subclass of: Temporal
subclass of: Action
subclass of: Thing
subclass of: Spatial
disjoint with: Aim
disjoint with: Communication Medium

Communication Medium
type: Class
comment: The medium used for a Communicate.
disjoint with: Aim

Aim
type: Class
subclass of: Thing
comment: The motivation of an action.

Rent
type: Class
subclass of: http://lodlaundromat.org/.well-known/genid/samples/pellet///predicate//bf34a4b6a1fda1c874f5f519ec0f7687/bf34a4b6a1fda1c874f5f519ec0f7687#1
subclass of: Rental Right
subclass of: Distribute
comment: Distribute temporarily with a significant economic value exchange. There is a duration and some economic transfer condition.
subclass of: http://lodlaundromat.org/.well-known/genid/samples/pellet///predicate//bf34a4b6a1fda1c874f5f519ec0f7687/bf34a4b6a1fda1c874f5f519ec0f7687#2
subclass of: Ambient

condition
type: ObjectProperty
domain: Ambient
comment: The necessary circumstance for an action. Example: In order to see the film [you must pay the entrance].

Economic Transfer
type: Class
subclass of: http://lodlaundromat.org/.well-known/genid/samples/pellet///predicate//bf34a4b6a1fda1c874f5f519ec0f7687/bf34a4b6a1fda1c874f5f519ec0f7687#54
subclass of: http://lodlaundromat.org/.well-known/genid/samples/pellet///predicate//bf34a4b6a1fda1c874f5f519ec0f7687/bf34a4b6a1fda1c874f5f519ec0f7687#55
subclass of: http://lodlaundromat.org/.well-known/genid/samples/pellet///predicate//bf34a4b6a1fda1c874f5f519ec0f7687/bf34a4b6a1fda1c874f5f519ec0f7687#56
subclass of: http://lodlaundromat.org/.well-known/genid/samples/pellet///predicate//bf34a4b6a1fda1c874f5f519ec0f7687/bf34a4b6a1fda1c874f5f519ec0f7687#57
comment: A Transfer of some economic value in exchange of something, the aim.
subclass of: Ambient
subclass of: Transfer
subclass of: http://lodlaundromat.org/.well-known/genid/samples/pellet///predicate//bf34a4b6a1fda1c874f5f519ec0f7687/bf34a4b6a1fda1c874f5f519ec0f7687#58
subclass of: http://lodlaundromat.org/.well-known/genid/samples/pellet///predicate//bf34a4b6a1fda1c874f5f519ec0f7687/bf34a4b6a1fda1c874f5f519ec0f7687#59

Rental Right
type: Class
subclass of: Distribution Right

Distribute
type: Class
subclass of: Transfer
subclass of: http://lodlaundromat.org/.well-known/genid/samples/pellet///predicate//bf34a4b6a1fda1c874f5f519ec0f7687/bf34a4b6a1fda1c874f5f519ec0f7687#76
subclass of: http://lodlaundromat.org/.well-known/genid/samples/pellet///predicate//bf34a4b6a1fda1c874f5f519ec0f7687/bf34a4b6a1fda1c874f5f519ec0f7687#77
subclass of: http://lodlaundromat.org/.well-known/genid/samples/pellet///predicate//bf34a4b6a1fda1c874f5f519ec0f7687/bf34a4b6a1fda1c874f5f519ec0f7687#78
subclass of: Distribution Right
subclass of: http://lodlaundromat.org/.well-known/genid/samples/pellet///predicate//bf34a4b6a1fda1c874f5f519ec0f7687/bf34a4b6a1fda1c874f5f519ec0f7687#79
comment: Once Instances of a Work have been produced, they are distributed to the public. Therefore, there is a recipient of the Instance. If the Distribute does not imply a permanent transfer of ownership on the Instance, i.e. on the material support but not on the underlying Work, there is also a duration case role. This is concretised in the Distribute specialisations.

http://lodlaundromat.org/.well-known/genid/samples/pellet///predicate//bf34a4b6a1fda1c874f5f519ec0f7687/bf34a4b6a1fda1c874f5f519ec0f7687#2
type: Restriction
cardinality: 1
on property: duration

duration
type: ObjectProperty
comment: A resource of a temporal process. Example: The truck was serviced for [5 hours].
domain: Temporal

Manifest
type: Class
subclass of: http://lodlaundromat.org/.well-known/genid/samples/pellet///predicate//bf34a4b6a1fda1c874f5f519ec0f7687/bf34a4b6a1fda1c874f5f519ec0f7687#3
subclass of: http://lodlaundromat.org/.well-known/genid/samples/pellet///predicate//bf34a4b6a1fda1c874f5f519ec0f7687/bf34a4b6a1fda1c874f5f519ec0f7687#4
subclass of: Spatial
subclass of: http://lodlaundromat.org/.well-known/genid/samples/pellet///predicate//bf34a4b6a1fda1c874f5f519ec0f7687/bf34a4b6a1fda1c874f5f519ec0f7687#5
subclass of: http://lodlaundromat.org/.well-known/genid/samples/pellet///predicate//bf34a4b6a1fda1c874f5f519ec0f7687/bf34a4b6a1fda1c874f5f519ec0f7687#6
subclass of: http://lodlaundromat.org/.well-known/genid/samples/pellet///predicate//bf34a4b6a1fda1c874f5f519ec0f7687/bf34a4b6a1fda1c874f5f519ec0f7687#7
subclass of: Temporal
subclass of: http://lodlaundromat.org/.well-known/genid/samples/pellet///predicate//bf34a4b6a1fda1c874f5f519ec0f7687/bf34a4b6a1fda1c874f5f519ec0f7687#8
comment: If this action brings into existence the first manifestation of a work, the manifest event implies that the creator becomes the holder of all the copyright rights on the creation. All this is modelled by the Manifest-Rule. In order to check that this is the first manifestation of the work, the rule tests if there is not a statement asserting that there is a manifestation of the work yet. RULE: (∀v:Manifest) ((∃mr:MoralRights)(∃er:EconomicRights) ((∀p:Person)(∀m':Manifestation)(∀w:Work)(∀m:Manifestation)(∀t:Time) (¬isManifestationOf(m',w)∧agent(v,p)∧theme(v,w)∧result(v,m)∧ pointInTime(v,t)∧location(v,l) → agent(mr,p)∧agent(er,p)∧essence(mr,w)∧essence(er,m)∧ start(mr,t)∧start(er,t)∧location(mr,l)∧location(er,l)∧isManifestationOf(m,w)))
subclass of: http://lodlaundromat.org/.well-known/genid/samples/pellet///predicate//bf34a4b6a1fda1c874f5f519ec0f7687/bf34a4b6a1fda1c874f5f519ec0f7687#9
comment: One or more authors generate a manifestation from a work at a given place (at least the country for copyright jurisdiction) and time (from legal point of view). In the case of employed authors and works made for hire, the employer, and not the employee, is legally considered the author of the work and becomes the rights holder. Multiple creators are also allowed in order to cope with works realised in collaboration.
subclass of: Action
subclass of: http://lodlaundromat.org/.well-known/genid/samples/pellet///predicate//bf34a4b6a1fda1c874f5f519ec0f7687/bf34a4b6a1fda1c874f5f519ec0f7687#10

result
type: ObjectProperty
comment: An inanimate goal of an event. Example: Eric built a [house].
domain: http://lodlaundromat.org/.well-known/genid/samples/pellet///predicate//bf34a4b6a1fda1c874f5f519ec0f7687/bf34a4b6a1fda1c874f5f519ec0f7687#131

Manifestation
type: Class
comment: The materialisation of a Work in a concrete medium, i.e. a tangible or digital object. International identification schemes for manifestations: ISBN (International Standard Book Number) for books or ISMN (International Standard Music Number) for printed music. Examples: the printed scores of The Magic Flute or the editions of Les Misérables.
subclass of: CreationObject

http://lodlaundromat.org/.well-known/genid/samples/pellet///predicate//bf34a4b6a1fda1c874f5f519ec0f7687/bf34a4b6a1fda1c874f5f519ec0f7687#4
type: Restriction
cardinality: 1
on property: time

time
type: DatatypeProperty
domain: Temporal
comment: A temporal essential participant. Example: [At 5:25 PM], Erin left.

agent
type: ObjectProperty
comment: The voluntary initiator of an event. Example: [Eve] bit an apple.
domain: http://lodlaundromat.org/.well-known/genid/samples/pellet///predicate//bf34a4b6a1fda1c874f5f519ec0f7687/bf34a4b6a1fda1c874f5f519ec0f7687#127

Legal Person
type: Class
disjoint with: Copyright
disjoint with: Communication Medium
disjoint with: Aim
disjoint with: Public Place
disjoint with: CreativeWork
disjoint with: Action
subclass of: Thing

http://lodlaundromat.org/.well-known/genid/samples/pellet///predicate//bf34a4b6a1fda1c874f5f519ec0f7687/bf34a4b6a1fda1c874f5f519ec0f7687#6
type: Restriction
on property: theme
cardinality: 1

theme
type: ObjectProperty
domain: http://lodlaundromat.org/.well-known/genid/samples/pellet///predicate//bf34a4b6a1fda1c874f5f519ec0f7687/bf34a4b6a1fda1c874f5f519ec0f7687#123
comment: An essential participant that may be moved, said, or experienced, but is not structurally changed. Example: Billy likes [the Beer].

http://lodlaundromat.org/.well-known/genid/samples/pellet///predicate//bf34a4b6a1fda1c874f5f519ec0f7687/bf34a4b6a1fda1c874f5f519ec0f7687#7
type: Restriction
cardinality: 1
on property: location

location
type: ObjectProperty
comment: An spatial essential participant. Example: Vehicles arrive at [a station].
domain: Spatial
range: Place

Work
type: Class
comment: The socially shared concept that captures the characteristics that allow the identification of the original creation among all its manifestations. International identification schemes for works: ISTC (International Standard Text Code) for textual works, ISSN (International Standard Serial Number) for serial publications or ISWC (International Standard Musical Work Code) for musical and literary works. Examples: Mozart's The Magic Flute or Victor Hugo's Les Misérables.
subclass of: Abstract

http://lodlaundromat.org/.well-known/genid/samples/pellet///predicate//bf34a4b6a1fda1c874f5f519ec0f7687/bf34a4b6a1fda1c874f5f519ec0f7687#9
type: Restriction
min cardinality: 1
on property: agent

http://lodlaundromat.org/.well-known/genid/samples/pellet///predicate//bf34a4b6a1fda1c874f5f519ec0f7687/bf34a4b6a1fda1c874f5f519ec0f7687#10
type: Restriction
cardinality: 1
on property: result

Public Place
type: Class
disjoint with: Communication Medium
disjoint with: CreativeWork
disjoint with: Legal Person
subclass of: Place
comment: A place that is public.
disjoint with: Aim
disjoint with: Action
disjoint with: Copyright

Agree
type: Class
subclass of: Ambient
comment: An event in which a written or unwritten accord is made between two or more parties.

DistributionContract
type: Class
subclass of: IPRAgreement

IPRAgreement
type: Class
subclass of: Agree
comment: A situation in which an ipr is transferred by an agreement.

Tune
type: Class
subclass of: http://lodlaundromat.org/.well-known/genid/samples/pellet///predicate//bf34a4b6a1fda1c874f5f519ec0f7687/bf34a4b6a1fda1c874f5f519ec0f7687#11
subclass of: Transfer
subclass of: http://lodlaundromat.org/.well-known/genid/samples/pellet///predicate//bf34a4b6a1fda1c874f5f519ec0f7687/bf34a4b6a1fda1c874f5f519ec0f7687#12
subclass of: http://lodlaundromat.org/.well-known/genid/samples/pellet///predicate//bf34a4b6a1fda1c874f5f519ec0f7687/bf34a4b6a1fda1c874f5f519ec0f7687#13
subclass of: http://lodlaundromat.org/.well-known/genid/samples/pellet///predicate//bf34a4b6a1fda1c874f5f519ec0f7687/bf34a4b6a1fda1c874f5f519ec0f7687#14
subclass of: http://lodlaundromat.org/.well-known/genid/samples/pellet///predicate//bf34a4b6a1fda1c874f5f519ec0f7687/bf34a4b6a1fda1c874f5f519ec0f7687#15
subclass of: Ambient
subclass of: http://lodlaundromat.org/.well-known/genid/samples/pellet///predicate//bf34a4b6a1fda1c874f5f519ec0f7687/bf34a4b6a1fda1c874f5f519ec0f7687#16
subclass of: http://lodlaundromat.org/.well-known/genid/samples/pellet///predicate//bf34a4b6a1fda1c874f5f519ec0f7687/bf34a4b6a1fda1c874f5f519ec0f7687#17
comment: This is the action that consumes the communication of a Broadcast. Consequently, it is a non-interactive action from the point of view of the consumer. The user just tunes the medium where the content is broadcasted from an appropriate location.
subclass of: Use

http://lodlaundromat.org/.well-known/genid/samples/pellet///predicate//bf34a4b6a1fda1c874f5f519ec0f7687/bf34a4b6a1fda1c874f5f519ec0f7687#11
type: Restriction
on property: start
max cardinality: 1

start
type: ObjectProperty
comment: A determinant temporal source. Example: Bill waited from [noon] to three.
domain: Temporal

http://lodlaundromat.org/.well-known/genid/samples/pellet///predicate//bf34a4b6a1fda1c874f5f519ec0f7687/bf34a4b6a1fda1c874f5f519ec0f7687#12
type: Restriction
on property: theme
cardinality: 1

http://lodlaundromat.org/.well-known/genid/samples/pellet///predicate//bf34a4b6a1fda1c874f5f519ec0f7687/bf34a4b6a1fda1c874f5f519ec0f7687#13
type: Restriction
on property: medium
max cardinality: 1

medium
type: ObjectProperty
comment: A physical resource for transmitting information, such as the sound of speech or the electromagnetic signals that transmit data. Example: Bill told Boris by [phone].
domain: Transfer

Broadcast Medium
type: Class
subclass of: Communication Medium

Broadcasted Communication
type: Class
subclass of: Communication

http://lodlaundromat.org/.well-known/genid/samples/pellet///predicate//bf34a4b6a1fda1c874f5f519ec0f7687/bf34a4b6a1fda1c874f5f519ec0f7687#16
type: Restriction
on property: manner
min cardinality: 0

manner
type: ObjectProperty
comment: The way an event develops. Example: The car moved [slowly].
domain: Ambient

http://lodlaundromat.org/.well-known/genid/samples/pellet///predicate//bf34a4b6a1fda1c874f5f519ec0f7687/bf34a4b6a1fda1c874f5f519ec0f7687#17
type: Restriction
max cardinality: 1
on property: duration

Use
type: Class
subclass of: Temporal
subclass of: http://lodlaundromat.org/.well-known/genid/samples/pellet///predicate//bf34a4b6a1fda1c874f5f519ec0f7687/bf34a4b6a1fda1c874f5f519ec0f7687#92
subclass of: Action
subclass of: Spatial
subclass of: http://lodlaundromat.org/.well-known/genid/samples/pellet///predicate//bf34a4b6a1fda1c874f5f519ec0f7687/bf34a4b6a1fda1c874f5f519ec0f7687#93
subclass of: http://lodlaundromat.org/.well-known/genid/samples/pellet///predicate//bf34a4b6a1fda1c874f5f519ec0f7687/bf34a4b6a1fda1c874f5f519ec0f7687#94
subclass of: http://lodlaundromat.org/.well-known/genid/samples/pellet///predicate//bf34a4b6a1fda1c874f5f519ec0f7687/bf34a4b6a1fda1c874f5f519ec0f7687#95

Withdrawal Right
type: Class
comment: The right to withdraw the work.
subclass of: Moral Rights

Moral Rights
type: Class
subclass of: http://lodlaundromat.org/.well-known/genid/samples/pellet///predicate//bf34a4b6a1fda1c874f5f519ec0f7687/bf34a4b6a1fda1c874f5f519ec0f7687#80
subclass of: http://lodlaundromat.org/.well-known/genid/samples/pellet///predicate//bf34a4b6a1fda1c874f5f519ec0f7687/bf34a4b6a1fda1c874f5f519ec0f7687#81
subclass of: http://lodlaundromat.org/.well-known/genid/samples/pellet///predicate//bf34a4b6a1fda1c874f5f519ec0f7687/bf34a4b6a1fda1c874f5f519ec0f7687#82
subclass of: http://lodlaundromat.org/.well-known/genid/samples/pellet///predicate//bf34a4b6a1fda1c874f5f519ec0f7687/bf34a4b6a1fda1c874f5f519ec0f7687#83
subclass of: http://lodlaundromat.org/.well-known/genid/samples/pellet///predicate//bf34a4b6a1fda1c874f5f519ec0f7687/bf34a4b6a1fda1c874f5f519ec0f7687#84
subclass of: Copyright
comment: Moral rights are always held by the creator and cannot be commercially exploited. They are not present in all legal systems. However, WIPO treaties are promoting some of them in order to improve worldwide copyright law harmonisation.
subclass of: http://lodlaundromat.org/.well-known/genid/samples/pellet///predicate//bf34a4b6a1fda1c874f5f519ec0f7687/bf34a4b6a1fda1c874f5f519ec0f7687#85

Live Communicate
type: Class
subclass of: http://lodlaundromat.org/.well-known/genid/samples/pellet///predicate//bf34a4b6a1fda1c874f5f519ec0f7687/bf34a4b6a1fda1c874f5f519ec0f7687#18
subclass of: Communicate
disjoint with: Recording Communicate
comment: A Communicate of a Performance.

Performance
type: Class
subclass of: CreationProcess
comment: The expression in time of a manifestation of a work before and audience. Performers or technical methods might be involved in the process. Examples: the scenic play of The Magic Flute opera or a screen play of any of Les Misérables films.

Communicate
type: Class
subclass of: http://lodlaundromat.org/.well-known/genid/samples/pellet///predicate//bf34a4b6a1fda1c874f5f519ec0f7687/bf34a4b6a1fda1c874f5f519ec0f7687#35
subclass of: http://lodlaundromat.org/.well-known/genid/samples/pellet///predicate//bf34a4b6a1fda1c874f5f519ec0f7687/bf34a4b6a1fda1c874f5f519ec0f7687#36
subclass of: http://lodlaundromat.org/.well-known/genid/samples/pellet///predicate//bf34a4b6a1fda1c874f5f519ec0f7687/bf34a4b6a1fda1c874f5f519ec0f7687#37
subclass of: http://lodlaundromat.org/.well-known/genid/samples/pellet///predicate//bf34a4b6a1fda1c874f5f519ec0f7687/bf34a4b6a1fda1c874f5f519ec0f7687#38
subclass of: http://lodlaundromat.org/.well-known/genid/samples/pellet///predicate//bf34a4b6a1fda1c874f5f519ec0f7687/bf34a4b6a1fda1c874f5f519ec0f7687#39
subclass of: http://lodlaundromat.org/.well-known/genid/samples/pellet///predicate//bf34a4b6a1fda1c874f5f519ec0f7687/bf34a4b6a1fda1c874f5f519ec0f7687#40
subclass of: Transfer
subclass of: http://lodlaundromat.org/.well-known/genid/samples/pellet///predicate//bf34a4b6a1fda1c874f5f519ec0f7687/bf34a4b6a1fda1c874f5f519ec0f7687#41
comment: This verb includes any communication to the public of the originals or copies of works, including wire or wireless means and "the making available to the public of works in a way that the members of the public may access the work from a place and at a time individually chosen by them". The quoted expression covers, in particular, on-demand interactive communication through the Internet. On the contrary to Perform, this action just covers all communication to the public not present at the place where the communication originates.
subclass of: Communication Right
subclass of: http://lodlaundromat.org/.well-known/genid/samples/pellet///predicate//bf34a4b6a1fda1c874f5f519ec0f7687/bf34a4b6a1fda1c874f5f519ec0f7687#42

Recording Communicate
type: Class
disjoint with: Live Communicate
comment: A Communicate of a previous recording.
subclass of: http://lodlaundromat.org/.well-known/genid/samples/pellet///predicate//bf34a4b6a1fda1c874f5f519ec0f7687/bf34a4b6a1fda1c874f5f519ec0f7687#91
subclass of: Communicate

Adapt
type: Class
comment: To Adapt is generally understood as the modification of a Work from one type of Work to another, for example adapting a novel so as to make a motion picture, or the modification of a Work so as to make it suitable for different conditions of exploitation, for example adapting an instructional textbook originally prepared for higher education into an instructional textbook intended for students at a lower level.
subclass of: Adaptation Right
subclass of: Derive

Adaptation Right
type: Class
subclass of: Transformation Right

Derive
type: Class
subclass of: http://lodlaundromat.org/.well-known/genid/samples/pellet///predicate//bf34a4b6a1fda1c874f5f519ec0f7687/bf34a4b6a1fda1c874f5f519ec0f7687#43
subclass of: http://lodlaundromat.org/.well-known/genid/samples/pellet///predicate//bf34a4b6a1fda1c874f5f519ec0f7687/bf34a4b6a1fda1c874f5f519ec0f7687#44
subclass of: http://lodlaundromat.org/.well-known/genid/samples/pellet///predicate//bf34a4b6a1fda1c874f5f519ec0f7687/bf34a4b6a1fda1c874f5f519ec0f7687#45
subclass of: http://lodlaundromat.org/.well-known/genid/samples/pellet///predicate//bf34a4b6a1fda1c874f5f519ec0f7687/bf34a4b6a1fda1c874f5f519ec0f7687#46
comment: This correspond to the act changing a work protected by copyright in order to generate a new work. The resulting derivations are themselves works protected by copyright. Derive is thus also a rights generation action, i.e. it causes new rights to arise as a new Work and its first Manifestation are generated as results of the Derive action. The action is required to produce also the first Manifestation of the Work in order to have legal implications. If there is not a Manifestation, the derivation takes part just in the field of ideas, which are not regulated by copyright.
subclass of: http://lodlaundromat.org/.well-known/genid/samples/pellet///predicate//bf34a4b6a1fda1c874f5f519ec0f7687/bf34a4b6a1fda1c874f5f519ec0f7687#47
subclass of: Transformation Right
subclass of: http://lodlaundromat.org/.well-known/genid/samples/pellet///predicate//bf34a4b6a1fda1c874f5f519ec0f7687/bf34a4b6a1fda1c874f5f519ec0f7687#48
comment: RULE: (∀v:Derive) ((∃mr:MoralRights)(∃er:EconomicRights) ((∀p:Person)(∀w:Work)(∀w':Work)(∀m:Manifestation)(∀t:Time) (w≠w')∧agent(v,p)∧theme(v,w)∧result(v,m)∧aim(v,w')∧pointInTime(v,t)∧location(v,l) → agent(mr,p)∧agent(er,p)∧essence(mr,w')∧essence(er,m)∧start(mr,t)∧start(er,t)∧ location(mr,l)∧location(er,l)∧isManifestationOf(m,w')∧isDerivationOf(w',w)))
subclass of: Ambient

Access
type: Class
subclass of: http://lodlaundromat.org/.well-known/genid/samples/pellet///predicate//bf34a4b6a1fda1c874f5f519ec0f7687/bf34a4b6a1fda1c874f5f519ec0f7687#19
subclass of: http://lodlaundromat.org/.well-known/genid/samples/pellet///predicate//bf34a4b6a1fda1c874f5f519ec0f7687/bf34a4b6a1fda1c874f5f519ec0f7687#20
subclass of: Ambient
subclass of: http://lodlaundromat.org/.well-known/genid/samples/pellet///predicate//bf34a4b6a1fda1c874f5f519ec0f7687/bf34a4b6a1fda1c874f5f519ec0f7687#21
subclass of: http://lodlaundromat.org/.well-known/genid/samples/pellet///predicate//bf34a4b6a1fda1c874f5f519ec0f7687/bf34a4b6a1fda1c874f5f519ec0f7687#22
subclass of: http://lodlaundromat.org/.well-known/genid/samples/pellet///predicate//bf34a4b6a1fda1c874f5f519ec0f7687/bf34a4b6a1fda1c874f5f519ec0f7687#23
comment: This is the action that consumes the communication of a MakeAvailable, i.e. an InteractiveCommunication. Consequently, it is an interactive action from the point of view of the consumer, who is able to determine the time line of the content. Usually, the content is consumed from its beginning and from the time point when the content is accessed. Moreover, the user is usually free to pause, resume, forward and rewind the content. However, all these issues are specific to the technological means used to make the content available, e.g. internet video on-demand streamers. It is important to note that this same features can be enjoyed with non-interactive communications but a recording system at the consumers place is then required.
subclass of: Transfer
subclass of: http://lodlaundromat.org/.well-known/genid/samples/pellet///predicate//bf34a4b6a1fda1c874f5f519ec0f7687/bf34a4b6a1fda1c874f5f519ec0f7687#24
subclass of: Use
subclass of: http://lodlaundromat.org/.well-known/genid/samples/pellet///predicate//bf34a4b6a1fda1c874f5f519ec0f7687/bf34a4b6a1fda1c874f5f519ec0f7687#25

Interactive Communication
type: Class
subclass of: Communication

http://lodlaundromat.org/.well-known/genid/samples/pellet///predicate//bf34a4b6a1fda1c874f5f519ec0f7687/bf34a4b6a1fda1c874f5f519ec0f7687#20
type: Restriction
min cardinality: 0
on property: manner

http://lodlaundromat.org/.well-known/genid/samples/pellet///predicate//bf34a4b6a1fda1c874f5f519ec0f7687/bf34a4b6a1fda1c874f5f519ec0f7687#21
type: Restriction
cardinality: 1
on property: theme

http://lodlaundromat.org/.well-known/genid/samples/pellet///predicate//bf34a4b6a1fda1c874f5f519ec0f7687/bf34a4b6a1fda1c874f5f519ec0f7687#22
type: Restriction
max cardinality: 1
on property: start

http://lodlaundromat.org/.well-known/genid/samples/pellet///predicate//bf34a4b6a1fda1c874f5f519ec0f7687/bf34a4b6a1fda1c874f5f519ec0f7687#23
type: Restriction
max cardinality: 1
on property: medium

http://lodlaundromat.org/.well-known/genid/samples/pellet///predicate//bf34a4b6a1fda1c874f5f519ec0f7687/bf34a4b6a1fda1c874f5f519ec0f7687#24
type: Restriction
max cardinality: 1
on property: duration

Interactive Medium
type: Class
subclass of: Communication Medium

Translate
type: Class
subclass of: Translation Right
subclass of: Derive
comment: To express a work in a language other than that of the original version. Therefore, it is possible to just chain the language characteristic from the original Work to the new one.

Translation Right
type: Class
subclass of: Transformation Right

Communication
type: Class
comment: The transmission of a work among places at a given time. It is a process performed when the public is not present at the place and or time where the Communication originates. It includes broadcasts, i.e. one to many, but also communications from a place and at a time individually chosen. Examples: a radio broadcast of a sound recording of The Magic Flute or an Internet streaming of the film Les Misérables.
subclass of: CreationProcess

CreationProcess
type: Class
comment: A creation that happens and has temporal parts or stages.
subclass of: CreativeWork

Distribution Right
type: Class
subclass of: Economic Rights
comment: It regulates actions geared to distribute previously made copies incorporated in tangible articles. The ownership of the corresponding physical support can be transferred permanently, i.e. the distribute act is a sale, or just temporally, i.e. a rent if there is a significant economic compensation or a loan if not.
subclass of: http://lodlaundromat.org/.well-known/genid/samples/pellet///predicate//bf34a4b6a1fda1c874f5f519ec0f7687/bf34a4b6a1fda1c874f5f519ec0f7687#118

Related Rights
type: Class
comment: There are the rights of other persons also involved in the exploitation of works. Performers, producers and broadcasters make a significant contribution in order to make works reach end-users. Their contribution is also protected by some rights related to copyright, the Related Rights or Neighbouring Rights.
subclass of: Copyright

CounterOffer
type: Class
subclass of: Ambient

Importation Right
type: Class
subclass of: Distribution Right
subclass of: http://lodlaundromat.org/.well-known/genid/samples/pellet///predicate//bf34a4b6a1fda1c874f5f519ec0f7687/bf34a4b6a1fda1c874f5f519ec0f7687#26
comment: Some copyright laws include a right to control importation of copies as a means of preventing erosion of the principle of territoriality of copyright.

http://lodlaundromat.org/.well-known/genid/samples/pellet///predicate//bf34a4b6a1fda1c874f5f519ec0f7687/bf34a4b6a1fda1c874f5f519ec0f7687#26
type: Restriction
cardinality: 1
on property: origin

origin
type: ObjectProperty
comment: A passive determinant source. Example: The chapter begins on [page 20].
domain: http://lodlaundromat.org/.well-known/genid/samples/pellet///predicate//bf34a4b6a1fda1c874f5f519ec0f7687/bf34a4b6a1fda1c874f5f519ec0f7687#144

Abstract
type: Class
comment: Something that cannot exist at a paticular place and time without some physical encoding or embodiment. Also known as Mental Concept.
subclass of: CreativeWork

Improvise
type: Class
subclass of: http://lodlaundromat.org/.well-known/genid/samples/pellet///predicate//bf34a4b6a1fda1c874f5f519ec0f7687/bf34a4b6a1fda1c874f5f519ec0f7687#27
subclass of: http://lodlaundromat.org/.well-known/genid/samples/pellet///predicate//bf34a4b6a1fda1c874f5f519ec0f7687/bf34a4b6a1fda1c874f5f519ec0f7687#28
subclass of: http://lodlaundromat.org/.well-known/genid/samples/pellet///predicate//bf34a4b6a1fda1c874f5f519ec0f7687/bf34a4b6a1fda1c874f5f519ec0f7687#29
subclass of: http://lodlaundromat.org/.well-known/genid/samples/pellet///predicate//bf34a4b6a1fda1c874f5f519ec0f7687/bf34a4b6a1fda1c874f5f519ec0f7687#30
comment: This action directly generates a performance from a work, without a previous manifestation.
subclass of: http://lodlaundromat.org/.well-known/genid/samples/pellet///predicate//bf34a4b6a1fda1c874f5f519ec0f7687/bf34a4b6a1fda1c874f5f519ec0f7687#31
subclass of: Spatial
subclass of: http://lodlaundromat.org/.well-known/genid/samples/pellet///predicate//bf34a4b6a1fda1c874f5f519ec0f7687/bf34a4b6a1fda1c874f5f519ec0f7687#32
subclass of: http://lodlaundromat.org/.well-known/genid/samples/pellet///predicate//bf34a4b6a1fda1c874f5f519ec0f7687/bf34a4b6a1fda1c874f5f519ec0f7687#33
subclass of: Action
subclass of: Temporal
subclass of: http://lodlaundromat.org/.well-known/genid/samples/pellet///predicate//bf34a4b6a1fda1c874f5f519ec0f7687/bf34a4b6a1fda1c874f5f519ec0f7687#34

http://lodlaundromat.org/.well-known/genid/samples/pellet///predicate//bf34a4b6a1fda1c874f5f519ec0f7687/bf34a4b6a1fda1c874f5f519ec0f7687#28
type: Restriction
cardinality: 1
on property: time

http://lodlaundromat.org/.well-known/genid/samples/pellet///predicate//bf34a4b6a1fda1c874f5f519ec0f7687/bf34a4b6a1fda1c874f5f519ec0f7687#29
type: Restriction
on property: agent
min cardinality: 1

http://lodlaundromat.org/.well-known/genid/samples/pellet///predicate//bf34a4b6a1fda1c874f5f519ec0f7687/bf34a4b6a1fda1c874f5f519ec0f7687#31
type: Restriction
cardinality: 1
on property: theme

http://lodlaundromat.org/.well-known/genid/samples/pellet///predicate//bf34a4b6a1fda1c874f5f519ec0f7687/bf34a4b6a1fda1c874f5f519ec0f7687#33
type: Restriction
cardinality: 1
on property: result

http://lodlaundromat.org/.well-known/genid/samples/pellet///predicate//bf34a4b6a1fda1c874f5f519ec0f7687/bf34a4b6a1fda1c874f5f519ec0f7687#34
type: Restriction
cardinality: 1
on property: location

http://lodlaundromat.org/.well-known/genid/samples/pellet///predicate//bf34a4b6a1fda1c874f5f519ec0f7687/bf34a4b6a1fda1c874f5f519ec0f7687#35
type: Restriction
on property: medium
cardinality: 1

recipient
type: ObjectProperty
domain: http://lodlaundromat.org/.well-known/genid/samples/pellet///predicate//bf34a4b6a1fda1c874f5f519ec0f7687/bf34a4b6a1fda1c874f5f519ec0f7687#140
comment: An animate goal of an event. Example: Sue sent the gift to [Bob].

http://lodlaundromat.org/.well-known/genid/samples/pellet///predicate//bf34a4b6a1fda1c874f5f519ec0f7687/bf34a4b6a1fda1c874f5f519ec0f7687#37
type: Restriction
cardinality: 1
on property: theme

http://lodlaundromat.org/.well-known/genid/samples/pellet///predicate//bf34a4b6a1fda1c874f5f519ec0f7687/bf34a4b6a1fda1c874f5f519ec0f7687#39
type: Restriction
cardinality: 1
on property: result

http://lodlaundromat.org/.well-known/genid/samples/pellet///predicate//bf34a4b6a1fda1c874f5f519ec0f7687/bf34a4b6a1fda1c874f5f519ec0f7687#41
type: Restriction
on property: origin
max cardinality: 1

Transformation Right
type: Class
comment: It regulates actions that generate new works from previously existing ones. The results of this kind of actions are considered new works, and not mere reproductions, because they contribute something new, i.e. they are original as detailed in the Originality section. This right is concretised into the Adaptation Right and the Translation Right. The former creates a new work of a different type than the original one, e.g. a film from a novel. The latter generates a work of the same type but in a different language.
subclass of: Economic Rights
subclass of: http://lodlaundromat.org/.well-known/genid/samples/pellet///predicate//bf34a4b6a1fda1c874f5f519ec0f7687/bf34a4b6a1fda1c874f5f519ec0f7687#60

Improvisation
type: Class
comment: The expression in time of a work, which has not been previously materialised in a manifestation, before and audience. Performers or technical methods might be involved in the process. Examples: to play some improvised music in a concert.
subclass of: CreationProcess

Education Right
type: Class
subclass of: Users Rights
comment: To illustrate for teaching and research, uses for reproduction and communication to the public in educational institutions, libraries and archives.

Users Rights
type: Class
comment: End-users have some special permissions that grant them the possibility to perform some actions otherwise forbidden by copyright, although this does not mean that the user must pay a compensation if they are exercises, e.g. levies on digital recording equipment and media. These exceptions to copyright should be considered as end-user privileges and not rights. However, some of them are referred to as rights, e.g. the right to quote. Moreover, they are modelled as rights in this conceptualisation in order to build a more homogeneous model.
subclass of: Copyright

http://lodlaundromat.org/.well-known/genid/samples/pellet///predicate//bf34a4b6a1fda1c874f5f519ec0f7687/bf34a4b6a1fda1c874f5f519ec0f7687#43
type: Restriction
on property: aim
cardinality: 1

aim
type: ObjectProperty
comment: The voluntary goal of an action. Example: The player tries [to hit the ball].
domain: Ambient

http://lodlaundromat.org/.well-known/genid/samples/pellet///predicate//bf34a4b6a1fda1c874f5f519ec0f7687/bf34a4b6a1fda1c874f5f519ec0f7687#44
type: Restriction
cardinality: 1
on property: theme

http://lodlaundromat.org/.well-known/genid/samples/pellet///predicate//bf34a4b6a1fda1c874f5f519ec0f7687/bf34a4b6a1fda1c874f5f519ec0f7687#48
type: Restriction
on property: result
cardinality: 1

Temporary Reproduction Right
type: Class
comment: To produce ephemeral reproductions required in order to facilitate some technological processes geared towards work usage, e.g. internet caches.
subclass of: Users Rights

Public Performance Right
type: Class
comment: It regulates Performances of works when they are made in public, i.e. before an audience.
subclass of: Economic Rights

Economic Rights
type: Class
subclass of: http://lodlaundromat.org/.well-known/genid/samples/pellet///predicate//bf34a4b6a1fda1c874f5f519ec0f7687/bf34a4b6a1fda1c874f5f519ec0f7687#96
subclass of: Copyright
subclass of: http://lodlaundromat.org/.well-known/genid/samples/pellet///predicate//bf34a4b6a1fda1c874f5f519ec0f7687/bf34a4b6a1fda1c874f5f519ec0f7687#97
comment: The economic rights are related to the productive and commercial aspects of copyright.
subclass of: http://lodlaundromat.org/.well-known/genid/samples/pellet///predicate//bf34a4b6a1fda1c874f5f519ec0f7687/bf34a4b6a1fda1c874f5f519ec0f7687#98
subclass of: http://lodlaundromat.org/.well-known/genid/samples/pellet///predicate//bf34a4b6a1fda1c874f5f519ec0f7687/bf34a4b6a1fda1c874f5f519ec0f7687#103
subclass of: http://lodlaundromat.org/.well-known/genid/samples/pellet///predicate//bf34a4b6a1fda1c874f5f519ec0f7687/bf34a4b6a1fda1c874f5f519ec0f7687#104
subclass of: http://lodlaundromat.org/.well-known/genid/samples/pellet///predicate//bf34a4b6a1fda1c874f5f519ec0f7687/bf34a4b6a1fda1c874f5f519ec0f7687#105

Instance
type: Class
subclass of: CreationObject
comment: A copy of a creation object produced for commersialisation, a product. International identification schemes for manifestations: EAN13 (European Article Number) or UPC (Universal Product Code). Examples: a CD of The Magic Flute or a DVD of Les Misérables.

Sound Recording Right
type: Class
subclass of: Fixation Right
subclass of: http://lodlaundromat.org/.well-known/genid/samples/pellet///predicate//bf34a4b6a1fda1c874f5f519ec0f7687/bf34a4b6a1fda1c874f5f519ec0f7687#49

Fixation Right
type: Class
comment: It regulates the materialisation of a Performance into an object that constitutes a Fixation. Common fixations are motion pictures and sound recordings, which are governed by the corresponding Sound Recording Right and Motion Picture Right.
subclass of: Economic Rights
subclass of: http://lodlaundromat.org/.well-known/genid/samples/pellet///predicate//bf34a4b6a1fda1c874f5f519ec0f7687/bf34a4b6a1fda1c874f5f519ec0f7687#53

Sound Recording
type: Class
subclass of: Recording

Process
type: Class
subclass of: Action

Lend
type: Class
comment: Distribute temporarily without a significant economic value exchange. There is a duration but there is not an economic transfer condition.
subclass of: http://lodlaundromat.org/.well-known/genid/samples/pellet///predicate//bf34a4b6a1fda1c874f5f519ec0f7687/bf34a4b6a1fda1c874f5f519ec0f7687#50
subclass of: Distribute
subclass of: http://lodlaundromat.org/.well-known/genid/samples/pellet///predicate//bf34a4b6a1fda1c874f5f519ec0f7687/bf34a4b6a1fda1c874f5f519ec0f7687#52

http://lodlaundromat.org/.well-known/genid/samples/pellet///predicate//bf34a4b6a1fda1c874f5f519ec0f7687/bf34a4b6a1fda1c874f5f519ec0f7687#52
type: Restriction
cardinality: 1
on property: duration

Quotation Right
type: Class
subclass of: Users Rights
comment: The making of quotations from a protected work, provided that the source is mentioned and that the extent of the quotation is compatible with fair practice.

Official Act Right
type: Class
subclass of: Users Rights
comment: To use for certain administrative, judicial or security proceedings and religious or official ceremonies.

http://lodlaundromat.org/.well-known/genid/samples/pellet///predicate//bf34a4b6a1fda1c874f5f519ec0f7687/bf34a4b6a1fda1c874f5f519ec0f7687#54
type: Restriction
min cardinality: 1
on property: agent

http://lodlaundromat.org/.well-known/genid/samples/pellet///predicate//bf34a4b6a1fda1c874f5f519ec0f7687/bf34a4b6a1fda1c874f5f519ec0f7687#55
type: Restriction
min cardinality: 1
on property: recipient

http://lodlaundromat.org/.well-known/genid/samples/pellet///predicate//bf34a4b6a1fda1c874f5f519ec0f7687/bf34a4b6a1fda1c874f5f519ec0f7687#58
type: Restriction
min cardinality: 1
on property: theme

Recording
type: Class
comment: The materialisation of a performance in a tangible of digital object. International identification schemes for manifestations: ISRC (International Standard Recording Code) for audio and video recordings or ISAN (International Standard Audiovisual Number) for audiovisual works. Examples: a sound recording of The Magic Flute opera or any motion picture of Les Misérables.
subclass of: CreationObject

Make Available
type: Class
subclass of: Making Available Right
subclass of: http://lodlaundromat.org/.well-known/genid/samples/pellet///predicate//bf34a4b6a1fda1c874f5f519ec0f7687/bf34a4b6a1fda1c874f5f519ec0f7687#61
disjoint with: Broadcast
subclass of: http://lodlaundromat.org/.well-known/genid/samples/pellet///predicate//bf34a4b6a1fda1c874f5f519ec0f7687/bf34a4b6a1fda1c874f5f519ec0f7687#62
comment: Traditionally communication actions related to the communication right were quite passive from the point of view of the communication consumer. The communicator decided when a concrete work was broadcasted and the consumers had just to the option to get or not access to the communication medium in order to consume the content. Consumers did not have any alternative to time-shift content consumption without the intervention of recording mediums. However, communication mediums that allow user interaction have appeared, among which the Internet is the more important one nowadays. The consequence is a particular kind of communication where members of the public access works from a place and at a time individually chosen by them. This kind of communication is called to MakeAvailable in the copyright context.
subclass of: Communicate

Making Available Right
type: Class
subclass of: Communication Right

Broadcast
type: Class
subclass of: http://lodlaundromat.org/.well-known/genid/samples/pellet///predicate//bf34a4b6a1fda1c874f5f519ec0f7687/bf34a4b6a1fda1c874f5f519ec0f7687#67
disjoint with: Make Available
subclass of: http://lodlaundromat.org/.well-known/genid/samples/pellet///predicate//bf34a4b6a1fda1c874f5f519ec0f7687/bf34a4b6a1fda1c874f5f519ec0f7687#68
subclass of: Broadcasting Right
subclass of: Communicate
comment: When a work is broadcasted, it is made available to a collective through a communication medium. There are two kinds of broadcasting depending on the communication medium. In the first one the medium is the air. A wireless signal is emitted into the air, which can be received by any person, within range of the signal, who possesses the equipment (radio or television receiver) necessary to convert the signal into sounds or sounds and images. In the second one the medium is a cable. A signal is diffused and only persons who possess the required equipment linked to the cables used to diffuse the signal can receive it.

Producers Rights
type: Class
comment: Producers have exclusive Reproduction Right over their fixations and exclusive Distribution Right over the resulting copies. As before, these rights will be in addition to the rights of copyright owners.
subclass of: Related Rights

Attend
type: Class
comment: This is the action corresponding to the consumption of a Perform in a PublicPlace. The theme is a Performance which result from a Perform that is held in the same PublicPlace. Therefore, there is a time sharing between the Attend and the corresponding Perform.
subclass of: Use
subclass of: http://lodlaundromat.org/.well-known/genid/samples/pellet///predicate//bf34a4b6a1fda1c874f5f519ec0f7687/bf34a4b6a1fda1c874f5f519ec0f7687#65
subclass of: http://lodlaundromat.org/.well-known/genid/samples/pellet///predicate//bf34a4b6a1fda1c874f5f519ec0f7687/bf34a4b6a1fda1c874f5f519ec0f7687#66

http://lodlaundromat.org/.well-known/genid/samples/pellet///predicate//bf34a4b6a1fda1c874f5f519ec0f7687/bf34a4b6a1fda1c874f5f519ec0f7687#66
type: Restriction
on property: theme
cardinality: 1

Reproduction Right
type: Class
comment: It regulates actions that produce replicas of a given object, i.e. Instances. Examples of reproduction are the mass production of CD copies from an audio recording master, to scan a book in order to produce a digitalisation of it or to download a digital file into the local hard disk.
subclass of: Economic Rights
subclass of: http://lodlaundromat.org/.well-known/genid/samples/pellet///predicate//bf34a4b6a1fda1c874f5f519ec0f7687/bf34a4b6a1fda1c874f5f519ec0f7687#69

Parody Right
type: Class
subclass of: Users Rights
comment: To use for parody and caricature.

Integrity Right
type: Class
comment: The right to object to any distortion, mutilation or other modification of, or other derogatory action in relation to, the work which would be prejudicial to the author's honour or reputation.
subclass of: Moral Rights

Dissemination Right
type: Class
comment: The right to disclose the work.
subclass of: Moral Rights

Give
type: Class
subclass of: Distribute
subclass of: http://lodlaundromat.org/.well-known/genid/samples/pellet///predicate//bf34a4b6a1fda1c874f5f519ec0f7687/bf34a4b6a1fda1c874f5f519ec0f7687#70
subclass of: http://lodlaundromat.org/.well-known/genid/samples/pellet///predicate//bf34a4b6a1fda1c874f5f519ec0f7687/bf34a4b6a1fda1c874f5f519ec0f7687#72
comment: The ownership of the corresponding physical support is transferred permanently, there is not a duration. Moreover, there is not an economic transfer condition as the ownership is transferred without any economic counterpart.

http://lodlaundromat.org/.well-known/genid/samples/pellet///predicate//bf34a4b6a1fda1c874f5f519ec0f7687/bf34a4b6a1fda1c874f5f519ec0f7687#72
type: Restriction
on property: duration
cardinality: 0

http://lodlaundromat.org/.well-known/genid/samples/pellet///predicate//bf34a4b6a1fda1c874f5f519ec0f7687/bf34a4b6a1fda1c874f5f519ec0f7687#78
type: Restriction
on property: theme
cardinality: 1

http://lodlaundromat.org/.well-known/genid/samples/pellet///predicate//bf34a4b6a1fda1c874f5f519ec0f7687/bf34a4b6a1fda1c874f5f519ec0f7687#79
type: Restriction
on property: recipient
min cardinality: 1

Person
type: Class
subclass of: Legal Person

Attribution Right
type: Class
comment: The right to claim authorship of the work.
subclass of: Moral Rights

http://lodlaundromat.org/.well-known/genid/samples/pellet///predicate//bf34a4b6a1fda1c874f5f519ec0f7687/bf34a4b6a1fda1c874f5f519ec0f7687#81
type: Restriction
cardinality: 1
on property: time

http://lodlaundromat.org/.well-known/genid/samples/pellet///predicate//bf34a4b6a1fda1c874f5f519ec0f7687/bf34a4b6a1fda1c874f5f519ec0f7687#83
type: Restriction
on property: location
cardinality: 1

http://lodlaundromat.org/.well-known/genid/samples/pellet///predicate//bf34a4b6a1fda1c874f5f519ec0f7687/bf34a4b6a1fda1c874f5f519ec0f7687#84
type: Restriction
cardinality: 1
on property: theme

http://lodlaundromat.org/.well-known/genid/samples/pellet///predicate//bf34a4b6a1fda1c874f5f519ec0f7687/bf34a4b6a1fda1c874f5f519ec0f7687#85
type: Restriction
on property: agent
min cardinality: 1

Organization
type: Class
subclass of: Legal Person
disjoint with: Person

Recorded Communication
type: Class
subclass of: http://lodlaundromat.org/.well-known/genid/samples/pellet///predicate//bf34a4b6a1fda1c874f5f519ec0f7687/bf34a4b6a1fda1c874f5f519ec0f7687#86
disjoint with: Live Communication
subclass of: Communication

is communication of
type: FunctionalProperty
domain: Communication
sub property of: creationModelProperty
inverse of: has communication
range: RecordingOrPerformance
type: ObjectProperty

Live Communication
type: Class
disjoint with: Recorded Communication
subclass of: http://lodlaundromat.org/.well-known/genid/samples/pellet///predicate//bf34a4b6a1fda1c874f5f519ec0f7687/bf34a4b6a1fda1c874f5f519ec0f7687#117
subclass of: Communication

Sell
type: Class
comment: The ownership of the corresponding physical support is transferred permanently, there is not a duration. However, there is a condition, an economic transfer on exchange of which the ownership is transferred.
subclass of: http://lodlaundromat.org/.well-known/genid/samples/pellet///predicate//bf34a4b6a1fda1c874f5f519ec0f7687/bf34a4b6a1fda1c874f5f519ec0f7687#89
subclass of: http://lodlaundromat.org/.well-known/genid/samples/pellet///predicate//bf34a4b6a1fda1c874f5f519ec0f7687/bf34a4b6a1fda1c874f5f519ec0f7687#90
subclass of: Distribute
comment: RULE: The right of distribution is usually subject to exhaustion upon first sale or other transfer of ownership of a particular copy. This means that, there are are not Distribute actions that have a previously distributed Instance as theme. (∀v:Sell)(∀i:Instance)(theme(v,i) → ¬(∃v':Sell)(theme(v',i)∧v≠v'))
subclass of: Ambient

http://lodlaundromat.org/.well-known/genid/samples/pellet///predicate//bf34a4b6a1fda1c874f5f519ec0f7687/bf34a4b6a1fda1c874f5f519ec0f7687#89
type: Restriction
on property: duration
cardinality: 0

http://lodlaundromat.org/.well-known/genid/samples/pellet///predicate//bf34a4b6a1fda1c874f5f519ec0f7687/bf34a4b6a1fda1c874f5f519ec0f7687#92
type: Restriction
on property: location
cardinality: 1

http://lodlaundromat.org/.well-known/genid/samples/pellet///predicate//bf34a4b6a1fda1c874f5f519ec0f7687/bf34a4b6a1fda1c874f5f519ec0f7687#93
type: Restriction
on property: time
cardinality: 1

http://lodlaundromat.org/.well-known/genid/samples/pellet///predicate//bf34a4b6a1fda1c874f5f519ec0f7687/bf34a4b6a1fda1c874f5f519ec0f7687#95
type: Restriction
min cardinality: 1
on property: agent

Private Copy Right
type: Class
subclass of: Users Rights
comment: To reproduce a work exclusively for the personal and private use of the person who makes the reproduction, e.g. a backup.

Broadcasters Rights
type: Class
subclass of: Related Rights
comment: Broadcasters have exclusive Broadcasting, Fixation and Reproduction Rights over their broadcasts. Here broadcasting of a broadcast is understood as re-broadcasting. Re-broadcasting is either simultaneous transmission of a broadcast of a program being received from another source or a new deferred broadcast of a formerly recorded program transmitted or received earlier. These rights must be considered in addition to the rights of copyright owners when applicable.

http://lodlaundromat.org/.well-known/genid/samples/pellet///predicate//bf34a4b6a1fda1c874f5f519ec0f7687/bf34a4b6a1fda1c874f5f519ec0f7687#97
type: Restriction
on property: location
cardinality: 1

http://lodlaundromat.org/.well-known/genid/samples/pellet///predicate//bf34a4b6a1fda1c874f5f519ec0f7687/bf34a4b6a1fda1c874f5f519ec0f7687#100
type: Restriction
on property: patient
cardinality: 1

patient
type: ObjectProperty
domain: http://lodlaundromat.org/.well-known/genid/samples/pellet///predicate//bf34a4b6a1fda1c874f5f519ec0f7687/bf34a4b6a1fda1c874f5f519ec0f7687#137
comment: An essential participant that undergoes some structural change as a result of the event. Example: The cat swallowed [the canary].

http://lodlaundromat.org/.well-known/genid/samples/pellet///predicate//bf34a4b6a1fda1c874f5f519ec0f7687/bf34a4b6a1fda1c874f5f519ec0f7687#102
type: Restriction
on property: theme
cardinality: 1

http://lodlaundromat.org/.well-known/genid/samples/pellet///predicate//bf34a4b6a1fda1c874f5f519ec0f7687/bf34a4b6a1fda1c874f5f519ec0f7687#105
type: Restriction
min cardinality: 1
on property: agent

Motion Picture Right
type: Class
subclass of: Fixation Right
subclass of: http://lodlaundromat.org/.well-known/genid/samples/pellet///predicate//bf34a4b6a1fda1c874f5f519ec0f7687/bf34a4b6a1fda1c874f5f519ec0f7687#106

Motion Picture
type: Class
subclass of: Recording

Record
type: Class
subclass of: http://lodlaundromat.org/.well-known/genid/samples/pellet///predicate//bf34a4b6a1fda1c874f5f519ec0f7687/bf34a4b6a1fda1c874f5f519ec0f7687#107
subclass of: http://lodlaundromat.org/.well-known/genid/samples/pellet///predicate//bf34a4b6a1fda1c874f5f519ec0f7687/bf34a4b6a1fda1c874f5f519ec0f7687#108
subclass of: http://lodlaundromat.org/.well-known/genid/samples/pellet///predicate//bf34a4b6a1fda1c874f5f519ec0f7687/bf34a4b6a1fda1c874f5f519ec0f7687#109
comment: Generically, a work is considered fixed when it is stored on some medium in which it can be perceived, reproduced, or otherwise communicated. For example, a song is considered fixed when it is written down on paper. The paper is the medium on which the song can be perceived, reproduced and communicated. It is not necessary that the medium be such that a human can perceive the work, as long as the work can be perceived by a machine. Thus, the song is also fixed the moment the author records it onto a cassette tape. Similarly, a computer program is fixed when stored on a computer hard drive. From the legal point of view, the fixations that are governed are those that store performances of works. The more important kinds of fixations are sound recordings and motion pictures. The theme of a Record is a Performance but it is not necessarily a public performance. For instance, it can be a studio performance, which is governed by copyright because this fixation is intended for commercial exploitation.
subclass of: Fixation Right
subclass of: http://lodlaundromat.org/.well-known/genid/samples/pellet///predicate//bf34a4b6a1fda1c874f5f519ec0f7687/bf34a4b6a1fda1c874f5f519ec0f7687#110
comment: RULE: (∀r:Record) ((∃!p:Performance)(∃!f:Fixation) (theme(r,p)∧result(r,f)) → isFixationOf(f,p))

http://lodlaundromat.org/.well-known/genid/samples/pellet///predicate//bf34a4b6a1fda1c874f5f519ec0f7687/bf34a4b6a1fda1c874f5f519ec0f7687#107
type: Restriction
on property: theme
cardinality: 1

http://lodlaundromat.org/.well-known/genid/samples/pellet///predicate//bf34a4b6a1fda1c874f5f519ec0f7687/bf34a4b6a1fda1c874f5f519ec0f7687#110
type: Restriction
on property: result
cardinality: 1

Perform
type: Class
comment: This corresponds to the action of public performance. To perform a work means to recite, render, play, dance, or act it, either directly or by means of any device or process or, in the case of a motion picture or other audiovisual work, to show its images in any sequence or to make the sounds accompanying it audible. It is important to note that the performance is considered public when it takes place at a place open to the public or at any place where a substantial number of persons outside of a normal circle of a family and its social acquaintances is involved. Therefore, it will not be considered public when it is performed in a strictly domestic domain.
comment: RULE: (∀p:Perform) ((∃!m:Manifestation)(∃!pe:Performance) (theme(p,m)∧result(p,pe)) → isPerformanceOf(pe,m))
subclass of: http://lodlaundromat.org/.well-known/genid/samples/pellet///predicate//bf34a4b6a1fda1c874f5f519ec0f7687/bf34a4b6a1fda1c874f5f519ec0f7687#111
subclass of: http://lodlaundromat.org/.well-known/genid/samples/pellet///predicate//bf34a4b6a1fda1c874f5f519ec0f7687/bf34a4b6a1fda1c874f5f519ec0f7687#112
subclass of: Public Performance Right
subclass of: http://lodlaundromat.org/.well-known/genid/samples/pellet///predicate//bf34a4b6a1fda1c874f5f519ec0f7687/bf34a4b6a1fda1c874f5f519ec0f7687#113
subclass of: http://lodlaundromat.org/.well-known/genid/samples/pellet///predicate//bf34a4b6a1fda1c874f5f519ec0f7687/bf34a4b6a1fda1c874f5f519ec0f7687#114
subclass of: http://lodlaundromat.org/.well-known/genid/samples/pellet///predicate//bf34a4b6a1fda1c874f5f519ec0f7687/bf34a4b6a1fda1c874f5f519ec0f7687#115
subclass of: http://lodlaundromat.org/.well-known/genid/samples/pellet///predicate//bf34a4b6a1fda1c874f5f519ec0f7687/bf34a4b6a1fda1c874f5f519ec0f7687#116

http://lodlaundromat.org/.well-known/genid/samples/pellet///predicate//bf34a4b6a1fda1c874f5f519ec0f7687/bf34a4b6a1fda1c874f5f519ec0f7687#111
type: Restriction
on property: time
cardinality: 1

http://lodlaundromat.org/.well-known/genid/samples/pellet///predicate//bf34a4b6a1fda1c874f5f519ec0f7687/bf34a4b6a1fda1c874f5f519ec0f7687#114
type: Restriction
cardinality: 1
on property: theme

http://lodlaundromat.org/.well-known/genid/samples/pellet///predicate//bf34a4b6a1fda1c874f5f519ec0f7687/bf34a4b6a1fda1c874f5f519ec0f7687#116
type: Restriction
on property: result
cardinality: 1

Performers Rights
type: Class
comment: Performers have exclusive Fixation, Communication, Reproduction, Public Performance and Distribution Rights over their performances. These rights, when the performance is of a copyrighted work, will be in addition to the rights of copyright owners with respect to the performance and subsequent exploitation of the performance.
subclass of: Related Rights

Offer
type: Class
subclass of: Ambient
comment: An event in which a party makes known the terms on which an agreement may be made.

Information Right
type: Class
comment: News incorporating other news and news incorporating other works.
subclass of: Users Rights

EditionContract
type: Class
subclass of: IPRAgreement

Copy
type: Class
comment: RULE: (∀c:Copy) ((∃!o:CreationObject)(∃!i:Instance) (theme(c,o)∧result(c,i)) → isInstanceOf(i,o))
subclass of: http://lodlaundromat.org/.well-known/genid/samples/pellet///predicate//bf34a4b6a1fda1c874f5f519ec0f7687/bf34a4b6a1fda1c874f5f519ec0f7687#119
subclass of: http://lodlaundromat.org/.well-known/genid/samples/pellet///predicate//bf34a4b6a1fda1c874f5f519ec0f7687/bf34a4b6a1fda1c874f5f519ec0f7687#120
subclass of: Reproduction Right
subclass of: http://lodlaundromat.org/.well-known/genid/samples/pellet///predicate//bf34a4b6a1fda1c874f5f519ec0f7687/bf34a4b6a1fda1c874f5f519ec0f7687#121
comment: This action is formally known as Reproduce. However, it is commonly referred to as Copy. Copies have been traditionally the basic medium for Work commercialisation. They are produced from a Manifestation, from a Fixation of a Performance or from another Instance. The result is an Instance that is the item employed for the physical commercialisation of works, i.e. when a physical item is used as the vehicle to make the Work arrive to its consumers.
subclass of: http://lodlaundromat.org/.well-known/genid/samples/pellet///predicate//bf34a4b6a1fda1c874f5f519ec0f7687/bf34a4b6a1fda1c874f5f519ec0f7687#122

http://lodlaundromat.org/.well-known/genid/samples/pellet///predicate//bf34a4b6a1fda1c874f5f519ec0f7687/bf34a4b6a1fda1c874f5f519ec0f7687#120
type: Restriction
on property: theme
cardinality: 1

http://lodlaundromat.org/.well-known/genid/samples/pellet///predicate//bf34a4b6a1fda1c874f5f519ec0f7687/bf34a4b6a1fda1c874f5f519ec0f7687#121
type: Restriction
cardinality: 1
on property: result

ProductionContract
type: Class
subclass of: IPRAgreement

experiencer
type: ObjectProperty
comment: An active animate goal of an experience. Example: [Yojo] sees the fish.
domain: Transfer

is improvisation of
type: ObjectProperty
domain: Improvisation
inverse of: has improvisation
range: Work
sub property of: creationModelProperty
type: FunctionalProperty

has improvisation
type: ObjectProperty
sub property of: creationModelProperty
domain: Work
range: Improvisation
inverse of: is improvisation of
type: InverseFunctionalProperty

destination
type: ObjectProperty
comment: A goal of a spatial process. Example: Bob went to [Danbury].
domain: Spatial

instrument
type: ObjectProperty
domain: http://lodlaundromat.org/.well-known/genid/samples/pellet///predicate//bf34a4b6a1fda1c874f5f519ec0f7687/bf34a4b6a1fda1c874f5f519ec0f7687#134
comment: A resource that is not changed by an event. Example: [The key] opened the door.

has part
type: ObjectProperty
inverse of: isPartOf
type: TransitiveProperty

is direct part of directly
type: ObjectProperty
inverse of: has direct part
sub property of: isPartOf

has direct part
type: ObjectProperty
sub property of: has part
inverse of: is direct part of directly

effector
type: ObjectProperty
domain: Action
comment: The involuntary initiator of an event. Example: [The tree] produced new leaves.

is instance of
type: ObjectProperty
inverse of: has instance
sub property of: creationModelProperty
domain: Instance
range: ManifestationOrRecording
type: FunctionalProperty

has instance
type: InverseFunctionalProperty
domain: ManifestationOrRecording
inverse of: is instance of
sub property of: creationModelProperty
range: Instance
type: ObjectProperty

completion
type: ObjectProperty
comment: The goal of a temporal process. Example: Mary waited until [noon].
domain: Temporal

reason
type: ObjectProperty
domain: Ambient
comment: The initial cause of an event. Example: The airplane fell due to [a malfunction].

consequence
type: ObjectProperty
comment: The involuntary goal of an action. Example: The player missed [to hit the ball].
domain: Ambient

path
type: ObjectProperty
comment: A spatial resource. Example: The pizza was shipped via [Albany and Buffalo].
domain: Spatial

has recording
type: ObjectProperty
range: Recording
inverse of: is recording of
sub property of: creationModelProperty
domain: CreationProcess
type: InverseFunctionalProperty

is recording of
type: FunctionalProperty
inverse of: has recording
domain: Recording
range: CreationProcess
sub property of: creationModelProperty
type: ObjectProperty

has performance
type: ObjectProperty
range: Performance
inverse of: is performance of
domain: Manifestation
type: InverseFunctionalProperty

is performance of
type: FunctionalProperty
inverse of: has performance
range: Manifestation
domain: Performance
sub property of: creationModelProperty
type: ObjectProperty

matter
type: ObjectProperty
domain: Process
comment: A resource that is changed by the event. Example: The gun was carved out of [soap].

count
type: DatatypeProperty
range: integer
domain: Action
comment: The maximum number of instances that a class modelling a licensing pattern might have.

is exclusive
type: DatatypeProperty
range: boolean
domain: Action

share percentage
type: DatatypeProperty
domain: Action
range: integer

has derivation
type: TransitiveProperty
sub property of: creationModelProperty
domain: Work
inverse of: is derivation of
range: Work
type: ObjectProperty

is derivation of
type: TransitiveProperty
domain: Work
sub property of: creationModelProperty
range: Work
inverse of: has derivation
type: ObjectProperty

has communication
type: InverseFunctionalProperty
range: Communication
inverse of: is communication of
domain: RecordingOrPerformance
sub property of: creationModelProperty
type: ObjectProperty

is manifestation of
type: FunctionalProperty
domain: Manifestation
inverse of: has manifestation
range: Work
sub property of: creationModelProperty
type: ObjectProperty

has manifestation
type: InverseFunctionalProperty
range: Manifestation
inverse of: is manifestation of
domain: Work
sub property of: creationModelProperty
type: ObjectProperty

non-commercial
type: Aim

parody
type: Aim

education
type: Aim

information
type: Aim

legal
type: Aim

private
type: Aim

research
type: Aim