Ontología de Turismo para el Ayuntamiento de Zaragoza
type: Ontology
comment: Esta ontología se ha construido dentro del proyecto financiado por el Ayuntamiento de Zaragoza: "Un visitante, una ruta", una aplicación informática para el cálculo de rutas turísticas en la ciudad de Zaragoza en base al perfil y contexto del usuario.
creator: Departamento I+D+i (Fundación CTIC)
version info: turismo.owl, v.1.0

Perfil de turista
type: Class
comment: El perfil de turista es el conjunto de rasgos particulares que caracterizan a un turista en particular para el cual se va a calcular la ruta. El perfil de turista contempla desde los días de visita a la ciudad de Zaragoza (único dato obligatorio), el tipo de viaje, si es un viaje en grupo, los intereses y las preferencias turísticas del perfil.
subclass of: Restriction
  some values from: Preferencia de usuario
  on property: Tiene interés
subclass of: Restriction
  on property: performs
  some values from: Viaje
subclass of: Restriction
  some values from: Día de visita turística
  on property: e-temporal location
subclass of: Restriction
  some values from: Grupo de viaje
  on property: covers
subclass of: Rol social

Preferencia de usuario
type: Class
subclass of: Curso de eventos
comment: Actividades que el turista puede estar interesado en realizar como visitar museos, pasear, ir de compras, etc.

Tiene interés
type: ObjectProperty
range: Preferencia de usuario
domain: Perfil de turista

performs
type: ObjectProperty
domain: Perfil de turista
range: Viaje

Viaje
type: Class
comment: Un viaje a la ciudad de Zaragoza puede realizarse por distintos motivos. En esta ontología, se contamplan cuatro posibilidades: puramente turísticos, por motivos laborales, asistencia a un congreso o conferencia y por descanso.
subclass of: Actividad

Día de visita turística
type: Class
disjoint with: Día de la semana
subclass of: Región temporal
disjoint with: Temporada
disjoint with: Intervalo temporal
subclass of: Restriction
  some values from: Temporada
  on property: part of
comment: Cada uno de los días de visita turística por la ciudad de Zaragoza que escoge el turista. Para cada uno de estos días, el sistema construirá una ruta específica atendiendo a su perfil y a la disponibilidad de los recursos de la ciudad.
disjoint with: Día festivo
subclass of: Restriction
  on property: part of
  all values from: Temporada

e-temporal location
type: ObjectProperty
domain: Perfil de turista
range: Día de visita turística

Grupo de viaje
type: Class
subclass of: Colectivo social
comment: Colectivo de personas que realizan una visita turística a la ciudad de Zaragoza, y para los que el sistema calculará una ruta contextualizada.

covers
type: ObjectProperty
range: Grupo de viaje
domain: Perfil de turista

Rol social
type: Class
disjoint with: Evento
disjoint with: Colectivo social
comment: Papel o rol que desempeña un individuo en determinadas circunstancias o situaciones sociales: La profesión, turista, conductor o preso son ejemplos de diferentes roles.
disjoint with: Curso de eventos
disjoint with: Región temporal
disjoint with: Recurso geográfico
disjoint with: Cualidad
disjoint with: Realización de Plan

Mercado
type: Class
comment: Sitio público destinado a vender o comprar productos. Los mercados se ofrecen como sugerencias a la ruta en base al perfil del turista y sólo se ofrecen en los días señalados.
subclass of: Recurso comercial

Recurso comercial
type: Class
comment: Recurso de interés comercial que ofrece la ciudad de Zaragoza. La información tanto de los mercados como de los sectores se ha extraído directamente de la página web municipal del Ayuntamiento. Los recursos comerciales se muestran como sugerencias en la ruta, y siempre bajo demanda del usuario (selección de la casilla "Me gusta ir de compras").
subclass of: Recurso de Zaragoza

Colectivo social
type: Class
disjoint with: Recurso geográfico
comment: Los colectivos sociales son colectivos tipificados que son representados por roles del mundo social. Suelen basarse en accciones (prácticas más que planes). Se pueden dividir en geográficos, de vecinaje, étnicos, lingüísticos, comerciales, industriales, científicos, políticos, religiosos, institucionales, administrativos, profesionales, deportivos, basados en interés, estilísticos, devocionales,etc.
disjoint with: Región temporal
disjoint with: Cualidad
disjoint with: Curso de eventos
disjoint with: Realización de Plan
disjoint with: Evento
disjoint with: Rol social

Interés turístico
type: Class
comment: El interés turístico es el grado de relevancia que tiene un recurso de la ciudad de Zaragoza para un determinado perfil de turista. Por ejemplo, si a un turista le gusta el arte barroco, el turista tendrá interés en el arte barroco y, por tanto, en cualquier monumento que se englobe dentro de este estilo. Los intereses de los perfiles se calculan a partir de las preferencias declaradas por el usuario y utilizando las reglas de negocio.
subclass of: Cualidad

Cualidad
type: Class
disjoint with: Curso de eventos
disjoint with: Evento
disjoint with: Recurso geográfico
disjoint with: Colectivo social
comment: Las "qualities" se consideran entidades básicas que se pueden percibir: los colores, sonidos, olores, formas, etc., así como entidades que se pueden medir: pesos, longitudes, pesos, tamaños, etc. Las "qualities" a veces se usan como sinónimo de "properties", aunque no es el caso de esta ontología. Las "qualities" son inherentes a las entidades y las entidades tienen ciertas "qualities". Por ejemplo, un recurso artístico tiene un determinado estilo artístico, donde el estilo es una "quality" del recurso en cuestión.
disjoint with: Región temporal
disjoint with: Rol social
disjoint with: Realización de Plan

Actividad
type: Class
comment: Una actividad es un conjunto de acciones o tareas realizadas por una persona o entidad.

Ruta turística
type: Class
subclass of: Restriction
  some values from: Visita turística
  on property: setting for
subclass of: Restriction
  some values from: Perfil de turista
  on property: expected setting for
subclass of: Realización de Plan
comment: Es el itinerario calculado dinámicamente por el sistema. Para cada día de estancia del turista se confecciona una ruta específica que consiste en una serie de visitas a determinados recursos turísticos de la ciudad de Zaragoza. La ruta se adapta además a las características del perfil del usuario como las preferencias, las limitaciones de movilidad, el alojamiento, los horarios de visitas de los monumentos, etc. El sistema no sólo genera un itinerario en el tiempo y espacio correspondientes, sino que además proporciona una serie de sugerencias para el turista que complementan su visita a la ciudad: eventos de interés, restaurantes cercanos y sectores comerciales.

Zona verde
type: Class
comment: Espacio verde en la ciudad de Zaragoza como puede ser parques, zonas ajardinadas, etc.
subclass of: Recurso turístico

Recurso turístico
type: Class
subclass of: Restriction
  all values from: Class
    union of: Accesibilidad de movilidad reducida
    union of: Estilo artístico
  on property: has quality
subclass of: Recurso de Zaragoza
comment: Recurso de interés turístico que ofrece la ciudad de Zaragoza.

Visita turística
type: Class
subclass of: Restriction
  on property: precedes
  all values from: Visita turística
subclass of: Restriction
  on property: happens at
  some values from: Día de visita turística
subclass of: Class
  union of: Restriction
    on property: follows
    some values from: Visita turística
  union of: Restriction
    on property: precedes
    some values from: Visita turística
subclass of: Actividad
subclass of: Restriction
  some values from: Ruta turística
  on property: setting
subclass of: Restriction
  all values from: Evento de Zaragoza
  on property: temporally coincides
comment: Una visita turística es cada una de las partes de las que se compone una ruta turística. Una visita turística tiene como objetivo uno y sólo un recurso de Zaragoza que forma parte del itinerario de la ruta. Las visitas turísticas están ordenadas temporalmente y el sistema procura minimizar la distancia entre unas y otras de acuerdo a las características del perfil.
subclass of: Restriction
  on property: target
  some values from: Recurso de Zaragoza
subclass of: Restriction
  on property: target
  cardinality: 1
subclass of: Restriction
  all values from: Visita turística
  on property: follows

Evento
type: Class
disjoint with: Curso de eventos
disjoint with: Realización de Plan
comment: Un evento es un suceso importante y programado, de índole social, académica, artística o deportiva.
disjoint with: Rol social
disjoint with: Recurso geográfico
disjoint with: Colectivo social
disjoint with: Región temporal
disjoint with: Cualidad

Evento de Zaragoza
type: Class
subclass of: Restriction
  all values from: Recurso de Zaragoza
  on property: participant place
subclass of: Evento
comment: Esta clase conceptualiza la Agenda de actividades de la ciudad de Zaragoza. Cada uno de los eventos de la Agenda son instancias de este concepto. Los eventos se utilizan como sugerencias complementarias a la ruta definida por el sistema.

Recurso de Zaragoza
type: Class
subclass of: Restriction
  on property: present at
  all values from: Horario de visita
subclass of: Recurso geográfico
comment: Recursos de interés comercial, turístico o de hostelería, que ofrece la ciudad de Zaragoza.

participant place
type: ObjectProperty
domain: Evento de Zaragoza
range: Recurso de Zaragoza

Fortaleza
type: Class
subclass of: Monumento
comment: Construcción fortificada como murallas o torreones de defensa.

Monumento
type: Class
comment: Construcción que posee valor artístico, arqueológico, histórico, etc. Las bases de datos de Monumentos y el Catálogo de Edificios de la Ciudad de Zaragoza se han mapeado a este concepto. Se ha subclasificado este concepto para conseguir una organización más rica de los monumentos. Esta información es usada por el sistema para configurar la ruta de manera más acorde a las preferencias del usuario mediante las reglas de negocio. Por ejemplo, si el usuario viaja con niños, el sistema por defecto no le ofrecerá museos en la ruta.
subclass of: Restriction
  on property: has quality
  some values from: Estilo artístico
subclass of: Recurso turístico

Recurso geográfico
type: Class
comment: Recurso físico con entidad propia cuya localización espacial se expresa en coordenadas geográficas.
disjoint with: Cualidad
disjoint with: Realización de Plan
disjoint with: Colectivo social
disjoint with: Región temporal
disjoint with: Evento
disjoint with: Rol social
disjoint with: Curso de eventos

Realización de Plan
type: Class
comment: Las realizaciones de planes son aquellas situaciones en las que un plan se satisface completamente.
disjoint with: Cualidad
disjoint with: Colectivo social
disjoint with: Evento
disjoint with: Curso de eventos
disjoint with: Rol social
disjoint with: Región temporal
disjoint with: Recurso geográfico

Región temporal
type: Class
disjoint with: Recurso geográfico
disjoint with: Rol social
disjoint with: Cualidad
disjoint with: Curso de eventos
comment: Una región temporal que puede tener diferente duración. Asume métricas temporales.
disjoint with: Colectivo social
disjoint with: Realización de Plan
disjoint with: Evento

Curso de eventos
type: Class
disjoint with: Realización de Plan
comment: Se trata de un concepto que clasifica (más concretamente "secuencia") los "perdurants" (procesos, eventos, estados) como un componente de alguna descripción. Los "courses" son homólogos de los "perdurants". En esta ontología, las preferencias de los turistas serán consideradas "courses" ya que secuencian actividades genéricas que los turística podrían estar interesados en realizar.
disjoint with: Cualidad
disjoint with: Evento
disjoint with: Rol social
disjoint with: Colectivo social
disjoint with: Región temporal
disjoint with: Recurso geográfico

Edificio religioso
type: Class
comment: Edificio de carácter religioso, como pueden ser iglesias, conventos, catedrales, etc.
subclass of: Monumento

has quality
type: ObjectProperty
domain: Class
range: Cualidad

Estilo artístico
type: Class
subclass of: Cualidad
disjoint with: Accesibilidad de movilidad reducida
comment: El estilo es el conjunto de características que individualizan la tendencia artística de una época: barroco, mudéjar, renacentista, etc. La descripción de los estilos de cada monumento se ha extraído de la base de datos de Monumentos.

Escultura
type: Class
comment: Fuentes y estatuas
subclass of: Monumento

Palacio
type: Class
comment: Edificio de gran transcendencia artística y de relevancia social ya que nacen como lugar de residencia de personajes importanes: palacio ducal, arzobispal.
subclass of: Monumento

Recurso hostelero
type: Class
comment: Recurso de interés hostelero que ofrece la ciudad de Zaragoza. Las bases de datos de restaurantes y alojamientos se han mapeado a sus subclases.
subclass of: Recurso de Zaragoza

Sector comercial
type: Class
comment: Un sector es un conjunto de negocios que se engloban en un área diferenciada de la ciudad de Zaragoza.
subclass of: Recurso comercial

precedes
type: ObjectProperty
range: Visita turística
domain: Visita turística
inverse of: follows

happens at
type: ObjectProperty
range: Día de visita turística
domain: Visita turística

follows
type: ObjectProperty
domain: Visita turística
range: Visita turística
inverse of: precedes

setting
type: ObjectProperty
inverse of: setting for
domain: Visita turística
range: Ruta turística

temporally coincides
type: SymmetricProperty
type: ObjectProperty
domain: Class
range: Class

target
type: ObjectProperty
domain: Visita turística
range: Recurso de Zaragoza

present at
type: ObjectProperty
range: Horario de visita
domain: Recurso de Zaragoza

Horario de visita
type: Class
comment: Horarios de visita de los recursos turísticos: museos, edificios, iglesias, etc. Para construir el horario de visita, se utiliza el horario de apertura y cierre del recurso, el día de la semana y la temporada.
subclass of: Restriction
  all values from: Temporada
  on property: r-location
subclass of: Restriction
  all values from: Class
    union of: Día festivo
    union of: Día de la semana
  on property: part of
subclass of: Intervalo temporal

Intervalo temporal
type: Class
disjoint with: Temporada
disjoint with: Día de visita turística
disjoint with: Día de la semana
disjoint with: Día festivo
comment: Intervalo de tiempo con un inicio y final bien delimitado en una región temporal.
subclass of: Región temporal

Temporada
type: Class
disjoint with: Intervalo temporal
disjoint with: Día de visita turística
disjoint with: Día de la semana
disjoint with: Día festivo
subclass of: Región temporal
comment: Espacio temporal de varios meses. A nivel turístico, el año se divide en temporada de verano y temporada de invierno. La temporada influye en los horarios de apertura y cierre de los recursos turísticos: museos, iglesias, etc. El mismo monumento, pongamos por caso, la Basílica del Pilar, no tiene el mismo horario de visita en la temporada de invierno, que en la temporada de verano. En esta ontología, se siguen los siguientes criterios: 1) Temporada de invierno: desde el 9 de octubre hasta el 30 de abril; 2) Temporada de verano: desde el 1 de mayo hasta el 8 de octubre.

Día de la semana
type: Class
comment: Cada uno de los días de la semana
disjoint with: Intervalo temporal
disjoint with: Temporada
disjoint with: Día de visita turística
disjoint with: Día festivo
subclass of: Región temporal

Día festivo
type: Class
disjoint with: Intervalo temporal
disjoint with: Temporada
disjoint with: Día de visita turística
disjoint with: Día de la semana
subclass of: Región temporal
comment: Día no laborable relacionado con alguna fiesta local o nacional: Fiesta del Pilar, Navidad, etc. Estos días requieren un tratamiento independiente ya que los recursos turísticos tienen estos días un horario especial.

Accesibilidad de movilidad reducida
type: Class
disjoint with: Estilo artístico
comment: La accesibilidad es el grado con el que algo puede ser usado, visitado o accedido por todas las personas, independientemente de sus capacidades técnicas o físicas. En el caso de personas con movilidad reducida (que implique el uso de ayudas técnicas como muletas, sillas de ruedas, etc.), el grado de accesibilidad se mide de acuerdo a la facilidad de desplazamiento de los turistas por el entorno de los distintos recursos de la ciudad. La descripción del grado de accesibilidad de cada monumento se ha extraído de la base de datos de Monumentos.
subclass of: Cualidad

setting for
type: ObjectProperty
inverse of: setting
domain: Ruta turística
range: Visita turística

expected setting for
type: FunctionalProperty
range: Perfil de turista
type: ObjectProperty
domain: Ruta turística

Preferencia de ruta
type: Class
subclass of: Preferencia de usuario
comment: Una preferencia de ruta es una constricción contextual para el cálculo dinámico de la ruta. Los perfiles de turista pueden requerir configuraciones particulares de los parámetros que afectan a la confección de la ruta, por ejemplo, que la velocidad de desplazamiento se vea afectada por características de movilidad de los turistas. Las preferencias de ruta para cada perfil se calculan mediante las reglas de negocio: duración de la visita y velocidad de desplazamiento.

Restaurante
type: Class
comment: Establecimiento público donde se sirven comidas. Los restaurantes se sugieren al usuario a la hora de la comida y de la cena. Se sugieren 5 restaurantes por cada slot de tiempo utilizando dos criterios: proximidad con el último POI de la ruta turística y calificación gastronómica.
subclass of: Restriction
  on property: has quality
  some values from: Calificación
subclass of: Recurso hostelero

Calificación
type: Class
comment: Calificación oficial proporcionada por el Patronato de Turismo para los distintos restaurantes de la ciudad de Zaragoza.
subclass of: Cualidad

Entorno natural
type: Class
comment: Zona de verde de excepcional singularidad debido a su paisaje, protección medioambiental e interés turístico.
subclass of: Zona verde

part of
type: ObjectProperty
domain: Región temporal
inverse of: part
range: Región temporal

r-location
type: ObjectProperty
domain: Horario de visita
comment: Es una relación para representar una "región abstracta" dentro de otra "región". Se puede utilizar para la composición de regiones. En cualquier caso, aquí la idea que se sugiere es que un horario de visita se localiza dentro de una parte del día (slots por ruta).
range: Temporada

Museo
type: Class
subclass of: Monumento
comment: Lugar de Zaragoza en que se exponen colecciones de objetos artísticos de distinto estilo y época: romana, mudéjar, etc.

Edificio histórico
type: Class
subclass of: Monumento
comment: Edificio de carácter histórico con interés cultural o arquitectónico.

Alojamiento
type: Class
subclass of: Recurso hostelero
comment: Establecimiento de hostelería en Zaragoza en el que se proporciona alojamiento. La elección de un alojamiento determinado modifica el lugar de inicio de la ruta, tomando como punto de partida el alojamiento en el que se hospeda el usuario.

No tiene preferencia
type: ObjectProperty
range: Preferencia de usuario
domain: Perfil de turista
comment: Representa el valor negativo de la propiedad "desire-towards". Indica las actividades que el turista no quiere realizar. Esta propiedad, como "desire-towards" servirán de entrada para el cálculo de los intereses de los perfiles de turista en las reglas de negocio de turismo de la aplicación.

part
type: ObjectProperty
domain: Región temporal
range: Región temporal
inverse of: part of

Tiene interés en determinados recursos
type: ObjectProperty
domain: Perfil de turista
range: Recurso de Zaragoza
comment: Indica los recursos que el usuario quiere que figuren obligatoriamente en la ruta propuesta por el sistema

No tiene interés en determinados recursos
type: ObjectProperty
comment: Indica los recursos que el usuario no quiere que figuren en la ruta propuesta por el sistema
range: Recurso de Zaragoza
domain: Perfil de turista

Tiene interés
type: ObjectProperty
sub property of: has quality
comment: Esta relación entre recursos e intereses se obtiene a partir de un conjunto de reglas de negocio de turismo. Estas reglas permiten inferir a partir de las preferencias de los usuarios (edns:desire-towards, cúales son sus intereses turísticos. Lo mismo ocurre en el caso de los puntos de interés de la ciudad. Se deduce cuál es el interés potencial que tiene cada recurso para un turista. A partir de la descripción de los intereses de los perfiles y recursos, se calcula la relevancia o importancia subjetiva de cada recurso para un determinado perfil ("matchmaking").
range: Interés turístico

No tiene interés
type: ObjectProperty
domain: Class
range: Interés turístico
comment: Representa el valor negativo de la propiedad "has-interest".

refines
type: ObjectProperty
domain: Class
range: Class

Horario de cierre
type: DatatypeProperty
domain: Horario de visita
range: time
comment: Hora de cierre del horario de visita de un punto de interés. Por ejemplo, de un museo o de una iglesia.

Relevancia de las preferencias de ruta
type: DatatypeProperty
domain: Preferencia de ruta
comment: Representa el valor de cada una de las preferencias de ruta. Estas preferencias actúan como restricciones para el planificador. Los valores de estos recursos modifican los parámetros iniciales del sistema de planificador.
range: float

Día inicial
type: DatatypeProperty
domain: Evento de Zaragoza
comment: Día de inicio de un determinado evento de Zaragoza. Por ejemplo, un musical o una exposición. En el caso de eventos puntuales, tanto el día de inicio como el final será el mismo.
range: date

Día final
type: DatatypeProperty
range: date
comment: Día de finalización de un determinado evento en la ciudad de Zaragoza.
domain: Evento de Zaragoza

Fecha de inicio
type: DatatypeProperty
range: date
domain: Temporada
comment: Día de inicio de cada temporada del año. Se distinguen las temporadas de invierno y de verano. Es importante para los horarios de los monumentos.

Relevancia de los intereses turísticos
type: DatatypeProperty
domain: Interés turístico
comment: Indica el grado de interés objetivo de una determinada preferencia. Por ejemplo, cuál es la relevancia del gusto por la arquitectura o la preferencia por ir de compras.
range: float

Horario de apertura
type: DatatypeProperty
domain: Horario de visita
comment: Hora de apertura del horario de visita de un punto de interés de la ciudad.
range: time

Fecha de finalización
type: DatatypeProperty
comment: Día de finalización de las temporadas del año. Se contemplan temporada de verano y temporada de invierno.
domain: Temporada
range: date

Duración de la visita
type: DatatypeProperty
comment: Tiempo estimado de duración de las visitas a los distintos monumentos y puntos de interés de la ciudad de Zaragoza. Se utiliza para el cálculo de la ruta.
range: int
domain: Recurso turístico

Relevancia de los Puntos de Interés
type: FunctionalProperty
domain: Recurso turístico
type: DatatypeProperty
comment: Es la relevancia o importancia objetiva de cada uno de los puntos de interés de la ciudad de Zaragoza.
range: DataRange
  one of: 25
  one of: 50
  one of: 75

Fecha
type: FunctionalProperty
range: date
comment: Indica la fecha de cada uno de los días de visita que el turista va a estar en Zaragoza. También se aplica a Días Festivos.
domain: Class
  union of: Día festivo
  union of: Día de visita turística
type: DatatypeProperty

Tiempo de visita corto
type: Preferencia de ruta
label: Tempo di visita breve @it
label: Tempo de visita breve @pt
label: Short time of visit @en
label: Durée breve de visite @fr
Relevancia de las preferencias de ruta: 0.5

Dia-de-visita-turistica 7
type: Día de visita turística
Fecha: 2007-04-07

Dia-de-visita-turistica 6
type: Día de visita turística
Fecha: 2007-04-06

Lunes
type: Día de la semana
different from: Miércoles
part: Horario-de-visita 11
different from: Sábado
different from: Martes
different from: Jueves
different from: Viernes
different from: Domingo
part: Horario-de-visita 7

Miércoles
type: Día de la semana
different from: Viernes
different from: Jueves
different from: Lunes
different from: Domingo
different from: Sábado
part: Horario-de-visita 7
part: Horario-de-visita 11
different from: Martes

Viernes
type: Día de la semana
different from: Jueves
different from: Martes
different from: Sábado
part: Horario-de-visita 7
different from: Lunes
different from: Domingo
part: Horario-de-visita 11
different from: Miércoles

Jueves
type: Día de la semana
part: Horario-de-visita 11
different from: Viernes
different from: Sábado
different from: Miércoles
different from: Martes
different from: Lunes
different from: Domingo

Horario-de-visita 11
type: Horario de visita
Horario de cierre: 15:38:42
part of: Martes
r-location: Temporada-de-verano
part of: Viernes
part of: Sábado
part of: Lunes
part of: Domingo
Horario de apertura: 19:38:45
part of: Jueves
part of: Miércoles

Martes
type: Día de la semana
different from: Jueves
different from: Miércoles
different from: Lunes
different from: Domingo
part: Horario-de-visita 7
part: Horario-de-visita 11
different from: Sábado
different from: Viernes

Domingo
type: Día de la semana
different from: Viernes
different from: Sábado
different from: Miércoles
different from: Martes
different from: Lunes
different from: Jueves
part: Horario-de-visita 11

Sábado
type: Día de la semana
different from: Jueves
different from: Domingo
different from: Martes
part: Horario-de-visita 11
different from: Lunes
different from: Miércoles
different from: Viernes
part: Horario-de-visita 7

Horario-de-visita 7
type: Horario de visita
r-location: Temporada-de-invierno
part of: Lunes
part of: Sábado
Horario de cierre: 13:30:00
Horario de apertura: 09:30:00
part of: Martes
part of: Viernes
part of: Miércoles

Temporada-de-invierno
type: Temporada
Fecha de finalización: 2007-04-30
Fecha de inicio: 2007-10-09

Temporada-de-verano
type: Temporada
Fecha de inicio: 2007-05-01
Fecha de finalización: 2007-10-08

Interés en estilo gótico
type: Interés turístico
label: Intérêt pour le style gothique @fr
different from: Interés en arte de la ciudad
different from: Interés en conocer la EXPO 2008
label: Interesse pelo estilo gótico @pt
different from: Interés en estilo renacentista
different from: Interés en estilo contemporáneo
different from: Interés en estilo neoclásico
label: Interesse per lo stile gotico @it
different from: Interés en zonas verdes (parques, jardines, etc.)
different from: Interés en estilo modernista
different from: Interés en estilo barroco
different from: Interés en arquitectura urbana
different from: Interés en monumentos con medidas de accesibilidad
different from: Interés en estilo romano
Relevancia de los intereses turísticos: 0.6
different from: Interés en espacios y entornos naturales
different from: Interés en ir de compras
label: Interest in gothic style @en
different from: Interés en estilo mudéjar

Interés en arte de la ciudad
type: Interés turístico
label: Interesse pela arte @pt
different from: Interés en arquitectura urbana
different from: Interés en estilo mudéjar
different from: Interés en monumentos con medidas de accesibilidad
label: Interesse per l'arte @it
label: Interest in art @en
different from: Interés en zonas verdes (parques, jardines, etc.)
different from: Interés en espacios y entornos naturales
different from: Interés en conocer la EXPO 2008
different from: Interés en estilo modernista
different from: Interés en estilo contemporáneo
different from: Interés en estilo renacentista
different from: Interés en estilo gótico
different from: Interés en estilo neoclásico
different from: Interés en estilo romano
different from: Interés en ir de compras
Relevancia de los intereses turísticos: 0.6
different from: Interés en estilo barroco
label: Intérêt pour l'art @fr

Interés en arquitectura urbana
type: Interés turístico
different from: Interés en estilo contemporáneo
label: Interest in architecture @en
label: Intérêt pour l'architecture @fr
different from: Interés en arte de la ciudad
different from: Interés en ir de compras
label: Interesse per l'architettura @it
different from: Interés en monumentos con medidas de accesibilidad
different from: Interés en zonas verdes (parques, jardines, etc.)
different from: Interés en estilo gótico
different from: Interés en conocer la EXPO 2008
label: Interesse pela arquitectura @pt
different from: Interés en estilo renacentista
different from: Interés en estilo modernista
different from: Interés en estilo neoclásico
different from: Interés en estilo romano
different from: Interés en espacios y entornos naturales
different from: Interés en estilo mudéjar
different from: Interés en estilo barroco
Relevancia de los intereses turísticos: 0.6

Interés en estilo contemporáneo
type: Interés turístico
different from: Interés en estilo modernista
Relevancia de los intereses turísticos: 0.6
different from: Interés en ir de compras
different from: Interés en estilo neoclásico
different from: Interés en estilo renacentista
different from: Interés en zonas verdes (parques, jardines, etc.)
different from: Interés en arquitectura urbana
different from: Interés en arte de la ciudad
different from: Interés en espacios y entornos naturales
label: Interesse per lo stile contemporaneo @it
different from: Interés en conocer la EXPO 2008
different from: Interés en estilo gótico
label: Intérêt pour le style contemporain @fr
different from: Interés en monumentos con medidas de accesibilidad
different from: Interés en estilo romano
label: Interesse pelo estilo contemporâneo @pt
label: Interest in contemporary style @en
different from: Interés en estilo mudéjar
different from: Interés en estilo barroco

Interés en estilo modernista
type: Interés turístico
label: Interest in modernistic style @en
different from: Interés en arquitectura urbana
label: Intérêt pour le style moderniste @fr
different from: Interés en estilo gótico
different from: Interés en conocer la EXPO 2008
Relevancia de los intereses turísticos: 0.6
label: Interesse per lo stile modernista @it
different from: Interés en espacios y entornos naturales
label: Interesse pelo estilo modernista @pt
different from: Interés en estilo renacentista
different from: Interés en estilo romano
different from: Interés en monumentos con medidas de accesibilidad
different from: Interés en estilo neoclásico
different from: Interés en estilo barroco
different from: Interés en zonas verdes (parques, jardines, etc.)
different from: Interés en estilo contemporáneo
different from: Interés en arte de la ciudad
different from: Interés en ir de compras
different from: Interés en estilo mudéjar

Interés en conocer la EXPO 2008
type: Interés turístico
Relevancia de los intereses turísticos: 1.0
different from: Interés en ir de compras
label: Interest in EXPO 2008 @en
label: Interesse per l'EXPO 2008 @it
different from: Interés en arte de la ciudad
different from: Interés en estilo gótico
different from: Interés en estilo romano
different from: Interés en estilo contemporáneo
different from: Interés en arquitectura urbana
different from: Interés en estilo renacentista
different from: Interés en estilo modernista
different from: Interés en estilo barroco
label: Interesse pela EXPO 2008 @pt
label: Intérêt pour l'EXPO 2008 @fr
different from: Interés en monumentos con medidas de accesibilidad
different from: Interés en estilo mudéjar
different from: Interés en zonas verdes (parques, jardines, etc.)
different from: Interés en estilo neoclásico
different from: Interés en espacios y entornos naturales

Interés en ir de compras
type: Interés turístico
different from: Interés en estilo gótico
different from: Interés en estilo renacentista
different from: Interés en zonas verdes (parques, jardines, etc.)
different from: Interés en monumentos con medidas de accesibilidad
different from: Interés en estilo neoclásico
different from: Interés en espacios y entornos naturales
label: Interesse pelas compras e por ver vitrines @pt
label: Interest in shopping @en
different from: Interés en arquitectura urbana
different from: Interés en conocer la EXPO 2008
different from: Interés en estilo romano
different from: Interés en arte de la ciudad
different from: Interés en estilo barroco
different from: Interés en estilo contemporáneo
label: Interesse per i acquisti e per guardare le vetrine dei negozi @it
Relevancia de los intereses turísticos: 1.0
different from: Interés en estilo mudéjar
different from: Interés en estilo modernista
label: Intérêt pour faire du shopping et faire du lèche-vitrines @fr

Interés en estilo renacentista
type: Interés turístico
different from: Interés en estilo romano
different from: Interés en estilo barroco
different from: Interés en ir de compras
label: Interest in Renaissance style @en
different from: Interés en arquitectura urbana
label: Interesse pelo estilo renascentista @pt
different from: Interés en arte de la ciudad
label: Interesse per lo stile del Renascimento @it
different from: Interés en estilo neoclásico
different from: Interés en estilo gótico
different from: Interés en espacios y entornos naturales
different from: Interés en monumentos con medidas de accesibilidad
different from: Interés en estilo mudéjar
different from: Interés en estilo contemporáneo
label: Intérêt pour le style de la Renaissance @fr
Relevancia de los intereses turísticos: 0.6
different from: Interés en zonas verdes (parques, jardines, etc.)
different from: Interés en conocer la EXPO 2008
different from: Interés en estilo modernista

Interés en estilo romano
type: Interés turístico
label: Intérêt pour le style romain @fr
different from: Interés en ir de compras
different from: Interés en estilo modernista
different from: Interés en estilo renacentista
label: Interesse per lo stile romano @it
different from: Interés en estilo neoclásico
different from: Interés en arquitectura urbana
label: Interesse pelo estilo romano @pt
different from: Interés en conocer la EXPO 2008
different from: Interés en estilo mudéjar
different from: Interés en monumentos con medidas de accesibilidad
different from: Interés en estilo contemporáneo
label: Interest in roman style @en
Relevancia de los intereses turísticos: 0.8
different from: Interés en espacios y entornos naturales
different from: Interés en zonas verdes (parques, jardines, etc.)
different from: Interés en estilo barroco
different from: Interés en estilo gótico
different from: Interés en arte de la ciudad

Interés en estilo neoclásico
type: Interés turístico
different from: Interés en estilo barroco
different from: Interés en estilo renacentista
different from: Interés en ir de compras
different from: Interés en arte de la ciudad
label: Intérêt pour le style néoclassique @fr
different from: Interés en estilo mudéjar
different from: Interés en estilo contemporáneo
different from: Interés en estilo modernista
Relevancia de los intereses turísticos: 0.6
different from: Interés en arquitectura urbana
different from: Interés en espacios y entornos naturales
different from: Interés en estilo gótico
different from: Interés en zonas verdes (parques, jardines, etc.)
different from: Interés en estilo romano
label: Interesse pelo estilo neoclássico @pt
label: Interesse per lo stile neoclassico @it
different from: Interés en conocer la EXPO 2008
label: Interest in neoclassical style @en
different from: Interés en monumentos con medidas de accesibilidad

Interés en estilo barroco
type: Interés turístico
different from: Interés en estilo gótico
different from: Interés en conocer la EXPO 2008
different from: Interés en zonas verdes (parques, jardines, etc.)
different from: Interés en estilo modernista
label: Interest in baroque style @en
different from: Interés en arte de la ciudad
different from: Interés en estilo neoclásico
label: Interesse pelo estilo barroco @pt
different from: Interés en arquitectura urbana
different from: Interés en monumentos con medidas de accesibilidad
different from: Interés en estilo contemporáneo
different from: Interés en espacios y entornos naturales
different from: Interés en estilo romano
label: Intérêt pour le style baroque @fr
different from: Interés en estilo mudéjar
different from: Interés en ir de compras
Relevancia de los intereses turísticos: 0.6
different from: Interés en estilo renacentista
label: Interesse per lo stile barocco @it

Interés en zonas verdes (parques, jardines, etc.)
type: Interés turístico
different from: Interés en estilo barroco
different from: Interés en ir de compras
different from: Interés en arquitectura urbana
different from: Interés en estilo neoclásico
Relevancia de los intereses turísticos: 0.6
different from: Interés en conocer la EXPO 2008
different from: Interés en estilo modernista
label: Interesse pelas áreas verdes (parques, jardins, etc) @pt
different from: Interés en estilo renacentista
label: Intérêt pour les espaces verts (parcs, jardins, etc) @fr
different from: Interés en arte de la ciudad
different from: Interés en estilo mudéjar
different from: Interés en estilo contemporáneo
different from: Interés en espacios y entornos naturales
different from: Interés en estilo gótico
different from: Interés en monumentos con medidas de accesibilidad
different from: Interés en estilo romano
label: Interesse per gli spazi verdi (giardini, parchi, etc) @it
label: Interest in green spaces (parks, public gardens, etc) @en

Interés en estilo mudéjar
type: Interés turístico
label: Interest in mudéjar style @en
different from: Interés en estilo contemporáneo
different from: Interés en estilo barroco
different from: Interés en conocer la EXPO 2008
label: Intérêt pour le style mudéjar @fr
label: Interesse per lo stile mudéjar @it
different from: Interés en arquitectura urbana
different from: Interés en estilo romano
different from: Interés en estilo renacentista
different from: Interés en estilo gótico
different from: Interés en arte de la ciudad
different from: Interés en estilo neoclásico
Relevancia de los intereses turísticos: 0.6
different from: Interés en ir de compras
different from: Interés en espacios y entornos naturales
label: Interesse pelo estilo mudéjar @pt
different from: Interés en zonas verdes (parques, jardines, etc.)
different from: Interés en monumentos con medidas de accesibilidad
different from: Interés en estilo modernista

Interés en espacios y entornos naturales
type: Interés turístico
different from: Interés en conocer la EXPO 2008
label: Interest in natural spaces and environment @en
different from: Interés en estilo barroco
different from: Interés en zonas verdes (parques, jardines, etc.)
label: Intérêt pour les espaces et les environements naturaux @fr
different from: Interés en estilo romano
different from: Interés en estilo gótico
different from: Interés en arquitectura urbana
label: Interesse por áreas e ambientes naturais @pt
different from: Interés en estilo neoclásico
different from: Interés en arte de la ciudad
different from: Interés en estilo modernista
label: Interesse per gli spazi e ambienti naturali @it
different from: Interés en estilo contemporáneo
Relevancia de los intereses turísticos: 0.6
different from: Interés en estilo renacentista
different from: Interés en monumentos con medidas de accesibilidad
different from: Interés en estilo mudéjar
different from: Interés en ir de compras

Interés en monumentos con medidas de accesibilidad
type: Interés turístico
different from: Interés en conocer la EXPO 2008
different from: Interés en zonas verdes (parques, jardines, etc.)
label: Interest in accessible monuments @en
label: Intérêt pour les monuments accessibles @fr
different from: Interés en ir de compras
different from: Interés en estilo mudéjar
label: Interesse por monumentos acessíveis @pt
different from: Interés en arquitectura urbana
different from: Interés en estilo neoclásico
different from: Interés en estilo gótico
different from: Interés en estilo renacentista
Relevancia de los intereses turísticos: 1.0
different from: Interés en arte de la ciudad
different from: Interés en estilo romano
label: Interesse per i monumenti accessibili @it
different from: Interés en estilo contemporáneo
different from: Interés en estilo modernista
different from: Interés en estilo barroco
different from: Interés en espacios y entornos naturales

Mudéjar style
type: Estilo artístico
different from: Gothic style
label: Style mudéjar @fr
different from: Style baroque
different from: Stile modernista
label: Stile mudéjar @it
different from: Estilo renacentista
different from: Estilo romano
label: Estilo mudéjar
different from: Estilo contemporáneo

Gothic style
type: Estilo artístico
different from: Estilo romano
different from: Estilo contemporáneo
label: Style gothique @fr
different from: Stile modernista
label: Stile gotico @it
different from: Style baroque
different from: Estilo renacentista
different from: Mudéjar style
label: Estilo gótico

Estilo romano
type: Estilo artístico
different from: Stile modernista
different from: Style baroque
label: Stile romano @it
different from: Mudéjar style
label: Style romain @fr
label: Roman style @en
different from: Estilo contemporáneo
different from: Estilo renacentista
different from: Gothic style

Stile modernista
type: Estilo artístico
different from: Estilo contemporáneo
different from: Mudéjar style
different from: Estilo romano
label: Modernist style @en
different from: Style baroque
label: Estilo modernista
different from: Gothic style
label: Style moderniste @fr
different from: Estilo renacentista

Estilo contemporáneo
type: Estilo artístico
label: Style contemporain @fr
different from: Stile modernista
different from: Gothic style
label: Estilo contemporâneo @pt
label: Contemporary style @en
different from: Estilo romano
different from: Mudéjar style
different from: Estilo renacentista
different from: Style baroque
label: Stile contemporaneo @it

Estilo renacentista
type: Estilo artístico
different from: Stile modernista
different from: Estilo contemporáneo
different from: Estilo romano
different from: Gothic style
different from: Mudéjar style
label: Estilo renascentista @pt
label: Style de la Renaissance @fr
label: Renaissance style @en
label: Stile del Renascimento @it
different from: Style baroque

Style baroque
type: Estilo artístico
different from: Estilo contemporáneo
different from: Estilo romano
label: Estilo barroco
different from: Estilo renacentista
different from: Gothic style
different from: Stile modernista
label: Stile barocco @it
different from: Mudéjar style
label: Baroque style @en

Interés en museos
type: Interés turístico
label: Intérêt pour les musées @fr
label: Interest in museums @en
label: Interesse per i musei @it
label: Interesse pelos museus @pt
Relevancia de los intereses turísticos: 0.5

Estilo neoclásico
type: Estilo artístico
label: Style néoclassique @fr
label: Stile neoclassico @it
label: Neoclassical style @en
label: Estilo neoclássico @pt

Accesibilidad completa
type: Accesibilidad de movilidad reducida
different from: Accesible con muletas
different from: Accesible con acompañante
label: Voll Zugänglichkeit @de
label: Full accessibility @en
label: Acessibilidade completa @pt
label: Accessibilité complète @fr
label: Accessibilità completa @it

Accesible con muletas
type: Accesibilidad de movilidad reducida
label: Zugänglichkeit auf Krücken @de
label: Acessível com muletas @pt
label: Accessible avec des béquilles @fr
label: Accesible with crutches @en
label: Accesibile con le gruccie @it
different from: Accesible con acompañante
different from: Accesibilidad completa

Accesible con acompañante
type: Accesibilidad de movilidad reducida
different from: Accesible con muletas
different from: Accesibilidad completa
label: Acessível com acompanhante @pt
label: Accessible with attendant @en
label: Accessible avec accompagnateur @fr
label: Accessibile con addetto @it

Interés en edificios fortificados
type: Interés turístico
Relevancia de los intereses turísticos: 0.5
label: Intérêt pour les forteresses @fr
label: Interest in fortress @en
label: Interesse por fortalezas @pt
label: Interesse per le fortezze @it

Interés en palacios
type: Interés turístico
label: Intérêt pour les palais @fr
label: Interest in palaces @en
label: Interesse per i palazzi @it
label: Interesse pelos paços @pt
Relevancia de los intereses turísticos: 0.5

Dirección Postal
type: AnnotationProperty
comment: Guarda la dirección postal del recurso

Velocidad de paseo lenta
type: Preferencia de ruta
Relevancia de las preferencias de ruta: 1.75
label: Vitesse lente de marche @fr
label: Velocità bassa di passeggio @it
label: Velocidade lenta de passeio @pt
label: Slow walking @en

Interés en esculturas
type: Interés turístico
label: Intérêt pour la sculpture @fr
label: Interest in sculpture @en
label: Interesse per la scultura @it
label: Interesse pela escultura @pt
Relevancia de los intereses turísticos: 0.5

Interés por los edificios religiosos
type: Interés turístico
label: Intérêt pour les bâtiments religieux @fr
label: Interest in religious buildings @en
label: Interesse per i edifici religiosi @it
label: Interesse pelos edifícios religiosos @pt
Relevancia de los intereses turísticos: 0.5

Identificador de IDEZar
type: AnnotationProperty
comment: Guarda el identificador del servicio de IDEZar

Horario
type: AnnotationProperty
comment: Guarda el texto con el horario de visita del recurso.

Velocidad de paseo rápida
type: Preferencia de ruta
Relevancia de las preferencias de ruta: 0.75
label: Vitesse légère de marche @fr
label: Velocità leggera di passeggio @it
label: Velocidade ligeira de passeio @pt
label: Fast walking @en

Tiempo de visita largo
type: Preferencia de ruta
label: Tempo longo de visita @pt
label: Tempo di visita lungo @it
label: Long time of visit @en
label: Durée longue de visite @fr
Relevancia de las preferencias de ruta: 1.6

Interés en edificios historicos
type: Interés turístico
label: Intérêt pour les bâtiments historiques @fr
label: Interest in historical buildings @en
label: Interesse per i edifici storici @it
label: Interesse pelos edifícios históricos @pt
Relevancia de los intereses turísticos: 0.5

Horario-de-visita 8
type: Horario de visita
r-location: Temporada-de-invierno
Horario de cierre: 10:32:24
Horario de apertura: 15:32:32