expenditure category
range: Thing
domain: Thing
type: Property
type: DimensionProperty
type: ObjectProperty
comment: The category of expenditure in some appropriate categorization scheme (such as the Best Value Account Code of Practice categories). If the scheme is hierarchical then this should at least designate the narrowest (most fine grain) applicable code and can additionally designate the broader codes. Multiple code schemes can be used within the same dataset and consuming applications can use the skos:inScheme (and the rdf:type) of the code to determine the scheme.
domain: Expenditure Line
range: Concept
term status: stable
domain: Resource
domain: Observation
range: Resource

Payment data set
subclass of: Resource
subclass of: Thing
type: Class
comment: A set of payments or expenditures, laid out as a cube of data
subclass of: DataSet
term status: stable

unit
range: Thing
domain: Thing
type: Property
type: ObjectProperty
comment: Optionally indicates a particular organizational unit (Department, Directorate etc) of the payer organization associated with the payment. Use org:classification to link the unit to a categorization of types of units to support cross-comparison. For example, in the UK Local Authority spend application then the ESDToolkit-maintained list of Department Types may be a suitable code list.
domain: Payment
range: OrganizationalUnit
term status: stable
domain: Resource
domain: http://lodlaundromat.org/.well-known/genid/samples/jena///class//b04db1ed7258dcc2b7c0385b535accab/9bb21f30e58612cce6c80c876a5e5a23#5
domain: http://lodlaundromat.org/.well-known/genid/samples/jena///class//b04db1ed7258dcc2b7c0385b535accab/9bb21f30e58612cce6c80c876a5e5a23#3
domain: http://lodlaundromat.org/.well-known/genid/samples/jena///class//b04db1ed7258dcc2b7c0385b535accab/9bb21f30e58612cce6c80c876a5e5a23#4
domain: Slice
range: Resource

payment
range: Thing
domain: Thing
type: Property
type: DimensionProperty
type: ObjectProperty
comment: Indicates the payment of which this expenditure line is a part.
domain: Expenditure Line
range: Payment
term status: stable
domain: Resource
domain: Observation
range: Resource
range: http://lodlaundromat.org/.well-known/genid/samples/jena///class//b04db1ed7258dcc2b7c0385b535accab/9bb21f30e58612cce6c80c876a5e5a23#5
range: http://lodlaundromat.org/.well-known/genid/samples/jena///class//b04db1ed7258dcc2b7c0385b535accab/9bb21f30e58612cce6c80c876a5e5a23#3
range: http://lodlaundromat.org/.well-known/genid/samples/jena///class//b04db1ed7258dcc2b7c0385b535accab/9bb21f30e58612cce6c80c876a5e5a23#4
range: Slice

Expenditure categories
subclass of: Resource
subclass of: Thing
type: Class
comment: The set of expenditure categories in the expenditure-category scheme for capital/revenue.
subclass of: Concept
term status: stable

payer
range: Thing
domain: Thing
type: Property
type: DimensionProperty
type: ObjectProperty
comment: The entity which made the payment.
domain: Payment
range: Agent
term status: stable
domain: Resource
domain: http://lodlaundromat.org/.well-known/genid/samples/jena///class//b04db1ed7258dcc2b7c0385b535accab/9bb21f30e58612cce6c80c876a5e5a23#5
domain: http://lodlaundromat.org/.well-known/genid/samples/jena///class//b04db1ed7258dcc2b7c0385b535accab/9bb21f30e58612cce6c80c876a5e5a23#3
domain: http://lodlaundromat.org/.well-known/genid/samples/jena///class//b04db1ed7258dcc2b7c0385b535accab/9bb21f30e58612cce6c80c876a5e5a23#4
domain: Slice
range: Resource

expenditure line
range: Thing
domain: Thing
type: Property
type: ObjectProperty
comment: Links a payment to the individual expenditure lines associated with it.
domain: Payment
range: Expenditure Line
sub property of: observation
term status: stable
domain: Resource
domain: http://lodlaundromat.org/.well-known/genid/samples/jena///class//b04db1ed7258dcc2b7c0385b535accab/9bb21f30e58612cce6c80c876a5e5a23#5
domain: http://lodlaundromat.org/.well-known/genid/samples/jena///class//b04db1ed7258dcc2b7c0385b535accab/9bb21f30e58612cce6c80c876a5e5a23#3
domain: http://lodlaundromat.org/.well-known/genid/samples/jena///class//b04db1ed7258dcc2b7c0385b535accab/9bb21f30e58612cce6c80c876a5e5a23#4
domain: Slice
range: Resource
range: Observation

http://lodlaundromat.org/.well-known/genid/samples/jena///class//b04db1ed7258dcc2b7c0385b535accab/9bb21f30e58612cce6c80c876a5e5a23#5
subclass of: Thing
type: Class
subclass of: Resource
type: Restriction
min cardinality: 1
on property: date

Redaction
subclass of: Resource
subclass of: Thing
type: Class
comment: An instance of Redaction can be used in place of the actual value in a dataset to indicate that this is a replacement for the true data value which has been redacted. Typically the Redaction resource will be a blank note. It is recommended that it have an appropriate rdfs:label (e.g. REDACTED). If further information on the reaction is available then dcterms properties should be used to carry those, in partcular dct:description can be used to convey a description of the redaction and reasons
term status: proposed

payee
range: Thing
domain: Thing
type: Property
type: DimensionProperty
type: ObjectProperty
comment: The entity to which the payment was made.
domain: Payment
range: Agent
term status: stable
domain: Resource
domain: http://lodlaundromat.org/.well-known/genid/samples/jena///class//b04db1ed7258dcc2b7c0385b535accab/9bb21f30e58612cce6c80c876a5e5a23#5
domain: http://lodlaundromat.org/.well-known/genid/samples/jena///class//b04db1ed7258dcc2b7c0385b535accab/9bb21f30e58612cce6c80c876a5e5a23#3
domain: http://lodlaundromat.org/.well-known/genid/samples/jena///class//b04db1ed7258dcc2b7c0385b535accab/9bb21f30e58612cce6c80c876a5e5a23#4
domain: Slice
range: Resource

Payment
subclass of: Thing
subclass of: Resource
subclass of: Slice
comment: A payment to a supplier for some goods or services, may correspond to one or more expenditure lines
subclass of: http://lodlaundromat.org/.well-known/genid/samples/jena///class//b04db1ed7258dcc2b7c0385b535accab/9bb21f30e58612cce6c80c876a5e5a23#4
type: Class
subclass of: http://lodlaundromat.org/.well-known/genid/samples/jena///class//b04db1ed7258dcc2b7c0385b535accab/9bb21f30e58612cce6c80c876a5e5a23#3
term status: stable
subclass of: http://lodlaundromat.org/.well-known/genid/samples/jena///class//b04db1ed7258dcc2b7c0385b535accab/9bb21f30e58612cce6c80c876a5e5a23#5

Expenditure Line
subclass of: Resource
subclass of: Thing
type: Class
comment: An item of expenditure that can be classified or assigned to a cost centre
subclass of: Observation
term status: stable

procurement category
range: Thing
domain: Thing
type: Property
type: ObjectProperty
comment: A classification for the goods or services for which the payment was made.
domain: Purchase
range: Concept
term status: stable
domain: Resource
range: Resource

http://lodlaundromat.org/.well-known/genid/samples/jena///class//b04db1ed7258dcc2b7c0385b535accab/9bb21f30e58612cce6c80c876a5e5a23#4
type: Class
subclass of: Thing
subclass of: Resource
type: Restriction
min cardinality: 1
on property: payee

Purchase
subclass of: Resource
subclass of: Thing
type: Class
comment: The overall goods or service for which the payment was made
term status: stable

http://lodlaundromat.org/.well-known/genid/samples/jena///class//b04db1ed7258dcc2b7c0385b535accab/9bb21f30e58612cce6c80c876a5e5a23#3
type: Class
subclass of: Thing
subclass of: Resource
type: Restriction
min cardinality: 1
on property: payer

date
range: Thing
domain: Thing
type: Property
type: DimensionProperty
type: ObjectProperty
comment: The date the payment is deemed to have occurred.
domain: Payment
range: Interval
term status: stable
domain: Resource
domain: http://lodlaundromat.org/.well-known/genid/samples/jena///class//b04db1ed7258dcc2b7c0385b535accab/9bb21f30e58612cce6c80c876a5e5a23#5
domain: http://lodlaundromat.org/.well-known/genid/samples/jena///class//b04db1ed7258dcc2b7c0385b535accab/9bb21f30e58612cce6c80c876a5e5a23#3
domain: http://lodlaundromat.org/.well-known/genid/samples/jena///class//b04db1ed7258dcc2b7c0385b535accab/9bb21f30e58612cce6c80c876a5e5a23#4
domain: Slice
range: Resource

narrative
type: Property
type: DatatypeProperty
comment: A narrative description of the goods or services that were supplied.
domain: Purchase
term status: stable
domain: Resource
domain: Thing

net amount
type: Property
type: MeasureProperty
type: DatatypeProperty
comment: The net amount of the payment. This is the effective cost to the payer after any reclaimable tax has been deducted.
domain: Expenditure Line
range: decimal
term status: stable
domain: Thing
domain: Resource
domain: Observation
range: Resource

Revenue
term status: stable
in scheme: Exenditure category scheme
type: Expenditure categories
comment: Indicates a revenue expenditure.
type: Concept
notation: Revenue
top concept of: Exenditure category scheme
type: Thing

reference
type: Property
type: DatatypeProperty
comment: A reference number, code or label which identifies the payment. Not unique across different suppliers.
domain: Payment
term status: stable
domain: Thing
domain: Resource
domain: http://lodlaundromat.org/.well-known/genid/samples/jena///class//b04db1ed7258dcc2b7c0385b535accab/9bb21f30e58612cce6c80c876a5e5a23#5
domain: http://lodlaundromat.org/.well-known/genid/samples/jena///class//b04db1ed7258dcc2b7c0385b535accab/9bb21f30e58612cce6c80c876a5e5a23#3
domain: http://lodlaundromat.org/.well-known/genid/samples/jena///class//b04db1ed7258dcc2b7c0385b535accab/9bb21f30e58612cce6c80c876a5e5a23#4
domain: Slice

currency
type: AttributeProperty
concept: currency
comment: Currency in which a payment was made, typically attached to the dataset for single currency datasets.
term status: stable

gross amount
type: Property
type: MeasureProperty
type: DatatypeProperty
comment: The amount paid, inclusive of any tax (whether reclaimable or not)
domain: Expenditure Line
range: decimal
term status: stable
domain: Thing
domain: Resource
domain: Observation
range: Resource

Exenditure category scheme
type: ConceptScheme
comment: A code scheme for classifying expenditures as capital/revenue.
term status: stable
has top concept: Capital
has top concept: Revenue

Payments ontology
type: Ontology
contributor: Jeni Tennison
contributor: Dave Reynolds
created: 2010-08-06
license: http://www.opendatacommons.org/licenses/pddl/1.0/
modified: 2010-11-16
comment: Vocabulary for representing payments, such as government expenditures, using the data cube representation.
version info: 0.7

total net amount
type: Property
type: DatatypeProperty
domain: Slice
range: decimal
term status: stable
domain: Resource
range: Resource

expenditure code
type: Property
type: DataTypeProperty
comment: An (optional) internal code for the expenditure category. Such codes may not be useful across organizations but retaining them in a dataset may aid comparability of datasets within an organization and help with tracing back requests for further information. The internal code may actually be an amalgam of multiple different categories (e.g. may denote both the subjective and objective classifications of an expenditure).
domain: Expenditure Line
term status: stable
domain: Thing
domain: Resource
domain: Observation

order
type: Property
comment: Indicates an order associated with this payment (optional).
domain: Payment
term status: stable
domain: Thing
domain: Resource
domain: http://lodlaundromat.org/.well-known/genid/samples/jena///class//b04db1ed7258dcc2b7c0385b535accab/9bb21f30e58612cce6c80c876a5e5a23#5
domain: http://lodlaundromat.org/.well-known/genid/samples/jena///class//b04db1ed7258dcc2b7c0385b535accab/9bb21f30e58612cce6c80c876a5e5a23#3
domain: http://lodlaundromat.org/.well-known/genid/samples/jena///class//b04db1ed7258dcc2b7c0385b535accab/9bb21f30e58612cce6c80c876a5e5a23#4
domain: Slice

total gross amount
type: Property
type: MeasureProperty
type: DatatypeProperty
domain: Slice
range: decimal
term status: stable
domain: Resource
range: Resource

Capital
type: Concept
in scheme: Exenditure category scheme
notation: Capital
top concept of: Exenditure category scheme
type: Expenditure categories
comment: Indicates a capital expenditure.
term status: stable
type: Thing

contract
type: Property
comment: Indicates a contract associated with this payment (optional).
domain: Payment
term status: stable
domain: Thing
domain: Resource
domain: http://lodlaundromat.org/.well-known/genid/samples/jena///class//b04db1ed7258dcc2b7c0385b535accab/9bb21f30e58612cce6c80c876a5e5a23#5
domain: http://lodlaundromat.org/.well-known/genid/samples/jena///class//b04db1ed7258dcc2b7c0385b535accab/9bb21f30e58612cce6c80c876a5e5a23#3
domain: http://lodlaundromat.org/.well-known/genid/samples/jena///class//b04db1ed7258dcc2b7c0385b535accab/9bb21f30e58612cce6c80c876a5e5a23#4
domain: Slice

purchase
type: Property
type: DatatypeProperty
comment: Indicates the overall goods or service for which the payment was made.
domain: Payment
range: Purchase
term status: stable
domain: Thing
domain: Resource
domain: http://lodlaundromat.org/.well-known/genid/samples/jena///class//b04db1ed7258dcc2b7c0385b535accab/9bb21f30e58612cce6c80c876a5e5a23#5
domain: http://lodlaundromat.org/.well-known/genid/samples/jena///class//b04db1ed7258dcc2b7c0385b535accab/9bb21f30e58612cce6c80c876a5e5a23#3
domain: http://lodlaundromat.org/.well-known/genid/samples/jena///class//b04db1ed7258dcc2b7c0385b535accab/9bb21f30e58612cce6c80c876a5e5a23#4
domain: Slice
range: Resource
range: Thing

expenditure structure
component: http://lodlaundromat.org/.well-known/genid/samples/jena///class//b04db1ed7258dcc2b7c0385b535accab/9bb21f30e58612cce6c80c876a5e5a23#12
type: DataStructureDefinition
component: http://lodlaundromat.org/.well-known/genid/samples/jena///class//b04db1ed7258dcc2b7c0385b535accab/9bb21f30e58612cce6c80c876a5e5a23#11
component: http://lodlaundromat.org/.well-known/genid/samples/jena///class//b04db1ed7258dcc2b7c0385b535accab/9bb21f30e58612cce6c80c876a5e5a23#7
component: http://lodlaundromat.org/.well-known/genid/samples/jena///class//b04db1ed7258dcc2b7c0385b535accab/9bb21f30e58612cce6c80c876a5e5a23#6
comment: The structure of a cube containing expenditure level information along with payments.
component: http://lodlaundromat.org/.well-known/genid/samples/jena///class//b04db1ed7258dcc2b7c0385b535accab/9bb21f30e58612cce6c80c876a5e5a23#9
component: http://lodlaundromat.org/.well-known/genid/samples/jena///class//b04db1ed7258dcc2b7c0385b535accab/9bb21f30e58612cce6c80c876a5e5a23#10
component: http://lodlaundromat.org/.well-known/genid/samples/jena///class//b04db1ed7258dcc2b7c0385b535accab/9bb21f30e58612cce6c80c876a5e5a23#8

payment slice
type: SliceKey
component property: date
component property: payee
component property: payer
component property: payment
comment: The definition of a slice through an expenditure cube that corresponds to all the expenditures in a single payment.

invoice
type: Property
comment: Indicates an invoice associated with this payment (optional).
domain: Payment
term status: stable
domain: Thing
domain: Resource
domain: http://lodlaundromat.org/.well-known/genid/samples/jena///class//b04db1ed7258dcc2b7c0385b535accab/9bb21f30e58612cce6c80c876a5e5a23#5
domain: http://lodlaundromat.org/.well-known/genid/samples/jena///class//b04db1ed7258dcc2b7c0385b535accab/9bb21f30e58612cce6c80c876a5e5a23#3
domain: http://lodlaundromat.org/.well-known/genid/samples/jena///class//b04db1ed7258dcc2b7c0385b535accab/9bb21f30e58612cce6c80c876a5e5a23#4
domain: Slice