provides_access_to
range: Thing
domain: Thing
comment: change the domain tye to access service
IAO_0000119: PERSON: Melissa Haendel
range: http://lodlaundromat.org/.well-known/genid/samples/jena///predicate//9d3b5a7ecddc9b4d8ddab2ec7a1e90f0/7f4f0183f112bd9472e6e589155e0bc3#1
IAO_0000117: PERSON: Melissa Haendel
type: ObjectProperty
domain: ERO_0000005
IAO_0000115: Instruments, reagents, organisms, software, or other sevices for which the service provides access.
IAO_0000114: IAO_0000120
type: AnnotationProperty
IAO_0000112: An access service that provides access to a flow cytometer.
type: Property
range: Resource
domain: Resource
domain: http://lodlaundromat.org/.well-known/genid/samples/jena///predicate//9d3b5a7ecddc9b4d8ddab2ec7a1e90f0/7f4f0183f112bd9472e6e589155e0bc3#1
domain: http://lodlaundromat.org/.well-known/genid/samples/jena///predicate//9d3b5a7ecddc9b4d8ddab2ec7a1e90f0/dfd971e48b118a3ebf1f3f1c1d8c9deb#1
domain: http://lodlaundromat.org/.well-known/genid/samples/jena///predicate//9d3b5a7ecddc9b4d8ddab2ec7a1e90f0/72d20206d7fa20a0bceb45a38012adfc#1
domain: http://lodlaundromat.org/.well-known/genid/samples/jena///predicate//9d3b5a7ecddc9b4d8ddab2ec7a1e90f0/48f097c2d5f1eeca031c1862c7986852#1
domain: http://lodlaundromat.org/.well-known/genid/samples/jena///predicate//9d3b5a7ecddc9b4d8ddab2ec7a1e90f0/21a971cc798913fbfb78af46fe026f71#1
domain: http://lodlaundromat.org/.well-known/genid/samples/jena///predicate//9d3b5a7ecddc9b4d8ddab2ec7a1e90f0/534903d94173e7e1d5d3e9341b972ff3#1

Bibliographic Resource
subclass of: Resource
Has Version: BibliographicResource-001
issued: 2008-01-14
type: Class
comment: A book, article, or other documentary resource.
Relation: BibliographicResource-001
relation: BibliographicResource-001
date: 2008-01-14

License Document
subclass of: Resource
Has Version: LicenseDocument-001
issued: 2008-01-14
type: Class
comment: A legal document giving official permission to do something with a Resource.
subclass of: Rights Statement
Relation: LicenseDocument-001
relation: LicenseDocument-001
date: 2008-01-14

Agent
subclass of: Resource
description: Examples of Agent include person, organization, and software agent.
Has Version: Agent-001
issued: 2008-01-14
type: Agent Class
type: Class
comment: A resource that acts or has the power to act.
Relation: Agent-001
relation: Agent-001
date: 2008-01-14

has_sequence_alteration
range: Thing
domain: Thing
IAO_0000114: IAO_0000120
domain: http://lodlaundromat.org/.well-known/genid/samples/jena///predicate//9d3b5a7ecddc9b4d8ddab2ec7a1e90f0/391d3a6cca803c8603c11abb4285af4f#1
type: ObjectProperty
IAO_0000115: A sequence variation that deviates from a canonical or reference sequence.
IAO_0000117: PERSON: Melissa Haendel
range: SO_0001059
IAO_0000118: has_sequence_alteration
IAO_0000111: has sequence alteration
IAO_0000119: PERSON: Melissa Haendel
IAO_0000112: A point mutation in a gene.
type: Property
range: http://lodlaundromat.org/.well-known/genid/samples/jena///predicate//9d3b5a7ecddc9b4d8ddab2ec7a1e90f0/b51c5599695347aae0343cc44624199c#1
range: http://lodlaundromat.org/.well-known/genid/samples/jena///predicate//9d3b5a7ecddc9b4d8ddab2ec7a1e90f0/2b6b0fd79c60db06664bbf5c75da9f9d#1
range: Resource
domain: Resource

related_technique
range: Thing
domain: Thing
IAO_0000112: Flow cytometry is a related technique for a flow cytometer instrument.
IAO_0000115: Method in which the resource can be used.
range: ERO_0000007
IAO_0000114: IAO_0000120
IAO_0000119: PERSON: Melissa Haendel
IAO_0000111: related technique
IAO_0000117: PERSON: Melissa Haendel
type: ObjectProperty
domain: http://lodlaundromat.org/.well-known/genid/samples/jena///predicate//9d3b5a7ecddc9b4d8ddab2ec7a1e90f0/72d20206d7fa20a0bceb45a38012adfc#1
type: Property
range: Resource
range: http://lodlaundromat.org/.well-known/genid/samples/jena///predicate//9d3b5a7ecddc9b4d8ddab2ec7a1e90f0/6b3847c77327f4f1eeba3b76b3cfd58d#1
domain: Resource

ERO_0000066
range: Thing
domain: Thing
IAO_0000115: Institutional, consortia, or other organizational affiliations.
type: TransitiveProperty
type: ObjectProperty
type: Property
range: Resource
domain: Resource

Source
sub property of: relation
description: The described resource may be derived from the related resource in whole or in part. Recommended best practice is to identify the related resource by means of a string conforming to a formal identification system.
note: This term is intended to be used with non-literal values as defined in the DCMI Abstract Model (http://dublincore.org/documents/abstract-model/). As of December 2007, the DCMI Usage Board is seeking a way to express this intention with a formal range declaration.
comment: A related resource from which the described resource is derived.
type: Property
sub property of: source
sub property of: Relation
issued: 2008-01-14
Date Modified: 2008-01-14
Has Version: sourceT-001
Relation: sourceT-001
relation: sourceT-001
date: 2008-01-14

Physical Resource
subclass of: Resource
Has Version: PhysicalResource-001
issued: 2008-01-14
type: Class
comment: A material thing.
Relation: PhysicalResource-001
relation: PhysicalResource-001
date: 2008-01-14

achieves_objective
range: Thing
domain: Thing
IAO_0000115: Transformation objective of the software.
type: ObjectProperty
domain: ERO_0000071
type: AnnotationProperty
IAO_0000112: ImageJ software measures characteristics of digital images.
IAO_0000114: IAO_0000120
IAO_0000111: achieves objective
range: OBI_0200166
IAO_0000117: PERSON: Carlo Torniai
IAO_0000119: PERSON: Melissa Haendel
type: Property
range: Resource
domain: Resource
domain: http://lodlaundromat.org/.well-known/genid/samples/jena///predicate//9d3b5a7ecddc9b4d8ddab2ec7a1e90f0/e71ada53dc142351840a8ab0e0979167#1
domain: http://lodlaundromat.org/.well-known/genid/samples/jena///predicate//9d3b5a7ecddc9b4d8ddab2ec7a1e90f0/a5d36ab027d738e32157848695e01052#1
domain: http://lodlaundromat.org/.well-known/genid/samples/jena///predicate//9d3b5a7ecddc9b4d8ddab2ec7a1e90f0/6b3847c77327f4f1eeba3b76b3cfd58d#1
domain: http://lodlaundromat.org/.well-known/genid/samples/jena///predicate//9d3b5a7ecddc9b4d8ddab2ec7a1e90f0/72d20206d7fa20a0bceb45a38012adfc#1
domain: http://lodlaundromat.org/.well-known/genid/samples/jena///predicate//9d3b5a7ecddc9b4d8ddab2ec7a1e90f0/7f4f0183f112bd9472e6e589155e0bc3#1
domain: http://lodlaundromat.org/.well-known/genid/samples/jena///predicate//9d3b5a7ecddc9b4d8ddab2ec7a1e90f0/dfd971e48b118a3ebf1f3f1c1d8c9deb#1
domain: http://lodlaundromat.org/.well-known/genid/samples/jena///predicate//9d3b5a7ecddc9b4d8ddab2ec7a1e90f0/f52b5e1c70e77f526939b8555d4b0480#1
domain: http://lodlaundromat.org/.well-known/genid/samples/jena///predicate//9d3b5a7ecddc9b4d8ddab2ec7a1e90f0/ac57621756d69b1ec109c38c08182ee5#1
domain: http://lodlaundromat.org/.well-known/genid/samples/jena///predicate//9d3b5a7ecddc9b4d8ddab2ec7a1e90f0/48f097c2d5f1eeca031c1862c7986852#1

Media Type
subclass of: Resource
Has Version: MediaType-001
issued: 2008-01-14
type: Class
comment: A file format or physical medium.
subclass of: Media Type or Extent
Relation: MediaType-001
relation: MediaType-001
date: 2008-01-14

Agent Class
subclass of: Resource
description: Examples of Agent Class include groups seen as classes, such as students, women, charities, lecturers.
Has Version: AgentClass-003
issued: 2008-01-14
Date Modified: 2012-06-14
type: Class
comment: A group of agents.
subclass of: Class
Relation: AgentClass-003
relation: AgentClass-003
date: 2012-06-14
date: 2008-01-14

author_of
range: Thing
domain: Thing
inverse of: has_author
range: IAO_0000310
IAO_0000115: Document authored by a person.
IAO_0000112: A journal article authored by the person.
IAO_0000117: PERSON: Melissa Haendel
type: ObjectProperty
type: Property
range: Resource
range: http://lodlaundromat.org/.well-known/genid/samples/jena///predicate//9d3b5a7ecddc9b4d8ddab2ec7a1e90f0/48f097c2d5f1eeca031c1862c7986852#1
domain: Resource

is_performed_by
range: Thing
domain: Thing
type: ObjectProperty
IAO_0000112: Confocal microscopy is performed by a confocal core laboratory.
range: http://lodlaundromat.org/.well-known/genid/samples/jena///predicate//9d3b5a7ecddc9b4d8ddab2ec7a1e90f0/d2234f365d05c89832c464f52d60faf1#1
IAO_0000115: Person or laboratory that performs the service or technique.
IAO_0000119: PERSON: Melissa Haendel
IAO_0000111: is performed by
IAO_0000117: PERSON: Melissa Haendel
IAO_0000114: IAO_0000120
type: Property
range: Resource
domain: Resource

Creator
sub property of: maker
sub property of: contributor
Date Modified: 2010-10-11
comment: An entity primarily responsible for making the resource.
Has Version: creatorT-002
equivalent property: maker
issued: 2008-01-14
sub property of: Contributor
sub property of: creator
type: Property
description: Examples of a Creator include a person, an organization, or a service.
range: Agent
Relation: creatorT-002
relation: creatorT-002
date: 2010-10-11
date: 2008-01-14
range: Resource

human_study_performed_by
range: Thing
domain: Thing
sub property of: has agent
IAO_0000117: PERSON: Melissa Haendel
domain: ERO_0000015
IAO_0000112: Jackson State University performs human studies on heart disease.
IAO_0000114: IAO_0000120
IAO_0000115: Organization that performs the human study.
IAO_0000111: human study performed by
type: ObjectProperty
type: Property
range: Resource
domain: Resource
domain: http://lodlaundromat.org/.well-known/genid/samples/jena///predicate//9d3b5a7ecddc9b4d8ddab2ec7a1e90f0/48f097c2d5f1eeca031c1862c7986852#1

Location, Period, or Jurisdiction
subclass of: Resource
Has Version: LocationPeriodOrJurisdiction-001
issued: 2008-01-14
type: Class
comment: A location, period of time, or jurisdiction.
Relation: LocationPeriodOrJurisdiction-001
relation: LocationPeriodOrJurisdiction-001
date: 2008-01-14

has_antibody_target
range: Thing
domain: Thing
range: ERO_0001532
comment: ToDo: will be a subproperty of some kind of "recognizes" property.
IAO_0000114: IAO_0000120
IAO_0000117: PERSON: Melissa Haendel
IAO_0000119: PERSON: Matthew Brush
IAO_0000112: Most often this is a protein but can also include chemicals, or biological materials such as cells or organisms.
domain: ERO_0000008
type: ObjectProperty
IAO_0000115: A material that is recognized by an antibody. Most often this is a protein but can also include chemicals, or biological materials such as cells or organisms.
type: AnnotationProperty
type: Property
range: Resource
domain: Resource
domain: http://lodlaundromat.org/.well-known/genid/samples/jena///predicate//9d3b5a7ecddc9b4d8ddab2ec7a1e90f0/a87df05138333be5591318e2dcf76368#1
domain: http://lodlaundromat.org/.well-known/genid/samples/jena///predicate//9d3b5a7ecddc9b4d8ddab2ec7a1e90f0/d40a630bafd46234eff5dafe5e8651f8#1

has_biosafety_level
range: Thing
domain: Thing
IAO_0000112: Working with ebola virus has biosafety level 4.
IAO_0000114: IAO_0000120
range: ERO_0000316
IAO_0000115: Level of the biocontainment precautions required to isolate dangerous biological agents in an enclosed facility. Levels range from level 1 (lowest) to 4 (highest). In the United States, the Centers for Disease Control and Prevention (CDC) specified these levels.
IAO_0000119: PERSON: Melissa Haendel
type: ObjectProperty
IAO_0000117: PERSON: Melissa Haendel
IAO_0000111: has biosafety level
type: AnnotationProperty
domain: NCBITaxon_10239
type: Property
range: Resource
domain: Resource

Linguistic System
subclass of: Resource
description: Examples include written, spoken, sign, and computer languages.
Has Version: LinguisticSystem-001
issued: 2008-01-14
type: Class
comment: A system of signs, symbols, sounds, gestures, or rules used in communication.
Relation: LinguisticSystem-001
relation: LinguisticSystem-001
date: 2008-01-14

has_format
range: Thing
domain: Thing
type: AnnotationProperty
domain: ERO_0001554
type: ObjectProperty
range: IAO_0000098
type: Property
range: Resource
domain: Resource

File Format
subclass of: Resource
description: Examples include the formats defined by the list of Internet Media Types.
Has Version: FileFormat-001
issued: 2008-01-14
type: Class
comment: A digital resource format.
subclass of: Media Type
Relation: FileFormat-001
relation: FileFormat-001
date: 2008-01-14

has_documentation
range: Thing
domain: Thing
IAO_0000114: IAO_0000120
IAO_0000115: Document that contains relevant resource information.
range: IAO_0000310
type: ObjectProperty
IAO_0000111: has documentation
IAO_0000117: PERSON: Melissa Haendel
IAO_0000112: An antibody has documentation describing attributes of the antibody.
IAO_0000119: PERSON: Melissa Haendel
domain: http://lodlaundromat.org/.well-known/genid/samples/jena///predicate//9d3b5a7ecddc9b4d8ddab2ec7a1e90f0/dfd971e48b118a3ebf1f3f1c1d8c9deb#1
type: Property
range: Resource
range: http://lodlaundromat.org/.well-known/genid/samples/jena///predicate//9d3b5a7ecddc9b4d8ddab2ec7a1e90f0/48f097c2d5f1eeca031c1862c7986852#1
domain: Resource

Frequency
subclass of: Resource
Has Version: Frequency-001
issued: 2008-01-14
type: Class
comment: A rate at which something recurs.
Relation: Frequency-001
relation: Frequency-001
date: 2008-01-14

Media Type or Extent
subclass of: Resource
Has Version: MediaTypeOrExtent-001
issued: 2008-01-14
type: Class
comment: A media type or extent.
Relation: MediaTypeOrExtent-001
relation: MediaTypeOrExtent-001
date: 2008-01-14

Physical Medium
subclass of: Resource
description: Examples include paper, canvas, or DVD.
Has Version: PhysicalMedium-001
issued: 2008-01-14
type: Class
comment: A physical material or carrier.
subclass of: Media Type
Relation: PhysicalMedium-001
relation: PhysicalMedium-001
date: 2008-01-14

Provenance Statement
subclass of: Resource
Has Version: ProvenanceStatement-001
issued: 2008-01-14
type: Class
comment: A statement of any changes in ownership and custody of a resource since its creation that are significant for its authenticity, integrity, and interpretation.
Relation: ProvenanceStatement-001
relation: ProvenanceStatement-001
date: 2008-01-14

specifies_the_use_of
range: Thing
domain: Thing
IAO_0000115: Instruments, techniques, reagents, organisms, or software that are referenced in a protocol.
range: http://lodlaundromat.org/.well-known/genid/samples/jena///predicate//9d3b5a7ecddc9b4d8ddab2ec7a1e90f0/6b3847c77327f4f1eeba3b76b3cfd58d#1
IAO_0000112: A protocol can specify the use of a flow cytometer.
domain: OBI_0000272
type: ObjectProperty
type: AnnotationProperty
IAO_0000111: specifies the use of
IAO_0000119: PERSON: Melissa Haendel
IAO_0000117: PERSON: Melissa Haendel
IAO_0000114: IAO_0000120
type: Property
range: Resource
domain: Resource
domain: http://lodlaundromat.org/.well-known/genid/samples/jena///predicate//9d3b5a7ecddc9b4d8ddab2ec7a1e90f0/dfd971e48b118a3ebf1f3f1c1d8c9deb#1
domain: http://lodlaundromat.org/.well-known/genid/samples/jena///predicate//9d3b5a7ecddc9b4d8ddab2ec7a1e90f0/21a971cc798913fbfb78af46fe026f71#1

derives_from_material_anatomical_entity
range: Thing
domain: Thing
domain: http://lodlaundromat.org/.well-known/genid/samples/jena///predicate//9d3b5a7ecddc9b4d8ddab2ec7a1e90f0/36ca9410df5533eba2dd65b38736e67d#1
sub property of: RO_0001000
IAO_0000111: derives from material anatomical entity
IAO_0000112: A cell line derived from a kidney.
IAO_0000115: Anatomical entity from which the resource is derived.
IAO_0000117: PERSON: Melissa Haendel
IAO_0000119: PERSON: Melissa Haendel
range: UBERON_0001062
IAO_0000114: IAO_0000120
type: ObjectProperty
type: Property
domain: Resource
range: Resource

Jurisdiction
subclass of: Resource
Has Version: Jurisdiction-001
issued: 2008-01-14
type: Class
comment: The extent or range of judicial, law enforcement, or other authority.
subclass of: Location, Period, or Jurisdiction
Relation: Jurisdiction-001
relation: Jurisdiction-001
date: 2008-01-14

has_software_license
range: Thing
domain: Thing
type: AnnotationProperty
IAO_0000115: Is a legal instrument (usually by way of contract law) governing the usage or redistribution of software.
IAO_0000117: PERSON: Scott Hoffmann
IAO_0000119: http://en.wikipedia.org/wiki/Software_license
domain: ERO_0000071
type: ObjectProperty
range: SWO_0000002
type: Property
range: Resource
domain: Resource
domain: http://lodlaundromat.org/.well-known/genid/samples/jena///predicate//9d3b5a7ecddc9b4d8ddab2ec7a1e90f0/e71ada53dc142351840a8ab0e0979167#1
domain: http://lodlaundromat.org/.well-known/genid/samples/jena///predicate//9d3b5a7ecddc9b4d8ddab2ec7a1e90f0/a5d36ab027d738e32157848695e01052#1
domain: http://lodlaundromat.org/.well-known/genid/samples/jena///predicate//9d3b5a7ecddc9b4d8ddab2ec7a1e90f0/6b3847c77327f4f1eeba3b76b3cfd58d#1
domain: http://lodlaundromat.org/.well-known/genid/samples/jena///predicate//9d3b5a7ecddc9b4d8ddab2ec7a1e90f0/72d20206d7fa20a0bceb45a38012adfc#1
domain: http://lodlaundromat.org/.well-known/genid/samples/jena///predicate//9d3b5a7ecddc9b4d8ddab2ec7a1e90f0/7f4f0183f112bd9472e6e589155e0bc3#1
domain: http://lodlaundromat.org/.well-known/genid/samples/jena///predicate//9d3b5a7ecddc9b4d8ddab2ec7a1e90f0/dfd971e48b118a3ebf1f3f1c1d8c9deb#1
domain: http://lodlaundromat.org/.well-known/genid/samples/jena///predicate//9d3b5a7ecddc9b4d8ddab2ec7a1e90f0/f52b5e1c70e77f526939b8555d4b0480#1
domain: http://lodlaundromat.org/.well-known/genid/samples/jena///predicate//9d3b5a7ecddc9b4d8ddab2ec7a1e90f0/ac57621756d69b1ec109c38c08182ee5#1
domain: http://lodlaundromat.org/.well-known/genid/samples/jena///predicate//9d3b5a7ecddc9b4d8ddab2ec7a1e90f0/48f097c2d5f1eeca031c1862c7986852#1

has_phenotype_annotation
range: Thing
domain: Thing
type: ObjectProperty
range: ERO_0001828
domain: http://lodlaundromat.org/.well-known/genid/samples/jena///predicate//9d3b5a7ecddc9b4d8ddab2ec7a1e90f0/7fde61c528cf5b5bb1c5794aa4037e29#1
type: Property
range: Resource
domain: Resource

has_author
domain: IAO_0000310
range: Thing
domain: Thing
type: ObjectProperty
comment: tobe imported probably from FOAF or anywwre according top vivo
IAO_0000112: A journal article has authors.
IAO_0000119: PERSON: Melissa Haendel
inverse of: author_of
IAO_0000115: Person who authored a document.
type: Property
range: Resource
domain: Resource
domain: http://lodlaundromat.org/.well-known/genid/samples/jena///predicate//9d3b5a7ecddc9b4d8ddab2ec7a1e90f0/48f097c2d5f1eeca031c1862c7986852#1

recognizes_species
range: Thing
domain: Thing
IAO_0000119: PERSON: Melissa Haendel
domain: ERO_0001536
IAO_0000114: IAO_0000120
type: ObjectProperty
IAO_0000117: PERSON: Melissa Haendel
IAO_0000111: recognizes species
IAO_0000112: An mouse anti-human OX40 antibody recognizes the human OX40 protein.
range: OBI_0100026
type: AnnotationProperty
IAO_0000115: Organism recognized by the antibody.
type: Property
range: http://lodlaundromat.org/.well-known/genid/samples/jena///predicate//9d3b5a7ecddc9b4d8ddab2ec7a1e90f0/a87df05138333be5591318e2dcf76368#1
range: Resource
range: http://lodlaundromat.org/.well-known/genid/samples/jena///predicate//9d3b5a7ecddc9b4d8ddab2ec7a1e90f0/dfd971e48b118a3ebf1f3f1c1d8c9deb#1
range: http://lodlaundromat.org/.well-known/genid/samples/jena///predicate//9d3b5a7ecddc9b4d8ddab2ec7a1e90f0/391d3a6cca803c8603c11abb4285af4f#1
range: http://lodlaundromat.org/.well-known/genid/samples/jena///predicate//9d3b5a7ecddc9b4d8ddab2ec7a1e90f0/21a971cc798913fbfb78af46fe026f71#7
range: http://lodlaundromat.org/.well-known/genid/samples/jena///predicate//9d3b5a7ecddc9b4d8ddab2ec7a1e90f0/48f097c2d5f1eeca031c1862c7986852#1
range: http://lodlaundromat.org/.well-known/genid/samples/jena///predicate//9d3b5a7ecddc9b4d8ddab2ec7a1e90f0/72d20206d7fa20a0bceb45a38012adfc#1
range: http://lodlaundromat.org/.well-known/genid/samples/jena///predicate//9d3b5a7ecddc9b4d8ddab2ec7a1e90f0/7f4f0183f112bd9472e6e589155e0bc3#1
range: http://lodlaundromat.org/.well-known/genid/samples/jena///predicate//9d3b5a7ecddc9b4d8ddab2ec7a1e90f0/7fde61c528cf5b5bb1c5794aa4037e29#1
range: http://lodlaundromat.org/.well-known/genid/samples/jena///predicate//9d3b5a7ecddc9b4d8ddab2ec7a1e90f0/6b3847c77327f4f1eeba3b76b3cfd58d#1
domain: Resource

expressed_in_organism
range: Thing
domain: Thing
type: ObjectProperty
domain: ERO_0000285
IAO_0000112: A yeast expression vector is designed to be expressed in yeast cells.
range: OBI_0100026
IAO_0000111: expressed in organism
comment: shortcut relation for participates_in_ expression process
type: AnnotationProperty
IAO_0000115: Organism in which the construct is designed to be expressed.
IAO_0000119: PERSON: Melissa Haendel
IAO_0000114: IAO_0000120
IAO_0000117: PERSON: Melissa Haendel
type: Property
range: http://lodlaundromat.org/.well-known/genid/samples/jena///predicate//9d3b5a7ecddc9b4d8ddab2ec7a1e90f0/a87df05138333be5591318e2dcf76368#1
range: Resource
range: http://lodlaundromat.org/.well-known/genid/samples/jena///predicate//9d3b5a7ecddc9b4d8ddab2ec7a1e90f0/dfd971e48b118a3ebf1f3f1c1d8c9deb#1
range: http://lodlaundromat.org/.well-known/genid/samples/jena///predicate//9d3b5a7ecddc9b4d8ddab2ec7a1e90f0/391d3a6cca803c8603c11abb4285af4f#1
range: http://lodlaundromat.org/.well-known/genid/samples/jena///predicate//9d3b5a7ecddc9b4d8ddab2ec7a1e90f0/21a971cc798913fbfb78af46fe026f71#7
range: http://lodlaundromat.org/.well-known/genid/samples/jena///predicate//9d3b5a7ecddc9b4d8ddab2ec7a1e90f0/48f097c2d5f1eeca031c1862c7986852#1
range: http://lodlaundromat.org/.well-known/genid/samples/jena///predicate//9d3b5a7ecddc9b4d8ddab2ec7a1e90f0/72d20206d7fa20a0bceb45a38012adfc#1
range: http://lodlaundromat.org/.well-known/genid/samples/jena///predicate//9d3b5a7ecddc9b4d8ddab2ec7a1e90f0/7f4f0183f112bd9472e6e589155e0bc3#1
range: http://lodlaundromat.org/.well-known/genid/samples/jena///predicate//9d3b5a7ecddc9b4d8ddab2ec7a1e90f0/7fde61c528cf5b5bb1c5794aa4037e29#1
range: http://lodlaundromat.org/.well-known/genid/samples/jena///predicate//9d3b5a7ecddc9b4d8ddab2ec7a1e90f0/6b3847c77327f4f1eeba3b76b3cfd58d#1
domain: Resource
domain: http://lodlaundromat.org/.well-known/genid/samples/jena///predicate//9d3b5a7ecddc9b4d8ddab2ec7a1e90f0/ad2b4b28e2fc44bac15e197e72a08df5#1
domain: http://lodlaundromat.org/.well-known/genid/samples/jena///predicate//9d3b5a7ecddc9b4d8ddab2ec7a1e90f0/a87df05138333be5591318e2dcf76368#1
domain: http://lodlaundromat.org/.well-known/genid/samples/jena///predicate//9d3b5a7ecddc9b4d8ddab2ec7a1e90f0/72d20206d7fa20a0bceb45a38012adfc#1

has_residency_requirement
range: Thing
domain: Thing
type: AnnotationProperty
IAO_0000115: US residency status of applicants that may apply for the student research opportunity.
range: ERO_0000776
IAO_0000114: IAO_0000120
IAO_0000117: PERSON: Melissa Haendel
IAO_0000112: A research opportunity requires applicants to be US citizens.
IAO_0000111: has residency requirement
type: ObjectProperty
domain: ERO_0000595
IAO_0000119: PERSON: Melissa Haendel
type: Property
range: Resource
domain: Resource
domain: http://lodlaundromat.org/.well-known/genid/samples/jena///predicate//9d3b5a7ecddc9b4d8ddab2ec7a1e90f0/48f097c2d5f1eeca031c1862c7986852#1

Method of Accrual
subclass of: Resource
Has Version: MethodOfAccrual-001
issued: 2008-01-14
type: Class
comment: A method by which resources are added to a collection.
Relation: MethodOfAccrual-001
relation: MethodOfAccrual-001
date: 2008-01-14

derives_from_organism
range: Thing
domain: Thing
IAO_0000115: Organism from which the resource is derived.
IAO_0000111: derives from organism
range: ERO_0000985
domain: http://lodlaundromat.org/.well-known/genid/samples/jena///predicate//9d3b5a7ecddc9b4d8ddab2ec7a1e90f0/d40a630bafd46234eff5dafe5e8651f8#1
sub property of: ERO_0001522
IAO_0000119: PERSON: Melissa Haendel
type: ObjectProperty
IAO_0000117: PERSON: Melissa Haendel
IAO_0000114: IAO_0000120
type: AnnotationProperty
IAO_0000112: A human cell line.
type: Property
range: Resource
range: http://lodlaundromat.org/.well-known/genid/samples/jena///predicate//9d3b5a7ecddc9b4d8ddab2ec7a1e90f0/aa9f754ebe235041f3c247a6e7d85a46#1
domain: Resource

model_of
range: Thing
domain: Thing
IAO_0000115: Disease or condition for which the organism presents some or all defining characteristics.
domain: http://lodlaundromat.org/.well-known/genid/samples/jena///predicate//9d3b5a7ecddc9b4d8ddab2ec7a1e90f0/aa9f754ebe235041f3c247a6e7d85a46#1
IAO_0000114: IAO_0000120
IAO_0000117: PERSON: Melissa Haendel
type: ObjectProperty
IAO_0000111: model of
IAO_0000119: PERSON: Melissa Haendel
comment: here we need to have a more clear definition in dependence of the model
IAO_0000112: Transgenic mice are often models for a specific disease.
range: DOID 4
type: Property
range: Resource
range: http://lodlaundromat.org/.well-known/genid/samples/jena///predicate//9d3b5a7ecddc9b4d8ddab2ec7a1e90f0/21a971cc798913fbfb78af46fe026f71#7
domain: Resource

ERO_0000022
range: Thing
domain: Thing
type: ObjectProperty
IAO_0000111: has PI
IAO_0000119: PERSON: Melissa Haendel
type: Property
range: Resource
domain: Resource

Policy
subclass of: Resource
Has Version: Policy-001
issued: 2008-01-14
type: Class
comment: A plan or course of action by an authority, intended to influence and determine decisions, actions, and other matters.
Relation: Policy-001
relation: Policy-001
date: 2008-01-14

Method of Instruction
subclass of: Resource
Has Version: MethodOfInstruction-001
issued: 2008-01-14
type: Class
comment: A process that is used to engender knowledge, attitudes, and skills.
Relation: MethodOfInstruction-001
relation: MethodOfInstruction-001
date: 2008-01-14

has_manufacturer
range: Thing
domain: Thing
range: OBI_0000835
IAO_0000112: Santa Cruz Biotechnology is the manufacturer of many antibodies.
IAO_0000119: PERSON: Melissa Haendel
type: ObjectProperty
IAO_0000115: Organization or person that created the resource.
IAO_0000111: has manufacturer
domain: http://lodlaundromat.org/.well-known/genid/samples/jena///predicate//9d3b5a7ecddc9b4d8ddab2ec7a1e90f0/e71ada53dc142351840a8ab0e0979167#1
IAO_0000114: IAO_0000120
IAO_0000117: PERSON: Melissa Haendel
type: Property
range: Resource
domain: Resource

Size or Duration
subclass of: Resource
description: Examples include a number of pages, a specification of length, width, and breadth, or a period in hours, minutes, and seconds.
Has Version: SizeOrDuration-001
issued: 2008-01-14
type: Class
comment: A dimension or extent, or a time taken to play or execute.
subclass of: Media Type or Extent
Relation: SizeOrDuration-001
relation: SizeOrDuration-001
date: 2008-01-14

has_input_type
range: Thing
domain: Thing
type: ObjectProperty
IAO_0000112: Imaging processing software that requiresjpg format files for analysis.
domain: http://lodlaundromat.org/.well-known/genid/samples/jena///predicate//9d3b5a7ecddc9b4d8ddab2ec7a1e90f0/a5d36ab027d738e32157848695e01052#1
IAO_0000115: Software data input format.
IAO_0000114: IAO_0000120
IAO_0000119: PERSON: Melissa Haendel
IAO_0000117: PERSON: Carlo Torniai
IAO_0000111: has input format
range: ERO_0001554
type: Property
range: Resource
domain: Resource

ERO_0001047
range: http://lodlaundromat.org/.well-known/genid/samples/jena///predicate//9d3b5a7ecddc9b4d8ddab2ec7a1e90f0/05e505100be9004fd39e5c84e6f752ff#3
inverse of: has_contact
IAO_0000119: PERSON: Melissa Haendel
IAO_0000112: The PI is the contact for an instrument.
IAO_0000117: PERSON: Melissa Haendel
IAO_0000115: Resources for which the person is a contact.
IAO_0000114: IAO_0000120
type: Property
range: Resource
range: Thing

Period of Time
subclass of: Resource
Has Version: PeriodOfTime-001
issued: 2008-01-14
type: Class
comment: An interval of time that is named or defined by its start and end dates.
subclass of: Location, Period, or Jurisdiction
Relation: PeriodOfTime-001
relation: PeriodOfTime-001
date: 2008-01-14

Rights Statement
subclass of: Resource
Has Version: RightsStatement-001
issued: 2008-01-14
type: Class
comment: A statement about the intellectual property rights (IPR) held in or over a Resource, a legal document giving official permission to do something with a resource, or a statement about access rights.
Relation: RightsStatement-001
relation: RightsStatement-001
date: 2008-01-14

realizes_protocol
range: Thing
domain: Thing
comment: placeholder: need to be modeled for the proper kind of service (production services)
IAO_0000114: IAO_0000120
domain: http://lodlaundromat.org/.well-known/genid/samples/jena///predicate//9d3b5a7ecddc9b4d8ddab2ec7a1e90f0/534903d94173e7e1d5d3e9341b972ff3#1
range: OBI_0000272
IAO_0000111: realizes protocol
IAO_0000112: A sequencing protocol used for next generation sequencing.
IAO_0000117: PERSON: Melissa Haendel
type: ObjectProperty
IAO_0000119: PERSON: Melissa Haendel
IAO_0000115: Protocol used to perform the service.
type: Property
range: http://lodlaundromat.org/.well-known/genid/samples/jena///predicate//9d3b5a7ecddc9b4d8ddab2ec7a1e90f0/21a971cc798913fbfb78af46fe026f71#1
range: http://lodlaundromat.org/.well-known/genid/samples/jena///predicate//9d3b5a7ecddc9b4d8ddab2ec7a1e90f0/dfd971e48b118a3ebf1f3f1c1d8c9deb#1
range: Resource
domain: Resource

Location
subclass of: Resource
Has Version: Location-001
issued: 2008-01-14
type: Class
comment: A spatial region or named place.
subclass of: Location, Period, or Jurisdiction
Relation: Location-001
relation: Location-001
date: 2008-01-14

has_topic
range: Thing
domain: Thing
domain: http://lodlaundromat.org/.well-known/genid/samples/jena///predicate//9d3b5a7ecddc9b4d8ddab2ec7a1e90f0/21a971cc798913fbfb78af46fe026f71#1
IAO_0000119: PERSON: Melissa Haendel
type: ObjectProperty
IAO_0000117: PERSON: Melissa Haendel
IAO_0000114: IAO_0000120
comment: here we need to take care of dofferent domain and is this really the same relation between research project and protocol?
IAO_0000111: has topic
IAO_0000115: Organism, biological process, or disease that is the subject matter of the research project or protocol.
range: http://lodlaundromat.org/.well-known/genid/samples/jena///predicate//9d3b5a7ecddc9b4d8ddab2ec7a1e90f0/21a971cc798913fbfb78af46fe026f71#7
IAO_0000112: A research project focuses on a specific topic, such as cancer research.
type: Property
range: Resource
domain: Resource

used_to_study
range: Thing
domain: Thing
IAO_0000115: Biological process studied in the organism.
IAO_0000119: PERSON: Melissa Haendel
IAO_0000117: PERSON: Melissa Haendel
type: ObjectProperty
domain: ERO_0000985
IAO_0000112: A study of hibernation in bears.
IAO_0000114: IAO_0000120
type: AnnotationProperty
range: GO_0008150
IAO_0000111: used to study
type: Property
range: Resource
range: http://lodlaundromat.org/.well-known/genid/samples/jena///predicate//9d3b5a7ecddc9b4d8ddab2ec7a1e90f0/21a971cc798913fbfb78af46fe026f71#7
domain: Resource
domain: http://lodlaundromat.org/.well-known/genid/samples/jena///predicate//9d3b5a7ecddc9b4d8ddab2ec7a1e90f0/aa9f754ebe235041f3c247a6e7d85a46#1

expresses_construct
range: Thing
domain: Thing
IAO_0000115: Construct that has been introduced into the genome of a permanent cell culture.
IAO_0000112: A cell line that overexpresses a gene.
range: ERO_0000285
domain: CLO_0000031
IAO_0000117: PERSON: Melissa Haendel
type: ObjectProperty
IAO_0000119: PERSON: Melissa Haendel
type: AnnotationProperty
IAO_0000111: expresses construct
IAO_0000114: IAO_0000120
type: Property
range: Resource
range: http://lodlaundromat.org/.well-known/genid/samples/jena///predicate//9d3b5a7ecddc9b4d8ddab2ec7a1e90f0/72d20206d7fa20a0bceb45a38012adfc#1
range: http://lodlaundromat.org/.well-known/genid/samples/jena///predicate//9d3b5a7ecddc9b4d8ddab2ec7a1e90f0/a87df05138333be5591318e2dcf76368#1
range: http://lodlaundromat.org/.well-known/genid/samples/jena///predicate//9d3b5a7ecddc9b4d8ddab2ec7a1e90f0/ad2b4b28e2fc44bac15e197e72a08df5#1
domain: Resource
domain: http://lodlaundromat.org/.well-known/genid/samples/jena///predicate//9d3b5a7ecddc9b4d8ddab2ec7a1e90f0/a87df05138333be5591318e2dcf76368#1
domain: http://lodlaundromat.org/.well-known/genid/samples/jena///predicate//9d3b5a7ecddc9b4d8ddab2ec7a1e90f0/36ca9410df5533eba2dd65b38736e67d#1
domain: http://lodlaundromat.org/.well-known/genid/samples/jena///predicate//9d3b5a7ecddc9b4d8ddab2ec7a1e90f0/72d20206d7fa20a0bceb45a38012adfc#1
domain: http://lodlaundromat.org/.well-known/genid/samples/jena///predicate//9d3b5a7ecddc9b4d8ddab2ec7a1e90f0/aa9f754ebe235041f3c247a6e7d85a46#1
domain: http://lodlaundromat.org/.well-known/genid/samples/jena///predicate//9d3b5a7ecddc9b4d8ddab2ec7a1e90f0/391d3a6cca803c8603c11abb4285af4f#1
domain: http://lodlaundromat.org/.well-known/genid/samples/jena///predicate//9d3b5a7ecddc9b4d8ddab2ec7a1e90f0/d40a630bafd46234eff5dafe5e8651f8#1

Standard
subclass of: Resource
Has Version: Standard-001
issued: 2008-01-14
type: Class
comment: A basis for comparison; a reference point against which other things can be evaluated.
Relation: Standard-001
relation: Standard-001
date: 2008-01-14

located in
range: Thing
domain: Thing
source: http://www.obofoundry.org/ro/#OBO_REL:located_in
RO_0001900: RO_0001901
IAO_0000112: this rat is located in this cage
IAO_0000115: a relation between two independent continuants, the target and the location, in which the target is entirely within the location
IAO_0000112: my brain is located in my head
IAO_0000116: Most location relations will only hold at certain times, but this is difficult to specify in OWL. See https://code.google.com/p/obo-relations/wiki/ROAndTime
type: TransitiveProperty
IAO_0000111: located in
type: ObjectProperty
IAO_0000118: located_in
IAO_0000116: Location as a relation between instances: The primitive instance-level relation c located_in r at t reflects the fact that each continuant is at any given time associated with exactly one spatial region, namely its exact location. Following we can use this relation to define a further instance-level location relation - not between a continuant and the region which it exactly occupies, but rather between one continuant and another. c is located in c1, in this sense, whenever the spatial region occupied by c is part_of the spatial region occupied by c1. Note that this relation comprehends both the relation of exact location between one continuant and another which obtains when r and r1 are identical (for example, when a portion of fluid exactly fills a cavity), as well as those sorts of inexact location relations which obtain, for example, between brain and head or between ovum and uterus
type: Property
range: Resource
domain: Resource

has_output_type
range: Thing
domain: Thing
IAO_0000112: Microsoft Excel arranges and saves data inxlsx format.
IAO_0000115: Software data output type.
range: ERO_0001554
type: ObjectProperty
IAO_0000114: IAO_0000120
domain: ERO_0000071
IAO_0000119: PERSON: Melissa Haendel
IAO_0000117: PERSON: Carlo Torniai
IAO_0000111: has output format
type: AnnotationProperty
type: Property
range: Resource
domain: Resource
domain: http://lodlaundromat.org/.well-known/genid/samples/jena///predicate//9d3b5a7ecddc9b4d8ddab2ec7a1e90f0/e71ada53dc142351840a8ab0e0979167#1
domain: http://lodlaundromat.org/.well-known/genid/samples/jena///predicate//9d3b5a7ecddc9b4d8ddab2ec7a1e90f0/a5d36ab027d738e32157848695e01052#1
domain: http://lodlaundromat.org/.well-known/genid/samples/jena///predicate//9d3b5a7ecddc9b4d8ddab2ec7a1e90f0/6b3847c77327f4f1eeba3b76b3cfd58d#1
domain: http://lodlaundromat.org/.well-known/genid/samples/jena///predicate//9d3b5a7ecddc9b4d8ddab2ec7a1e90f0/72d20206d7fa20a0bceb45a38012adfc#1
domain: http://lodlaundromat.org/.well-known/genid/samples/jena///predicate//9d3b5a7ecddc9b4d8ddab2ec7a1e90f0/7f4f0183f112bd9472e6e589155e0bc3#1
domain: http://lodlaundromat.org/.well-known/genid/samples/jena///predicate//9d3b5a7ecddc9b4d8ddab2ec7a1e90f0/dfd971e48b118a3ebf1f3f1c1d8c9deb#1
domain: http://lodlaundromat.org/.well-known/genid/samples/jena///predicate//9d3b5a7ecddc9b4d8ddab2ec7a1e90f0/f52b5e1c70e77f526939b8555d4b0480#1
domain: http://lodlaundromat.org/.well-known/genid/samples/jena///predicate//9d3b5a7ecddc9b4d8ddab2ec7a1e90f0/ac57621756d69b1ec109c38c08182ee5#1
domain: http://lodlaundromat.org/.well-known/genid/samples/jena///predicate//9d3b5a7ecddc9b4d8ddab2ec7a1e90f0/48f097c2d5f1eeca031c1862c7986852#1

related_viral_construct
range: Thing
domain: Thing
type: AnnotationProperty
inverse of: ERO_0000917
IAO_0000115: Construct used to generate active virus.
type: ObjectProperty
range: ERO_0000619
IAO_0000117: PERSON: Melissa Haendel
IAO_0000112: The construct pWPI-GFP is used to generate GFP viral supernatants.
domain: NCBITaxon_10239
IAO_0000111: related viral construct
IAO_0000119: PERSON: Melissa Haendel
IAO_0000114: IAO_0000120
type: Property
range: Resource
domain: Resource

Date Created
sub property of: date
range: Literal
Date Modified: 2008-01-14
comment: Date of creation of the resource.
type: Property
Has Version: created-003
issued: 2000-07-11
sub property of: Date
Relation: created-003
relation: created-003
date: 2008-01-14
date: 2000-07-11
range: Resource

Accrual Method
Has Version: accrualMethod-003
issued: 2005-06-13
Date Modified: 2010-10-11
type: Property
comment: The method by which items are added to a collection.
domain: Collection
range: Method of Accrual
Relation: accrualMethod-003
relation: accrualMethod-003
date: 2010-10-11
date: 2005-06-13
range: Resource
domain: Resource

performs
IAO_0000119: PERSON: Melissa Haendel

Accrual Periodicity
Has Version: accrualPeriodicity-003
issued: 2005-06-13
Date Modified: 2010-10-11
type: Property
comment: The frequency with which items are added to a collection.
domain: Collection
range: Frequency
Relation: accrualPeriodicity-003
relation: accrualPeriodicity-003
date: 2010-10-11
date: 2005-06-13
range: Resource
domain: Resource

Description
description: Description may include but is not limited to: an abstract, a table of contents, a graphical representation, or a free-text account of the resource.
Has Version: descriptionT-001
issued: 2008-01-14
Date Modified: 2008-01-14
type: Property
comment: An account of the resource.
sub property of: description
Relation: descriptionT-001
relation: descriptionT-001
date: 2008-01-14

version
type: DatatypeProperty
IAO_0000119: PERSON: Melissa Haendel
IAO_0000117: PERSON: Melissa Haendel
IAO_0000115: Software edition, typically a numeral followed by a decimal and another numeral, such as 2.1.
IAO_0000112: v 1.0
IAO_0000114: IAO_0000120
range: string
domain: http://lodlaundromat.org/.well-known/genid/samples/jena///predicate//9d3b5a7ecddc9b4d8ddab2ec7a1e90f0/ac57621756d69b1ec109c38c08182ee5#1
type: Property
range: Resource
domain: Resource
domain: Thing

ERO_0000042
IAO_0000115: Individual's forename.
IAO_0000119: PERSON: Melissa Haendel
IAO_0000112: Nicole
IAO_0000114: IAO_0000120

UDC
Has Version: UDC-003
issued: 2000-07-11
Date Modified: 2008-01-14
type: VocabularyEncodingScheme
comment: The set of conceptual resources specified by the Universal Decimal Classification.
Relation: UDC-003
relation: UDC-003
date: 2008-01-14
date: 2000-07-11

Is Replaced By
type: Property
sub property of: relation
note: This term is intended to be used with non-literal values as defined in the DCMI Abstract Model (http://dublincore.org/documents/abstract-model/). As of December 2007, the DCMI Usage Board is seeking a way to express this intention with a formal range declaration.
Date Modified: 2008-01-14
issued: 2000-07-11
sub property of: Relation
Has Version: isReplacedBy-003
comment: A related resource that supplants, displaces, or supersedes the described resource.
Relation: isReplacedBy-003
relation: isReplacedBy-003
date: 2008-01-14
date: 2000-07-11

Has Part
type: Property
Date Modified: 2008-01-14
issued: 2000-07-11
comment: A related resource that is included either physically or logically in the described resource.
note: This term is intended to be used with non-literal values as defined in the DCMI Abstract Model (http://dublincore.org/documents/abstract-model/). As of December 2007, the DCMI Usage Board is seeking a way to express this intention with a formal range declaration.
sub property of: relation
Has Version: hasPart-003
sub property of: Relation
Relation: hasPart-003
relation: hasPart-003
date: 2008-01-14
date: 2000-07-11

Relation
note: This term is intended to be used with non-literal values as defined in the DCMI Abstract Model (http://dublincore.org/documents/abstract-model/). As of December 2007, the DCMI Usage Board is seeking a way to express this intention with a formal range declaration.
comment: A related resource.
description: Recommended best practice is to identify the related resource by means of a string conforming to a formal identification system.
Has Version: relationT-001
type: Property
sub property of: relation
issued: 2008-01-14
Date Modified: 2008-01-14
Relation: relationT-001
relation: relationT-001
date: 2008-01-14

Is Part Of
issued: 2000-07-11
type: Property
sub property of: relation
sub property of: Relation
Date Modified: 2008-01-14
note: This term is intended to be used with non-literal values as defined in the DCMI Abstract Model (http://dublincore.org/documents/abstract-model/). As of December 2007, the DCMI Usage Board is seeking a way to express this intention with a formal range declaration.
Has Version: isPartOf-003
comment: A related resource in which the described resource is physically or logically included.
Relation: isPartOf-003
relation: isPartOf-003
date: 2008-01-14
date: 2000-07-11

Table Of Contents
Has Version: tableOfContents-003
issued: 2000-07-11
Date Modified: 2008-01-14
type: Property
comment: A list of subunits of the resource.
sub property of: description
sub property of: Description
Relation: tableOfContents-003
relation: tableOfContents-003
date: 2008-01-14
date: 2000-07-11

RFC 5646
description: RFC 5646 obsoletes RFC 4646.
Has Version: RFC5646-001
issued: 2010-10-11
type: Datatype
comment: The set of tags constructed according to RFC 5646 for the identification of languages.
Relation: RFC5646-001
relation: RFC5646-001
date: 2010-10-11
type: Class

ERO_0000597
IAO_0000114: IAO_0000120
IAO_0000111: funded by
IAO_0000112: The lab is funded by the NIH.

Date Copyrighted
range: Literal
type: Property
sub property of: Date
comment: Date of copyright.
sub property of: date
issued: 2002-07-13
Date Modified: 2008-01-14
Has Version: dateCopyrighted-002
Relation: dateCopyrighted-002
relation: dateCopyrighted-002
date: 2008-01-14
date: 2002-07-13
range: Resource

Coverage
issued: 2008-01-14
comment: The spatial or temporal topic of the resource, the spatial applicability of the resource, or the jurisdiction under which the resource is relevant.
Has Version: coverageT-001
Date Modified: 2008-01-14
sub property of: coverage
type: Property
range: Location, Period, or Jurisdiction
description: Spatial topic and spatial applicability may be a named place or a location specified by its geographic coordinates. Temporal topic may be a named period, date, or date range. A jurisdiction may be a named administrative entity or a geographic place to which the resource applies. Recommended best practice is to use a controlled vocabulary such as the Thesaurus of Geographic Names [TGN]. Where appropriate, named places or time periods can be used in preference to numeric identifiers such as sets of coordinates or date ranges.
Relation: coverageT-001
relation: coverageT-001
date: 2008-01-14
range: Resource

NLM
Has Version: NLM-002
issued: 2005-06-13
Date Modified: 2008-01-14
type: VocabularyEncodingScheme
comment: The set of conceptual resources specified by the National Library of Medicine Classification.
Relation: NLM-002
relation: NLM-002
date: 2008-01-14
date: 2005-06-13

Accrual Policy
Has Version: accrualPolicy-003
issued: 2005-06-13
Date Modified: 2010-10-11
type: Property
comment: The policy governing the addition of items to a collection.
domain: Collection
range: Policy
Relation: accrualPolicy-003
relation: accrualPolicy-003
date: 2010-10-11
date: 2005-06-13
range: Resource
domain: Resource

has_source
domain: ERO_0000985
range: string
type: AnnotationProperty
IAO_0000112: A mouse house in a research lab.
IAO_0000115: Organism’s source environment or clinical setting.
IAO_0000119: PERSON: Melissa Haendel
IAO_0000115: Organism�s source environment or clinical setting.
IAO_0000114: IAO_0000120
IAO_0000111: has source
type: DatatypeProperty
IAO_0000117: PERSON: Melissa Haendel
type: Property
range: Resource
domain: Thing
domain: Resource
domain: http://lodlaundromat.org/.well-known/genid/samples/jena///predicate//9d3b5a7ecddc9b4d8ddab2ec7a1e90f0/aa9f754ebe235041f3c247a6e7d85a46#1

Provenance
description: The statement may include a description of any changes successive custodians made to the resource.
Has Version: provenance-002
issued: 2004-09-20
Date Modified: 2008-01-14
type: Property
comment: A statement of any changes in ownership and custody of the resource since its creation that are significant for its authenticity, integrity, and interpretation.
range: Provenance Statement
Relation: provenance-002
relation: provenance-002
date: 2008-01-14
date: 2004-09-20
range: Resource

LCC
Has Version: LCC-003
issued: 2000-07-11
Date Modified: 2008-01-14
type: VocabularyEncodingScheme
comment: The set of conceptual resources specified by the Library of Congress Classification.
Relation: LCC-003
relation: LCC-003
date: 2008-01-14
date: 2000-07-11

operating_system
IAO_0000111: operating system
domain: http://lodlaundromat.org/.well-known/genid/samples/jena///predicate//9d3b5a7ecddc9b4d8ddab2ec7a1e90f0/f52b5e1c70e77f526939b8555d4b0480#1
type: DatatypeProperty
IAO_0000117: PERSON: Melissa Haendel
IAO_0000114: IAO_0000120
IAO_0000112: Microsoft Windows
IAO_0000119: PERSON: Melissa Haendel
range: string
IAO_0000115: Computer operating system used by the software, such as Windows, MacOS, or Linux.
type: Property
range: Resource
domain: Resource
domain: Thing

Title
Has Version: titleT-002
issued: 2008-01-14
Date Modified: 2010-10-11
type: Property
comment: A name given to the resource.
range: Literal
sub property of: title
Relation: titleT-002
relation: titleT-002
date: 2010-10-11
date: 2008-01-14
range: Resource

IMT
Has Version: IMT-004
issued: 2000-07-11
Date Modified: 2008-01-14
type: VocabularyEncodingScheme
comment: The set of media types specified by the Internet Assigned Numbers Authority.
Relation: IMT-004
relation: IMT-004
date: 2008-01-14
date: 2000-07-11

Medium
range: Physical Medium
comment: The material or physical carrier of the resource.
domain: Physical Resource
issued: 2000-07-11
type: Property
Has Version: medium-003
sub property of: Format
Date Modified: 2008-01-14
sub property of: format
Relation: medium-003
relation: medium-003
date: 2008-01-14
date: 2000-07-11
range: Media Type or Extent
range: Resource
range: Media Type
domain: Resource

has_accession_number
IAO_0000111: accession number
IAO_0000115: Unique identifier of a biological polymer sequence (DNA, RNA, protein) when it is submitted to a sequence database.
IAO_0000112: The accession number for a gene.
IAO_0000114: IAO_0000120
range: string
domain: http://lodlaundromat.org/.well-known/genid/samples/jena///predicate//9d3b5a7ecddc9b4d8ddab2ec7a1e90f0/ad2b4b28e2fc44bac15e197e72a08df5#1
IAO_0000119: PERSON: Melissa Haendel
IAO_0000117: PERSON: Melissa Haendel
type: DatatypeProperty
type: Property
range: Resource
domain: Thing
domain: Resource

Date Available
comment: Date (often a range) that the resource became or will become available.
issued: 2000-07-11
Has Version: available-003
sub property of: date
Date Modified: 2008-01-14
type: Property
sub property of: Date
range: Literal
Relation: available-003
relation: available-003
date: 2008-01-14
date: 2000-07-11
range: Resource

has_entrez_gene_id
type: DatatypeProperty
IAO_0000115: A unique identifier assigned to each record in the Entrez Gene database.
IAO_0000119: PERSON: Melissa Haendel
IAO_0000114: IAO_0000120
type: FunctionalProperty
IAO_0000111: has entrez gene id
IAO_0000117: PERSON: Melissa Haendel
range: string
domain: http://lodlaundromat.org/.well-known/genid/samples/jena///predicate//9d3b5a7ecddc9b4d8ddab2ec7a1e90f0/2b6b0fd79c60db06664bbf5c75da9f9d#1
IAO_0000112: The entrez gene ID of mouse CD34 is 12490.
type: Property
range: Resource
domain: Thing
domain: Resource

Has Format
issued: 2000-07-11
Date Modified: 2008-01-14
type: Property
comment: A related resource that is substantially the same as the pre-existing described resource, but in another format.
Has Version: hasFormat-003
sub property of: Relation
note: This term is intended to be used with non-literal values as defined in the DCMI Abstract Model (http://dublincore.org/documents/abstract-model/). As of December 2007, the DCMI Usage Board is seeking a way to express this intention with a formal range declaration.
sub property of: relation
Relation: hasFormat-003
relation: hasFormat-003
date: 2008-01-14
date: 2000-07-11

has_gene_symbol
range: string
IAO_0000114: IAO_0000120
IAO_0000112: CD4.
IAO_0000115: The official symbol for the gene.
IAO_0000117: PERSON: Nicole Vasilevsky
IAO_0000111: has gene symbol
IAO_0000119: PERSON: Nicole Vasilevsky
type: DatatypeProperty
domain: http://lodlaundromat.org/.well-known/genid/samples/jena///predicate//9d3b5a7ecddc9b4d8ddab2ec7a1e90f0/b51c5599695347aae0343cc44624199c#1
type: Property
range: Resource
domain: Thing
domain: Resource

DDC
Has Version: DDC-003
issued: 2000-07-11
Date Modified: 2008-01-14
type: VocabularyEncodingScheme
comment: The set of conceptual resources specified by the Dewey Decimal Classification.
Relation: DDC-003
relation: DDC-003
date: 2008-01-14
date: 2000-07-11

library_count
IAO_0000111: library count
IAO_0000112: 100 RNAi oligos in an oligo library.
range: int
IAO_0000117: PERSON: Melissa Haendel
IAO_0000115: Number of elements in the library.
type: DatatypeProperty
domain: http://lodlaundromat.org/.well-known/genid/samples/jena///predicate//9d3b5a7ecddc9b4d8ddab2ec7a1e90f0/6c92f719d7c2573769152baefc4f3d55#1
IAO_0000114: IAO_0000120
IAO_0000119: PERSON: Melissa Haendel
type: Property
range: decimal
range: Resource
range: integer
range: long
domain: Resource
domain: Thing

has_lot_number
type: DatatypeProperty
IAO_0000117: PERSON: Nicole Vasilevsky
IAO_0000119: http://www.answers.com/topic/lot-number
range: string
IAO_0000114: IAO_0000120
IAO_0000112: 4521
type: AnnotationProperty
IAO_0000111: has lot number
IAO_0000115: The identification number assigned to a particular quantity or lot of material from a single manufacturer.
domain: ERO_0000008
type: Property
range: Resource
domain: http://lodlaundromat.org/.well-known/genid/samples/jena///predicate//9d3b5a7ecddc9b4d8ddab2ec7a1e90f0/a87df05138333be5591318e2dcf76368#1
domain: Resource
domain: Thing
domain: http://lodlaundromat.org/.well-known/genid/samples/jena///predicate//9d3b5a7ecddc9b4d8ddab2ec7a1e90f0/d40a630bafd46234eff5dafe5e8651f8#1

ERO_0000049
IAO_0000117: PERSON: Melissa Haendel
IAO_0000115: Individual’s surname.
IAO_0000112: Smith

RFC 4646
description: RFC 4646 obsoletes RFC 3066.
Has Version: RFC4646-001
issued: 2008-01-14
type: Datatype
comment: The set of tags constructed according to RFC 4646 for the identification of languages.
Relation: RFC4646-001
relation: RFC4646-001
date: 2008-01-14
type: Class

model_number
type: DatatypeProperty
IAO_0000119: PERSON: Melissa Haendel
IAO_0000114: IAO_0000120
range: string
IAO_0000112: ABI 9000
IAO_0000117: PERSON: Melissa Haendel
domain: ERO_0000004
IAO_0000115: Instrument model number, which may be a name, number, or both.
type: AnnotationProperty
IAO_0000111: model number
type: Property
range: Resource
domain: http://lodlaundromat.org/.well-known/genid/samples/jena///predicate//9d3b5a7ecddc9b4d8ddab2ec7a1e90f0/dfd971e48b118a3ebf1f3f1c1d8c9deb#1
domain: Resource
domain: Thing
domain: http://lodlaundromat.org/.well-known/genid/samples/jena///predicate//9d3b5a7ecddc9b4d8ddab2ec7a1e90f0/48f097c2d5f1eeca031c1862c7986852#1
domain: http://lodlaundromat.org/.well-known/genid/samples/jena///predicate//9d3b5a7ecddc9b4d8ddab2ec7a1e90f0/e71ada53dc142351840a8ab0e0979167#1
domain: http://lodlaundromat.org/.well-known/genid/samples/jena///predicate//9d3b5a7ecddc9b4d8ddab2ec7a1e90f0/1bd51fc2161c927d8ffd34d4f76b4b42#5
domain: http://lodlaundromat.org/.well-known/genid/samples/jena///predicate//9d3b5a7ecddc9b4d8ddab2ec7a1e90f0/72d20206d7fa20a0bceb45a38012adfc#1
domain: http://lodlaundromat.org/.well-known/genid/samples/jena///predicate//9d3b5a7ecddc9b4d8ddab2ec7a1e90f0/a87df05138333be5591318e2dcf76368#1
domain: http://lodlaundromat.org/.well-known/genid/samples/jena///predicate//9d3b5a7ecddc9b4d8ddab2ec7a1e90f0/6b3847c77327f4f1eeba3b76b3cfd58d#1
domain: http://lodlaundromat.org/.well-known/genid/samples/jena///predicate//9d3b5a7ecddc9b4d8ddab2ec7a1e90f0/7f4f0183f112bd9472e6e589155e0bc3#1

Bibliographic Citation
Has Version: bibliographicCitation-002
description: Recommended practice is to include sufficient bibliographic detail to identify the resource as unambiguously as possible.
range: Literal
domain: Bibliographic Resource
comment: A bibliographic reference for the resource.
type: Property
sub property of: identifier
issued: 2003-02-15
Date Modified: 2008-01-14
sub property of: Identifier
Relation: bibliographicCitation-002
relation: bibliographicCitation-002
date: 2008-01-14
date: 2003-02-15
range: Resource
domain: Resource

Replaces
Has Version: replaces-003
note: This term is intended to be used with non-literal values as defined in the DCMI Abstract Model (http://dublincore.org/documents/abstract-model/). As of December 2007, the DCMI Usage Board is seeking a way to express this intention with a formal range declaration.
Date Modified: 2008-01-14
comment: A related resource that is supplanted, displaced, or superseded by the described resource.
sub property of: relation
sub property of: Relation
type: Property
issued: 2000-07-11
Relation: replaces-003
relation: replaces-003
date: 2008-01-14
date: 2000-07-11

DCMI Box
Has Version: Box-003
issued: 2000-07-11
Date Modified: 2008-01-14
type: Datatype
comment: The set of regions in space defined by their geographic coordinates according to the DCMI Box Encoding Scheme.
Relation: Box-003
relation: Box-003
date: 2008-01-14
date: 2000-07-11
type: Class

DCMI Metadata Terms - other
Date Modified: 2012-06-14
publisher: DCMI
date: 2012-06-14

Temporal Coverage
sub property of: Coverage
Has Version: temporal-003
type: Property
issued: 2000-07-11
Date Modified: 2008-01-14
range: Period of Time
comment: Temporal characteristics of the resource.
sub property of: coverage
Relation: temporal-003
relation: temporal-003
date: 2008-01-14
date: 2000-07-11
range: Location, Period, or Jurisdiction
range: Resource

ISO 639-2
Has Version: ISO639-2-003
issued: 2000-07-11
Date Modified: 2008-01-14
type: Datatype
comment: The three-letter alphabetic codes listed in ISO639-2 for the representation of names of languages.
Relation: ISO639-2-003
relation: ISO639-2-003
date: 2008-01-14
date: 2000-07-11
type: Class

Date Valid
type: Property
range: Literal
issued: 2000-07-11
sub property of: date
comment: Date (often a range) of validity of a resource.
Date Modified: 2008-01-14
sub property of: Date
Has Version: valid-003
Relation: valid-003
relation: valid-003
date: 2008-01-14
date: 2000-07-11
range: Resource

has_study_population
type: DatatypeProperty
IAO_0000112: African american study population.
IAO_0000117: PERSON: Melissa Haendel
IAO_0000115: Characteristics of the human population being studied. May include number, demographic or geographic information, inclusion or exclusion criteria, or other descriptive information.
IAO_0000111: study population
type: AnnotationProperty
range: string
domain: ERO_0000015
IAO_0000119: PERSON: Melissa Haendel
IAO_0000114: IAO_0000120
type: Property
range: Resource
domain: http://lodlaundromat.org/.well-known/genid/samples/jena///predicate//9d3b5a7ecddc9b4d8ddab2ec7a1e90f0/48f097c2d5f1eeca031c1862c7986852#1
domain: Thing
domain: Resource

RFC 3066
description: RFC 3066 has been obsoleted by RFC 4646.
Has Version: RFC3066-002
issued: 2002-07-13
Date Modified: 2008-01-14
type: Datatype
comment: The set of tags constructed according to RFC 3066 for the identification of languages.
Relation: RFC3066-002
relation: RFC3066-002
date: 2008-01-14
date: 2002-07-13
type: Class

has_inventory_number
IAO_0000111: has inventory number
IAO_0000115: Inventory identifier for the resource.
IAO_0000114: IAO_0000120
range: string
type: DatatypeProperty
IAO_0000117: PERSON: Melissa Haendel
IAO_0000119: PERSON: Melissa Haendel
domain: http://lodlaundromat.org/.well-known/genid/samples/jena///predicate//9d3b5a7ecddc9b4d8ddab2ec7a1e90f0/a87df05138333be5591318e2dcf76368#1
IAO_0000112: An example inventory number can be in the form: 12345
type: Property
range: Resource
domain: Resource
domain: Thing

has_insert_size
IAO_0000111: insert size
type: DatatypeProperty
type: AnnotationProperty
IAO_0000114: IAO_0000120
IAO_0000115: Number of base pairs in the insert.
domain: ERO_0000404
IAO_0000119: PERSON: Melissa Haendel
IAO_0000117: PERSON: Melissa Haendel
range: string
IAO_0000112: A 40bp insert.
type: Property
range: Resource
domain: Resource
domain: http://lodlaundromat.org/.well-known/genid/samples/jena///predicate//9d3b5a7ecddc9b4d8ddab2ec7a1e90f0/5de74ec44e1c11703c1bac9bd6d7893b#1
domain: Thing
domain: http://lodlaundromat.org/.well-known/genid/samples/jena///predicate//9d3b5a7ecddc9b4d8ddab2ec7a1e90f0/ad2b4b28e2fc44bac15e197e72a08df5#1
domain: http://lodlaundromat.org/.well-known/genid/samples/jena///predicate//9d3b5a7ecddc9b4d8ddab2ec7a1e90f0/b51c5599695347aae0343cc44624199c#1
domain: http://lodlaundromat.org/.well-known/genid/samples/jena///predicate//9d3b5a7ecddc9b4d8ddab2ec7a1e90f0/2b6b0fd79c60db06664bbf5c75da9f9d#1

has_eligibility_requirment
domain: ERO_0000595
IAO_0000119: PERSON: Melissa Haendel
IAO_0000115: Requirements for research opportunity eligibility. Requirements include: coursework, minimum gradepoint average, state residency, under-represented group status, field of study, or matriculation status.
range: string
IAO_0000112: A grade point average above 3.5 is an eligibility requirement.
IAO_0000114: IAO_0000120
IAO_0000117: PERSON: Melissa Haendel
type: AnnotationProperty
type: DatatypeProperty
IAO_0000111: has eligibility requirement
type: Property
range: Resource
domain: Thing
domain: Resource
domain: http://lodlaundromat.org/.well-known/genid/samples/jena///predicate//9d3b5a7ecddc9b4d8ddab2ec7a1e90f0/48f097c2d5f1eeca031c1862c7986852#1

Extent
type: Property
comment: The size or duration of the resource.
issued: 2000-07-11
range: Size or Duration
Has Version: extent-003
Date Modified: 2008-01-14
sub property of: format
sub property of: Format
Relation: extent-003
relation: extent-003
date: 2008-01-14
date: 2000-07-11
range: Media Type or Extent
range: Resource

URI
Has Version: URI-003
issued: 2000-07-11
Date Modified: 2008-01-14
type: Datatype
comment: The set of identifiers constructed according to the generic syntax for Uniform Resource Identifiers as specified by the Internet Engineering Task Force.
Relation: URI-003
relation: URI-003
date: 2008-01-14
date: 2000-07-11
type: Class

Date
issued: 2008-01-14
comment: A point or period of time associated with an event in the lifecycle of the resource.
description: Date may be used to express temporal information at any level of granularity. Recommended best practice is to use an encoding scheme, such as the W3CDTF profile of ISO 8601 [W3CDTF].
Has Version: dateT-001
Date Modified: 2008-01-14
type: Property
range: Literal
sub property of: date
Relation: dateT-001
relation: dateT-001
date: 2008-01-14
range: Resource

W3C-DTF
Has Version: W3CDTF-003
issued: 2000-07-11
Date Modified: 2008-01-14
type: Datatype
comment: The set of dates and times constructed according to the W3C Date and Time Formats Specification.
Relation: W3CDTF-003
relation: W3CDTF-003
date: 2008-01-14
date: 2000-07-11
type: Class

Access Rights
range: Rights Statement
type: Property
issued: 2003-02-15
comment: Information about who can access the resource or an indication of its security status.
description: Access Rights may include information regarding access or restrictions based on privacy, security, or other policies.
sub property of: rights
sub property of: Rights
Date Modified: 2008-01-14
Has Version: accessRights-002
Relation: accessRights-002
relation: accessRights-002
date: 2008-01-14
date: 2003-02-15
range: Resource

TGN
Has Version: TGN-003
issued: 2000-07-11
Date Modified: 2008-01-14
type: VocabularyEncodingScheme
comment: The set of places specified by the Getty Thesaurus of Geographic Names.
Relation: TGN-003
relation: TGN-003
date: 2008-01-14
date: 2000-07-11

DCMI Type Vocabulary
Has Version: DCMIType-005
issued: 2000-07-11
Date Modified: 2012-06-14
type: VocabularyEncodingScheme
comment: The set of classes specified by the DCMI Type Vocabulary, used to categorize the nature or genre of the resource.
Relation: DCMIType-005
relation: DCMIType-005
date: 2012-06-14
date: 2000-07-11

Language
Date Modified: 2008-01-14
type: Property
Has Version: languageT-001
sub property of: language
description: Recommended best practice is to use a controlled vocabulary such as RFC 4646 [RFC4646].
issued: 2008-01-14
comment: A language of the resource.
range: Linguistic System
Relation: languageT-001
relation: languageT-001
date: 2008-01-14
range: Resource

has_catalog_number
type: AnnotationProperty
IAO_0000117: PERSON: Nicole Vasilevsky
IAO_0000115: Catalog number of a commercially manufactured reagent.
IAO_0000119: PERSON: Nicole Vasilevsky
IAO_0000114: IAO_0000120
domain: ERO_0000006
range: string
type: DatatypeProperty
IAO_0000111: has catalog number
IAO_0000112: SC-1234
type: Property
range: Resource
domain: Resource
domain: Thing
domain: http://lodlaundromat.org/.well-known/genid/samples/jena///predicate//9d3b5a7ecddc9b4d8ddab2ec7a1e90f0/7f4f0183f112bd9472e6e589155e0bc3#1
domain: http://lodlaundromat.org/.well-known/genid/samples/jena///predicate//9d3b5a7ecddc9b4d8ddab2ec7a1e90f0/6b3847c77327f4f1eeba3b76b3cfd58d#1
domain: http://lodlaundromat.org/.well-known/genid/samples/jena///predicate//9d3b5a7ecddc9b4d8ddab2ec7a1e90f0/e71ada53dc142351840a8ab0e0979167#1
domain: http://lodlaundromat.org/.well-known/genid/samples/jena///predicate//9d3b5a7ecddc9b4d8ddab2ec7a1e90f0/dfd971e48b118a3ebf1f3f1c1d8c9deb#1
domain: http://lodlaundromat.org/.well-known/genid/samples/jena///predicate//9d3b5a7ecddc9b4d8ddab2ec7a1e90f0/48f097c2d5f1eeca031c1862c7986852#1

has_PubMed_ID
IAO_0000115: Unique numerical identifier assigned to citation of life sciences and biomedical scientific journal articles in the PubMed database.
IAO_0000119: PERSON: Melissa Haendel
IAO_0000112: The PMID for a journal article.
domain: IAO_0000013
IAO_0000114: IAO_0000120
type: AnnotationProperty
IAO_0000117: PERSON: Melissa Haendel
range: string
IAO_0000111: PubMed ID
type: DatatypeProperty
type: Property
range: Resource
domain: Resource

has_contact
IAO_0000112: The lab manager who maintains an instrument in the lab.
IAO_0000119: PERSON: Melissa Haendel
domain: http://lodlaundromat.org/.well-known/genid/samples/jena///predicate//9d3b5a7ecddc9b4d8ddab2ec7a1e90f0/05e505100be9004fd39e5c84e6f752ff#3
inverse of: ERO_0001047
type: Property
domain: Resource
domain: Thing

Is Required By
comment: A related resource that requires the described resource to support its function, delivery, or coherence.
type: Property
Date Modified: 2008-01-14
sub property of: relation
note: This term is intended to be used with non-literal values as defined in the DCMI Abstract Model (http://dublincore.org/documents/abstract-model/). As of December 2007, the DCMI Usage Board is seeking a way to express this intention with a formal range declaration.
Has Version: isRequiredBy-003
issued: 2000-07-11
sub property of: Relation
Relation: isRequiredBy-003
relation: isRequiredBy-003
date: 2008-01-14
date: 2000-07-11

ISO 639-3
Has Version: ISO639-3-001
issued: 2008-01-14
type: Datatype
comment: The set of three-letter codes listed in ISO 639-3 for the representation of names of languages.
Relation: ISO639-3-001
relation: ISO639-3-001
date: 2008-01-14
type: Class

has_restriction
IAO_0000119: PERSON: Melissa Haendel
range: string
domain: http://lodlaundromat.org/.well-known/genid/samples/jena///predicate//9d3b5a7ecddc9b4d8ddab2ec7a1e90f0/48f097c2d5f1eeca031c1862c7986852#1
IAO_0000117: PERSON: Melissa Haendel
IAO_0000112: Resource is only available to researchers in the department.
IAO_0000115: A restriction on service availability, such as university or consortium affiliation, geographical location, professional certification, or other factors.
IAO_0000114: IAO_0000120
type: DatatypeProperty
IAO_0000111: has restriction
type: Property
range: Resource
domain: Resource
domain: Thing

has_tag
IAO_0000111: insert tag
IAO_0000112: A FLAG tag on a protein.
IAO_0000117: PERSON: Melissa Haendel
range: string
type: DatatypeProperty
IAO_0000114: IAO_0000120
IAO_0000119: PERSON: Melissa Haendel
domain: http://lodlaundromat.org/.well-known/genid/samples/jena///predicate//9d3b5a7ecddc9b4d8ddab2ec7a1e90f0/5de74ec44e1c11703c1bac9bd6d7893b#1
IAO_0000115: Expression tag that allows tracking of the RNA or protein.
type: Property
range: Resource
domain: Thing
domain: Resource

Is Version Of
note: This term is intended to be used with non-literal values as defined in the DCMI Abstract Model (http://dublincore.org/documents/abstract-model/). As of December 2007, the DCMI Usage Board is seeking a way to express this intention with a formal range declaration.
Has Version: isVersionOf-003
sub property of: Relation
type: Property
sub property of: relation
comment: A related resource of which the described resource is a version, edition, or adaptation.
issued: 2000-07-11
description: Changes in version imply substantive changes in content rather than differences in format.
Date Modified: 2008-01-14
Relation: isVersionOf-003
relation: isVersionOf-003
date: 2008-01-14
date: 2000-07-11

Conforms To
issued: 2001-05-21
Date Modified: 2008-01-14
range: Standard
sub property of: relation
comment: An established standard to which the described resource conforms.
Has Version: conformsTo-003
sub property of: Relation
type: Property
Relation: conformsTo-003
relation: conformsTo-003
date: 2008-01-14
date: 2001-05-21
range: Resource

Date Issued
range: Literal
sub property of: Date
comment: Date of formal issuance (e.g., publication) of the resource.
Has Version: issued-003
Date Modified: 2008-01-14
type: Property
issued: 2000-07-11
sub property of: date
Relation: issued-003
relation: issued-003
date: 2008-01-14
date: 2000-07-11
range: Resource

Abstract
Has Version: abstract-003
issued: 2000-07-11
Date Modified: 2008-01-14
type: Property
comment: A summary of the resource.
sub property of: description
sub property of: Description
Relation: abstract-003
relation: abstract-003
date: 2008-01-14
date: 2000-07-11

Audience
Has Version: audience-003
issued: 2001-05-21
Date Modified: 2008-01-14
type: Property
comment: A class of entity for whom the resource is intended or useful.
range: Agent Class
Relation: audience-003
relation: audience-003
date: 2008-01-14
date: 2001-05-21
range: Resource
range: Class

ERO_0000070
IAO_0000117: PERSON: Melissa Haendel

References
type: Property
note: This term is intended to be used with non-literal values as defined in the DCMI Abstract Model (http://dublincore.org/documents/abstract-model/). As of December 2007, the DCMI Usage Board is seeking a way to express this intention with a formal range declaration.
issued: 2000-07-11
Date Modified: 2008-01-14
sub property of: relation
Has Version: references-003
sub property of: Relation
comment: A related resource that is referenced, cited, or otherwise pointed to by the described resource.
Relation: references-003
relation: references-003
date: 2008-01-14
date: 2000-07-11

Alternative Title
sub property of: Title
sub property of: title
type: Property
Date Modified: 2010-10-11
range: Literal
issued: 2000-07-11
description: The distinction between titles and alternative titles is application-specific.
Has Version: alternative-003
comment: An alternative name for the resource.
Relation: alternative-003
relation: alternative-003
date: 2010-10-11
date: 2000-07-11
range: Resource

Identifier
sub property of: identifier
range: Literal
Has Version: identifierT-001
description: Recommended best practice is to identify the resource by means of a string conforming to a formal identification system.
issued: 2008-01-14
type: Property
comment: An unambiguous reference to the resource within a given context.
Date Modified: 2008-01-14
Relation: identifierT-001
relation: identifierT-001
date: 2008-01-14
range: Resource

Instructional Method
description: Instructional Method will typically include ways of presenting instructional materials or conducting instructional activities, patterns of learner-to-learner and learner-to-instructor interactions, and mechanisms by which group and individual levels of learning are measured. Instructional methods include all aspects of the instruction and learning processes from planning and implementation through evaluation and feedback.
Has Version: instructionalMethod-002
issued: 2005-06-13
Date Modified: 2008-01-14
type: Property
comment: A process, used to engender knowledge, attitudes and skills, that the described resource is designed to support.
range: Method of Instruction
Relation: instructionalMethod-002
relation: instructionalMethod-002
date: 2008-01-14
date: 2005-06-13
range: Resource

title
IAO_0000114: IAO_0000120
IAO_0000117: PERSON: Melissa Haendel
range: string
type: DatatypeProperty
IAO_0000112: Professor
IAO_0000115: Designation used to refer to an individual.
type: Property
range: Resource

Date Submitted
sub property of: date
type: Property
range: Literal
comment: Date of submission of the resource.
sub property of: Date
Date Modified: 2008-01-14
issued: 2002-07-13
description: Examples of resources to which a Date Submitted may be relevant are a thesis (submitted to a university department) or an article (submitted to a journal).
Has Version: dateSubmitted-002
Relation: dateSubmitted-002
relation: dateSubmitted-002
date: 2008-01-14
date: 2002-07-13
range: Resource

Is Format Of
Has Version: isFormatOf-003
Date Modified: 2008-01-14
issued: 2000-07-11
sub property of: relation
type: Property
note: This term is intended to be used with non-literal values as defined in the DCMI Abstract Model (http://dublincore.org/documents/abstract-model/). As of December 2007, the DCMI Usage Board is seeking a way to express this intention with a formal range declaration.
sub property of: Relation
comment: A related resource that is substantially the same as the described resource, but in another format.
Relation: isFormatOf-003
relation: isFormatOf-003
date: 2008-01-14
date: 2000-07-11

ERO_0000390
IAO_0000119: PERSON: Melissa Haendel

Mediator
type: Property
range: Agent Class
issued: 2001-05-21
Has Version: mediator-003
Date Modified: 2008-01-14
comment: An entity that mediates access to the resource and for whom the resource is intended or useful.
description: In an educational context, a mediator might be a parent, teacher, teaching assistant, or care-giver.
sub property of: Audience
Relation: mediator-003
relation: mediator-003
date: 2008-01-14
date: 2001-05-21
range: Resource
range: Class

has_parental_strain_name
type: DatatypeProperty
IAO_0000111: has parental strain name
IAO_0000119: PERSON: Melissa Haendel
domain: ERO_0000985
range: string
type: AnnotationProperty
IAO_0000112: Wild type 293 cells.
IAO_0000117: PERSON: Melissa Haendel
IAO_0000115: Parental strain name of modified organisms.
IAO_0000114: IAO_0000120
type: Property
range: Resource
domain: Thing
domain: Resource
domain: http://lodlaundromat.org/.well-known/genid/samples/jena///predicate//9d3b5a7ecddc9b4d8ddab2ec7a1e90f0/aa9f754ebe235041f3c247a6e7d85a46#1

has_selectable_marker
IAO_0000119: PERSON: Melissa Haendel
type: DatatypeProperty
IAO_0000114: IAO_0000120
IAO_0000111: has selectable marker
IAO_0000117: PERSON: Melissa Haendel
IAO_0000115: Gene that confers a trait suitable for selection.
IAO_0000112: Ampicillin resistance gene.
range: string
type: AnnotationProperty
domain: ERO_0000285
type: Property
range: Resource
domain: Resource
domain: Thing
domain: http://lodlaundromat.org/.well-known/genid/samples/jena///predicate//9d3b5a7ecddc9b4d8ddab2ec7a1e90f0/ad2b4b28e2fc44bac15e197e72a08df5#1
domain: http://lodlaundromat.org/.well-known/genid/samples/jena///predicate//9d3b5a7ecddc9b4d8ddab2ec7a1e90f0/a87df05138333be5591318e2dcf76368#1
domain: http://lodlaundromat.org/.well-known/genid/samples/jena///predicate//9d3b5a7ecddc9b4d8ddab2ec7a1e90f0/72d20206d7fa20a0bceb45a38012adfc#1

has_producer_cell_type
domain: NCBITaxon_10239
IAO_0000119: PERSON: Melissa Haendel
range: string
type: DatatypeProperty
IAO_0000111: has producer cell type
IAO_0000115: Type of cell in which the virus may be produced.
IAO_0000112: 293T cells are used to produce a lentiviral supernatant.
IAO_0000114: IAO_0000120
type: AnnotationProperty
IAO_0000117: PERSON: Melissa Haendel
type: Property
range: Resource
domain: Resource

Is Referenced By
Date Modified: 2008-01-14
issued: 2000-07-11
sub property of: relation
note: This term is intended to be used with non-literal values as defined in the DCMI Abstract Model (http://dublincore.org/documents/abstract-model/). As of December 2007, the DCMI Usage Board is seeking a way to express this intention with a formal range declaration.
comment: A related resource that references, cites, or otherwise points to the described resource.
type: Property
sub property of: Relation
Has Version: isReferencedBy-003
Relation: isReferencedBy-003
relation: isReferencedBy-003
date: 2008-01-14
date: 2000-07-11

RFC 1766
Has Version: RFC1766-003
issued: 2000-07-11
Date Modified: 2008-01-14
type: Datatype
comment: The set of tags, constructed according to RFC 1766, for the identification of languages.
Relation: RFC1766-003
relation: RFC1766-003
date: 2008-01-14
date: 2000-07-11
type: Class

DCMI Point
Has Version: Point-003
issued: 2000-07-11
Date Modified: 2008-01-14
type: Datatype
comment: The set of points in space defined by their geographic coordinates according to the DCMI Point Encoding Scheme.
Relation: Point-003
relation: Point-003
date: 2008-01-14
date: 2000-07-11
type: Class

Requires
Has Version: requires-003
type: Property
comment: A related resource that is required by the described resource to support its function, delivery, or coherence.
issued: 2000-07-11
sub property of: relation
note: This term is intended to be used with non-literal values as defined in the DCMI Abstract Model (http://dublincore.org/documents/abstract-model/). As of December 2007, the DCMI Usage Board is seeking a way to express this intention with a formal range declaration.
Date Modified: 2008-01-14
sub property of: Relation
Relation: requires-003
relation: requires-003
date: 2008-01-14
date: 2000-07-11

Rights
range: Rights Statement
issued: 2008-01-14
description: Typically, rights information includes a statement about various property rights associated with the resource, including intellectual property rights.
comment: Information about rights held in and over the resource.
Date Modified: 2008-01-14
type: Property
Has Version: rightsT-001
sub property of: rights
Relation: rightsT-001
relation: rightsT-001
date: 2008-01-14
range: Resource

Subject
Has Version: subjectT-002
Date Modified: 2012-06-14
description: Typically, the subject will be represented using keywords, key phrases, or classification codes. Recommended best practice is to use a controlled vocabulary.
issued: 2008-01-14
sub property of: subject
type: Property
note: This term is intended to be used with non-literal values as defined in the DCMI Abstract Model (http://dublincore.org/documents/abstract-model/). As of December 2007, the DCMI Usage Board is seeking a way to express this intention with a formal range declaration.
comment: The topic of the resource.
Relation: subjectT-002
relation: subjectT-002
date: 2012-06-14
date: 2008-01-14

Rights Holder
Has Version: rightsHolder-002
issued: 2004-06-14
Date Modified: 2008-01-14
type: Property
comment: A person or organization owning or managing rights over the resource.
range: Agent
Relation: rightsHolder-002
relation: rightsHolder-002
date: 2008-01-14
date: 2004-06-14
range: Resource

Spatial Coverage
type: Property
range: Location
comment: Spatial characteristics of the resource.
issued: 2000-07-11
Date Modified: 2008-01-14
Has Version: spatial-003
sub property of: Coverage
sub property of: coverage
Relation: spatial-003
relation: spatial-003
date: 2008-01-14
date: 2000-07-11
range: Location, Period, or Jurisdiction
range: Resource

Publisher
Date Modified: 2010-10-11
issued: 2008-01-14
range: Agent
comment: An entity responsible for making the resource available.
Has Version: publisherT-001
type: Property
description: Examples of a Publisher include a person, an organization, or a service.
sub property of: publisher
Relation: publisherT-001
relation: publisherT-001
date: 2010-10-11
date: 2008-01-14
range: Resource

MeSH
Has Version: MESH-003
issued: 2000-07-11
Date Modified: 2008-01-14
type: VocabularyEncodingScheme
comment: The set of labeled concepts specified by the Medical Subject Headings.
Relation: MESH-003
relation: MESH-003
date: 2008-01-14
date: 2000-07-11

Format
Has Version: formatT-001
type: Property
description: Examples of dimensions include size and duration. Recommended best practice is to use a controlled vocabulary such as the list of Internet Media Types [MIME].
Date Modified: 2008-01-14
comment: The file format, physical medium, or dimensions of the resource.
issued: 2008-01-14
sub property of: format
range: Media Type or Extent
Relation: formatT-001
relation: formatT-001
date: 2008-01-14
range: Resource

LCSH
Has Version: LCSH-003
issued: 2000-07-11
Date Modified: 2008-01-14
type: VocabularyEncodingScheme
comment: The set of labeled concepts specified by the Library of Congress Subject Headings.
Relation: LCSH-003
relation: LCSH-003
date: 2008-01-14
date: 2000-07-11

construct_backbone
type: AnnotationProperty
IAO_0000115: Name of the construct backbone. This label is often the first part of a construct name and refers to the part of the construct that is not the insert.
range: string
IAO_0000112: pENTER
IAO_0000117: PERSON: Melissa Haendel
IAO_0000111: construct backbone
IAO_0000119: PERSON: Melissa Haendel
IAO_0000114: IAO_0000120
type: DatatypeProperty
domain: ERO_0000285
type: Property
range: Resource
domain: Resource
domain: Thing
domain: http://lodlaundromat.org/.well-known/genid/samples/jena///predicate//9d3b5a7ecddc9b4d8ddab2ec7a1e90f0/ad2b4b28e2fc44bac15e197e72a08df5#1
domain: http://lodlaundromat.org/.well-known/genid/samples/jena///predicate//9d3b5a7ecddc9b4d8ddab2ec7a1e90f0/a87df05138333be5591318e2dcf76368#1
domain: http://lodlaundromat.org/.well-known/genid/samples/jena///predicate//9d3b5a7ecddc9b4d8ddab2ec7a1e90f0/72d20206d7fa20a0bceb45a38012adfc#1

License
comment: A legal document giving official permission to do something with the resource.
type: Property
range: License Document
sub property of: rights
issued: 2004-06-14
Date Modified: 2008-01-14
Has Version: license-002
sub property of: Rights
Relation: license-002
relation: license-002
date: 2008-01-14
date: 2004-06-14
range: Rights Statement
range: Resource

Type
Has Version: typeT-001
sub property of: type
description: Recommended best practice is to use a controlled vocabulary such as the DCMI Type Vocabulary [DCMITYPE]. To describe the file format, physical medium, or dimensions of the resource, use the Format element.
Date Modified: 2008-01-14
range: Class
type: Property
comment: The nature or genre of the resource.
issued: 2008-01-14
Relation: typeT-001
relation: typeT-001
date: 2008-01-14
range: Resource

ISO 3166
Has Version: ISO3166-004
issued: 2000-07-11
Date Modified: 2008-01-14
type: Datatype
comment: The set of codes listed in ISO 3166-1 for the representation of names of countries.
Relation: ISO3166-004
relation: ISO3166-004
date: 2008-01-14
date: 2000-07-11
type: Class

Contributor
comment: An entity responsible for making contributions to the resource.
description: Examples of a Contributor include a person, an organization, or a service.
type: Property
Date Modified: 2010-10-11
issued: 2008-01-14
sub property of: contributor
range: Agent
Has Version: contributorT-001
Relation: contributorT-001
relation: contributorT-001
date: 2010-10-11
date: 2008-01-14
range: Resource

DCMI Period
Has Version: Period-003
issued: 2000-07-11
Date Modified: 2008-01-14
type: Datatype
comment: The set of time intervals defined by their limits according to the DCMI Period Encoding Scheme.
Relation: Period-003
relation: Period-003
date: 2008-01-14
date: 2000-07-11
type: Class

Date Modified
Date Modified: 2008-01-14
sub property of: Date
type: Property
range: Literal
issued: 2000-07-11
sub property of: date
comment: Date on which the resource was changed.
Has Version: modified-003
Relation: modified-003
relation: modified-003
date: 2008-01-14
date: 2000-07-11
range: Resource

has_antibody_registry_ID
IAO_0000117: PERSON: Nicole Vasilevsky
IAO_0000112: AB12345.
IAO_0000111: has antibody registry ID
IAO_0000115: The unique ID number assigned to an antibody in the Neurosicence Information Framework (NIF) antibody registry.
type: DatatypeProperty
range: string
IAO_0000114: IAO_0000120
IAO_0000119: PERSON: Nicole Vasilevsky
type: AnnotationProperty
domain: ERO_0000008
type: Property
range: Resource
domain: http://lodlaundromat.org/.well-known/genid/samples/jena///predicate//9d3b5a7ecddc9b4d8ddab2ec7a1e90f0/a87df05138333be5591318e2dcf76368#1
domain: Resource
domain: Thing
domain: http://lodlaundromat.org/.well-known/genid/samples/jena///predicate//9d3b5a7ecddc9b4d8ddab2ec7a1e90f0/d40a630bafd46234eff5dafe5e8651f8#1

Date Accepted
Date Modified: 2008-01-14
range: Literal
sub property of: date
comment: Date of acceptance of the resource.
type: Property
description: Examples of resources to which a Date Accepted may be relevant are a thesis (accepted by a university department) or an article (accepted by a journal).
Has Version: dateAccepted-002
sub property of: Date
issued: 2002-07-13
Relation: dateAccepted-002
relation: dateAccepted-002
date: 2008-01-14
date: 2002-07-13
range: Resource

Audience Education Level
Has Version: educationLevel-002
issued: 2002-07-13
Date Modified: 2008-01-14
type: Property
comment: A class of entity, defined in terms of progression through an educational or training context, for which the described resource is intended.
range: Agent Class
sub property of: Audience
Relation: educationLevel-002
relation: educationLevel-002
date: 2008-01-14
date: 2002-07-13
range: Resource
range: Class

Has Version
Has Version: hasVersion-003
sub property of: relation
comment: A related resource that is a version, edition, or adaptation of the described resource.
Date Modified: 2008-01-14
note: This term is intended to be used with non-literal values as defined in the DCMI Abstract Model (http://dublincore.org/documents/abstract-model/). As of December 2007, the DCMI Usage Board is seeking a way to express this intention with a formal range declaration.
issued: 2000-07-11
type: Property
sub property of: Relation
Relation: hasVersion-003
relation: hasVersion-003
date: 2008-01-14
date: 2000-07-11

has_director
inverse of: ERO_0001906
IAO_0000115: Name of the person who directs the organization.
IAO_0000111: has director
IAO_0000119: PERSON: Melissa Haendel
IAO_0000117: PERSON: Melissa Haendel
domain: http://lodlaundromat.org/.well-known/genid/samples/jena///predicate//9d3b5a7ecddc9b4d8ddab2ec7a1e90f0/e53907ea1619f7c09a04838ff93e4682#8
IAO_0000114: IAO_0000120
type: Property
domain: Thing
domain: Resource