Group member
type: ObjectProperty
name: groupMember
sub property of: topObjectProperty
sub property of: Related Corporate Body (Person)
type: Thing
property disjoint with: bottomObjectProperty
status: New-Proposed
definition: Die Person, die ein Mitglied der aufführenden Gruppe, einer Expedition, etc. ist. @de
domain: Person
type: Property
label: Gruppenmitglied @de
definition: A person who is a member of the performing group, expedition, etc.

Hierarchical subordinate
status: New-Proposed
name: hierarchicalSubordinate
type: Thing
sub property of: topObjectProperty
property disjoint with: bottomObjectProperty
type: ObjectProperty
definition: A corporate body that is subordinate to the other corporate body (e.g., a parent body).
type: Property
domain: CorporateBody
label: untergeordnete Körperschaft @de
definition: Die Körperschaft, die einer anderen Körperschaft untergeordnet ist (z. B. der Muttergesellschaft). @de

Incumbent
sub property of: topObjectProperty
name: incumbent
status: New-Proposed
type: ObjectProperty
type: Thing
sub property of: Related Corporate Body (Person)
property disjoint with: bottomObjectProperty
type: Property
definition: Die Person, die ihren Amtssitz in der Körperschaft hat (z.B. der amtierende Präsident). @de
domain: Person
definition: A person holding an office in the corporate body (e.g., the incumbent president).
label: Amtsinhaber @de

has related match
type: SymmetricProperty
sub property of: is in semantic relation with
type: ObjectProperty
sub property of: topObjectProperty
property disjoint with: has member list
sub property of: is in mapping relation with
property disjoint with: has top concept
property disjoint with: is top concept in scheme
property disjoint with: has member
sub property of: has related
property disjoint with: bottomObjectProperty
property disjoint with: is in scheme
definition: skos:relatedMatch is used to state an associative mapping link between two conceptual resources in different concept schemes.
type: Property

Related Corporate Body
type: ObjectProperty
property disjoint with: bottomObjectProperty
sub property of: topObjectProperty
has subproperty: Related Corporate Body (Family)
has subproperty: Founding Family
type: Thing
has subproperty: Sponsoring Family
status: New-Proposed
name: relatedCorporateBody
type: Property
definition: Eine Körperschaft, die mit der Person, Familie oder Körperschaft in Verbindung steht, die durch eine Ansetzungsform des Sucheinstiegs und/oder einen Identifier repräsentiert wird (z.B. eine Musikgruppe, der eine Person angehört, eine Tochterfirma). Zu den in Beziehung stehenden Körperschaften gehören auch Körperschaften, die der Institution, die durch eine Ansetzungsform des Sucheinstiegs und/oder einen Identifier repräsentiert wird, als Ergebnis einer Namensänderung vorangeht oder nachfolgt. @de
label: In Beziehung stehende Körperschaft @de
definition: A corporate body that is associated with the person, family, or corporate body represented by a preferred access point and/or identifier (e.g., a musical group to which a person belongs, a subsidiary company). Related corporate bodies include corporate bodies that precede or succeed the body represented by an authorized access point and/or identifier as the result of a change of name.

Identifier
property disjoint with: bottomObjectProperty
type: Thing
description: Recommended best practice is to identify the resource by means of a string conforming to a formal identification system.
modified: 2008-01-14
sub property of: topObjectProperty
issued: 1999-07-02
has version: identifier-006
type: ObjectProperty
type: Property
comment: An unambiguous reference to the resource within a given context.
note: A second property with the same name as this property has been declared in the dcterms: namespace (http://purl.org/dc/terms/). See the Introduction to the document "DCMI Metadata Terms" (http://dublincore.org/documents/dcmi-terms/) for an explanation.

Mergee
status: New-Proposed
type: ObjectProperty
name: mergee
type: Thing
sub property of: Related Corporate Body (Corporate Body)
sub property of: topObjectProperty
property disjoint with: bottomObjectProperty
definition: Die Körperschaft, die mit der anderen Körperschaft fusioniert hat. @de
domain: CorporateBody
label: fusionierte Körperschaft @de
definition: A corporate body that merged with the other corporate body to form a third.
type: Property

Family member
property disjoint with: bottomObjectProperty
type: Thing
sub property of: topObjectProperty
status: New-Proposed
has subproperty: Progenitor
name: familyMember
type: ObjectProperty
sub property of: Related Family (Person)
label: Familienmitglied @de
definition: A person who is a member of the family.
type: Property
definition: Die Person, die ein Mitglied der Familie ist. @de
domain: Person

Related Family
has subproperty: Descendant Family
type: ObjectProperty
sub property of: topObjectProperty
property disjoint with: bottomObjectProperty
status: New-Proposed
has subproperty: Related Family (Family)
type: Thing
name: relatedFamily
label: in Beziehung stehende Familie @de
type: Property
definition: A family that is associated with the person, family, or corporate body represented by a preferred access point and/or identifier (e.g., a person’s family, a family that owns the controlling interest in a corporate body).
definition: Eine Familie, die mit der Person, Familie oder Körperschaft in Verbindung steht, die durch eine Ansetzungsform des Sucheinstiegs und/oder einen Identifier repräsentiert wird (z. B. die Familie einer Person, eine Familie, die die Kapitalmehrheit in einer Körperschaft hat). @de

has related
property disjoint with: has member list
property disjoint with: has top concept
sub property of: topObjectProperty
sub property of: is in semantic relation with
property disjoint with: bottomObjectProperty
property disjoint with: is in scheme
type: ObjectProperty
property disjoint with: has member
type: SymmetricProperty
property disjoint with: is top concept in scheme
definition: Relates a concept to a concept with which there is an associative semantic relationship.
comment: skos:related is disjoint with skos:broaderTransitive
type: Property

Type
type: Thing
sub property of: topObjectProperty
property disjoint with: bottomObjectProperty
type: ObjectProperty
issued: 1999-07-02
has version: type-006
description: Recommended best practice is to use a controlled vocabulary such as the DCMI Type Vocabulary [DCMITYPE]. To describe the file format, physical medium, or dimensions of the resource, use the Format element.
modified: 2008-01-14
type: Property
comment: The nature or genre of the resource.
note: A second property with the same name as this property has been declared in the dcterms: namespace (http://purl.org/dc/terms/). See the Introduction to the document "DCMI Metadata Terms" (http://dublincore.org/documents/dcmi-terms/) for an explanation.

Subject
property disjoint with: bottomObjectProperty
modified: 2012-06-14
sub property of: topObjectProperty
type: ObjectProperty
type: Thing
description: Typically, the subject will be represented using keywords, key phrases, or classification codes. Recommended best practice is to use a controlled vocabulary.
has version: subject-007
issued: 1999-07-02
type: Property
comment: The topic of the resource.
note: A second property with the same name as this property has been declared in the dcterms: namespace (http://purl.org/dc/terms/). See the Introduction to the document "DCMI Metadata Terms" (http://dublincore.org/documents/dcmi-terms/) for an explanation.

Sponsor
type: ObjectProperty
name: sponsor
sub property of: topObjectProperty
sub property of: Related Corporate Body (Person)
type: Thing
property disjoint with: bottomObjectProperty
status: New-Proposed
type: Property
definition: A person sponsoring the corporate body.
definition: Die Person, welche die Körperschaft fördert. @de
domain: Person

Language
issued: 1999-07-02
type: Thing
type: ObjectProperty
has version: language-007
description: Recommended best practice is to use a controlled vocabulary such as RFC 4646 [RFC4646].
sub property of: topObjectProperty
property disjoint with: bottomObjectProperty
modified: 2008-01-14
note: A second property with the same name as this property has been declared in the dcterms: namespace (http://purl.org/dc/terms/). See the Introduction to the document "DCMI Metadata Terms" (http://dublincore.org/documents/dcmi-terms/) for an explanation.
type: Property
comment: A language of the resource.

Explanation of Relationship
status: New-Proposed
name: explanationOfRelationship
type: Thing
sub property of: topObjectProperty
property disjoint with: bottomObjectProperty
type: ObjectProperty
definition: Information elaborating on or clarifying the relationship between an entity represented by a preferred access point and/or identifier and a related entity.
type: Property
domain: Agent
definition: Informationen, die die Beziehung zwischen einer Entität, die durch eine Ansetzungsform des Sucheinstiegs und/oder Identifier repräsentiert wird, und einer damit in Beziehung stehenden Entität herausstellt oder erläutert. @de
label: Erläuterung der Beziehung @de

Related Corporate Body (Person)
has subproperty: Sponsor
has subproperty: Incumbent
has subproperty: Alternate identity
has subproperty: Employee
type: ObjectProperty
status: New-Proposed
sub property of: topObjectProperty
has subproperty: Founder
property disjoint with: bottomObjectProperty
has subproperty: Real identity
name: relatedCorporateBodyPerson
type: Thing
has subproperty: Group member
label: In Beziehung stehende Körperschaft (Person) @de
type: Property
domain: Person
definition: Eine Körperschaft, die mit der Person, Familie oder Körperschaft in Verbindung steht, die durch eine Ansetzungsform des Sucheinstiegs und/oder einen Identifier repräsentiert wird (z.B. eine Musikgruppe, der eine Person angehört, eine Tochterfirma). Zu den in Beziehung stehenden Körperschaften gehören auch Körperschaften, die der Institution, die durch eine Ansetzungsform des Sucheinstiegs und/oder einen Identifier repräsentiert wird, als Ergebnis einer Namensänderung vorangeht oder nachfolgt. @de
definition: A corporate body that is associated with the person, family, or corporate body represented by a preferred access point and/or identifier (e.g., a musical group to which a person belongs, a subsidiary company). Related corporate bodies include corporate bodies that precede or succeed the body represented by an authorized access point and/or identifier as the result of a change of name.

Format
type: Thing
description: Examples of dimensions include size and duration. Recommended best practice is to use a controlled vocabulary such as the list of Internet Media Types [MIME].
sub property of: topObjectProperty
property disjoint with: bottomObjectProperty
modified: 2008-01-14
issued: 1999-07-02
has version: format-007
type: ObjectProperty
type: Property
comment: The file format, physical medium, or dimensions of the resource.
note: A second property with the same name as this property has been declared in the dcterms: namespace (http://purl.org/dc/terms/). See the Introduction to the document "DCMI Metadata Terms" (http://dublincore.org/documents/dcmi-terms/) for an explanation.

RDA Relationships for Persons, Corporate Bodies, Families (deprecated)
type: Thing

Concept Scheme
disjoint with: Ordered Collection
disjoint with: Concept
disjoint with: http://lodlaundromat.org/.well-known/genid/samples/pellet///predicate//9c665bc7b67f929ca1e8d5b167e0a84b/d8234c3b1439a879aea940e9009663be#1
disjoint with: Nothing
disjoint with: Collection
subclass of: Thing
type: Class
definition: A set of concepts, optionally including statements about semantic relationships between those concepts.
scope note: A concept scheme may be defined to include concepts from different sources.
example: Thesauri, classification schemes, subject heading lists, taxonomies, 'folksonomies', and other types of controlled vocabulary are all examples of concept schemes. Concept schemes are also embedded in glossaries and terminologies.

Predecessor
property disjoint with: bottomObjectProperty
type: ObjectProperty
sub property of: topObjectProperty
sub property of: Related Corporate Body (Corporate Body)
name: predecessor
type: Thing
status: New-Proposed
domain: CorporateBody
type: Property
label: Vorgänger @de
definition: A corporate body that precedes the other corporate body.
definition: Die Körperschaft, die einer anderen Körperschaft vorausgeht. @de

Related Family (Family)
name: relatedFamilyFamily
sub property of: Related Family
status: New-Proposed
property disjoint with: bottomObjectProperty
type: Thing
type: ObjectProperty
sub property of: topObjectProperty
label: in Beziehung stehende Familie (Familie) @de
domain: Family
definition: A family that is associated with the person, family, or corporate body represented by a preferred access point and/or identifier (e.g., a person’s family, a family that owns the controlling interest in a corporate body).
definition: Eine Familie, die mit der Person, Familie oder Körperschaft in Verbindung steht, die durch eine Ansetzungsform des Sucheinstiegs und/oder einen Identifier repräsentiert wird (z. B. die Familie einer Person, eine Familie, die die Kapitalmehrheit in einer Körperschaft hat). @de
type: Property

Dublin Core Metadata Element Set, Version 1.1
modified: 2012-06-14
publisher: DCMI
type: Thing

Descendant Family
sub property of: Related Family
type: Thing
property disjoint with: bottomObjectProperty
sub property of: topObjectProperty
status: New-Proposed
type: ObjectProperty
name: descendantFamily
type: Property
label: Abstammende Familie @de
domain: Family
definition: Die Familie, die von der anderen Familie abstammt. @de
definition: A family descended from the other family.

has narrower
sub property of: has narrower transitive
sub property of: is in semantic relation with
property disjoint with: is in scheme
property disjoint with: has member
property disjoint with: bottomObjectProperty
type: ObjectProperty
sub property of: topObjectProperty
inverse of: has broader
property disjoint with: is top concept in scheme
property disjoint with: has top concept
property disjoint with: has member list
definition: Relates a concept to a concept that is more specific in meaning.
scope note: By convention, skos:broader is only used to assert an immediate (i.e. direct) hierarchical link between two conceptual resources.
comment: Narrower concepts are typically rendered as children in a concept hierarchy (tree).
type: Property

Source
property disjoint with: bottomObjectProperty
issued: 1999-07-02
type: Thing
description: The described resource may be derived from the related resource in whole or in part. Recommended best practice is to identify the related resource by means of a string conforming to a formal identification system.
sub property of: topObjectProperty
modified: 2008-01-14
has version: source-006
type: ObjectProperty
type: Property
comment: A related resource from which the described resource is derived.
note: A second property with the same name as this property has been declared in the dcterms: namespace (http://purl.org/dc/terms/). See the Introduction to the document "DCMI Metadata Terms" (http://dublincore.org/documents/dcmi-terms/) for an explanation.

Related Person (Family)
type: ObjectProperty
sub property of: topObjectProperty
property disjoint with: bottomObjectProperty
sub property of: Related Person
type: Thing
status: New-Proposed
name: relatedPersonFamily
domain: Family
type: Property
definition: Eine Person, die mit der Person, Familie oder Körperschaft in Verbindung steht, die durch eine Ansetzungsform des Sucheinstiegs und/oder Identifier repräsentiert wird (z. B. ein Mitarbeiter, ein Familienmitglied, ein Gründer einer Körperschaft).Zu den in Beziehung stehenden Personen gehören auch getrennte Identitäten, die durch ein Individuum begründet wurden. @de
label: in Beziehung stehende Person (Familie) @de
definition: A person who is associated with the person, family, or corporate body represented by a preferred access point and/or identifier (e.g., a collaborator, a member of a family, a founder of a corporate body). Related persons include separate identities established by an individual.

Description
modified: 2008-01-14
has version: description-006
type: ObjectProperty
sub property of: topObjectProperty
type: Thing
issued: 1999-07-02
description: Description may include but is not limited to: an abstract, a table of contents, a graphical representation, or a free-text account of the resource.
property disjoint with: bottomObjectProperty
type: Property
comment: An account of the resource.
note: A second property with the same name as this property has been declared in the dcterms: namespace (http://purl.org/dc/terms/). See the Introduction to the document "DCMI Metadata Terms" (http://dublincore.org/documents/dcmi-terms/) for an explanation.

Descendants
name: descendants
sub property of: topObjectProperty
property disjoint with: bottomObjectProperty
sub property of: Related Person
type: Thing
type: ObjectProperty
status: New-Proposed
definition: A family descended from the particular person.
definition: Die Familie, die von der bestimmten Person abstammt. @de
label: Nachkommen @de
domain: Family
type: Property

Founded organization
status: New-Proposed
type: Thing
name: foundedOrganization
sub property of: Related Family (Corporate Body)
sub property of: topObjectProperty
property disjoint with: bottomObjectProperty
type: ObjectProperty
definition: A corporate body that the family founded.
domain: CorporateBody
type: Property
label: gegründete Organisation @de
definition: Die Körperschaft, welche die Familie gründete. @de

Publisher
modified: 2008-01-14
issued: 1999-07-02
description: Examples of a Publisher include a person, an organization, or a service. Typically, the name of a Publisher should be used to indicate the entity.
type: Thing
type: ObjectProperty
has version: publisher-006
sub property of: topObjectProperty
property disjoint with: bottomObjectProperty
type: Property
comment: An entity responsible for making the resource available.
note: A second property with the same name as this property has been declared in the dcterms: namespace (http://purl.org/dc/terms/). See the Introduction to the document "DCMI Metadata Terms" (http://dublincore.org/documents/dcmi-terms/) for an explanation.

has broader
property disjoint with: is in scheme
type: ObjectProperty
sub property of: topObjectProperty
property disjoint with: is top concept in scheme
property disjoint with: bottomObjectProperty
sub property of: has broader transitive
property disjoint with: has member
sub property of: is in semantic relation with
property disjoint with: has top concept
property disjoint with: has member list
inverse of: has narrower
definition: Relates a concept to a concept that is more general in meaning.
comment: Broader concepts are typically rendered as parents in a concept hierarchy (tree).
scope note: By convention, skos:broader is only used to assert an immediate (i.e. direct) hierarchical link between two conceptual resources.
type: Property

has broader transitive
sub property of: is in semantic relation with
type: ObjectProperty
property disjoint with: is in scheme
property disjoint with: has top concept
property disjoint with: is top concept in scheme
sub property of: topObjectProperty
type: TransitiveProperty
inverse of: has narrower transitive
property disjoint with: has member
property disjoint with: bottomObjectProperty
property disjoint with: has member list
definition: skos:broaderTransitive is a transitive superproperty of skos:broader.
scope note: By convention, skos:broaderTransitive is not used to make assertions. Rather, the properties can be used to draw inferences about the transitive closure of the hierarchical relation, which is useful e.g. when implementing a simple query expansion algorithm in a search application.
type: Property

Creator
type: ObjectProperty
has version: creator-006
property disjoint with: bottomObjectProperty
description: Examples of a Creator include a person, an organization, or a service. Typically, the name of a Creator should be used to indicate the entity.
issued: 1999-07-02
modified: 2008-01-14
type: Thing
sub property of: topObjectProperty
type: Property
comment: An entity primarily responsible for making the resource.
note: A second property with the same name as this property has been declared in the dcterms: namespace (http://purl.org/dc/terms/). See the Introduction to the document "DCMI Metadata Terms" (http://dublincore.org/documents/dcmi-terms/) for an explanation.

Concept
disjoint with: Concept Scheme
disjoint with: Ordered Collection
disjoint with: Nothing
disjoint with: Collection
subclass of: http://lodlaundromat.org/.well-known/genid/samples/pellet///predicate//9c665bc7b67f929ca1e8d5b167e0a84b/d8234c3b1439a879aea940e9009663be#1
subclass of: Thing
type: Class
definition: An idea or notion; a unit of thought.

Related Corporate Body (Corporate Body)
has subproperty: Hierarchical superior
type: ObjectProperty
has subproperty: Product of a split
has subproperty: Mergee
status: New-Proposed
name: relatedCorporateBodyCorporateBody
sub property of: topObjectProperty
has subproperty: Product of a merger
has subproperty: Predecessor
type: Thing
property disjoint with: bottomObjectProperty
has subproperty: Successor
domain: CorporateBody
definition: Eine Körperschaft, die mit der Person, Familie oder Körperschaft in Verbindung steht, die durch eine Ansetzungsform des Sucheinstiegs und/oder einen Identifier repräsentiert wird (z.B. eine Musikgruppe, der eine Person angehört, eine Tochterfirma). Zu den in Beziehung stehenden Körperschaften gehören auch Körperschaften, die der Institution, die durch eine Ansetzungsform des Sucheinstiegs und/oder einen Identifier repräsentiert wird, als Ergebnis einer Namensänderung vorangeht oder nachfolgt. @de
label: In Beziehung stehende Körperschaft (Körperschaft) @de
type: Property
definition: A corporate body that is associated with the person, family, or corporate body represented by a preferred access point and/or identifier (e.g., a musical group to which a person belongs, a subsidiary company). Related corporate bodies include corporate bodies that precede or succeed the body represented by an authorized access point and/or identifier as the result of a change of name.

Related Family (Corporate Body)
property disjoint with: bottomObjectProperty
type: ObjectProperty
type: Thing
sub property of: topObjectProperty
has subproperty: Founded organization
name: relatedFamilyCorporateBody
status: New-Proposed
has subproperty: Sponsored organization
label: in Beziehung stehende Familie @de
type: Property
definition: A family that is associated with the person, family, or corporate body represented by a preferred access point and/or identifier (e.g., a person’s family, a family that owns the controlling interest in a corporate body).
definition: Eine Familie, die mit der Person, Familie oder Körperschaft in Verbindung steht, die durch eine Ansetzungsform des Sucheinstiegs und/oder einen Identifier repräsentiert wird (z. B. die Familie einer Person, eine Familie, die die Kapitalmehrheit in einer Körperschaft hat). @de
domain: CorporateBody

Employer
sub property of: topObjectProperty
status: New-Proposed
name: employer
property disjoint with: bottomObjectProperty
sub property of: Related Person (Corporate Body)
type: Thing
type: ObjectProperty
definition: A corporate body that employs the person.
label: Arbeitgeber @de
type: Property
domain: CorporateBody
definition: Die Körperschaft, welche die Person beschäftigt. @de

has broader match
property disjoint with: has member list
property disjoint with: is in scheme
sub property of: is in semantic relation with
type: ObjectProperty
property disjoint with: bottomObjectProperty
sub property of: topObjectProperty
sub property of: has broader transitive
property disjoint with: has top concept
property disjoint with: is top concept in scheme
sub property of: is in mapping relation with
inverse of: has narrower match
property disjoint with: has member
sub property of: has broader
definition: skos:broadMatch is used to state a hierarchical mapping link between two conceptual resources in different concept schemes.
type: Property

Ordered Collection
disjoint with: Concept Scheme
disjoint with: Concept
disjoint with: Nothing
subclass of: http://lodlaundromat.org/.well-known/genid/samples/pellet///predicate//9c665bc7b67f929ca1e8d5b167e0a84b/d8234c3b1439a879aea940e9009663be#1
subclass of: Collection
subclass of: Thing
type: Class
definition: An ordered collection of concepts, where both the grouping and the ordering are meaningful.
scope note: Ordered collections can be used where you would like a set of concepts to be displayed in a specific order, and optionally under a 'node label'.

SKOS Vocabulary
creator: Sean Bechhofer
creator: Alistair Miles
contributor: Participants in W3C's Semantic Web Deployment Working Group.
contributor: Nikki Rogers
contributor: Dave Beckett
description: An RDF vocabulary for describing the basic structure and content of concept schemes such as thesauri, classification schemes, subject heading lists, taxonomies, 'folksonomies', other types of controlled vocabulary, and also concept schemes embedded in glossaries and terminologies.
type: Thing
type: Ontology

Alternate identity
name: alternateIdentity
status: New-Proposed
property disjoint with: bottomObjectProperty
type: Thing
sub property of: topObjectProperty
type: ObjectProperty
sub property of: Related Person (Person)
definition: A pseudonymous or other identity assumed by the person.
label: andere Identität @de
domain: Person
type: Property
definition: Das Pseudonym bzw. die andere Identität, welche die Person annimmt. @de

Product of a merger
name: productOfAMerger
type: Thing
property disjoint with: bottomObjectProperty
status: New-Proposed
sub property of: Related Corporate Body (Corporate Body)
type: ObjectProperty
sub property of: topObjectProperty
domain: CorporateBody
type: Property
definition: Die Körperschaft, die aus der Fusion einer oder mehrerer Körperschaften entsteht. @de
definition: A corporate body that resulted from a merger of two or more other corporate bodies.
label: Ergebnis einer Fusion @de

Founder
sub property of: Related Corporate Body (Person)
sub property of: topObjectProperty
type: ObjectProperty
name: founder
status: New-Proposed
type: Thing
property disjoint with: bottomObjectProperty
definition: A person who founded the corporate body.
type: Property
label: Gründer @de
definition: Die Person, welche die Körperschaft gegründet hat. @de

is in scheme
sub property of: topObjectProperty
property disjoint with: is in semantic relation with
property disjoint with: has member
property disjoint with: has top concept
property disjoint with: has close match
property disjoint with: has exact match
property disjoint with: bottomObjectProperty
type: ObjectProperty
property disjoint with: has narrower
property disjoint with: has narrower match
property disjoint with: has broader
property disjoint with: has narrower transitive
property disjoint with: has broader match
property disjoint with: has related
property disjoint with: has related match
property disjoint with: is in mapping relation with
property disjoint with: has broader transitive
definition: Relates a resource (for example a concept) to a concept scheme in which it is included.
scope note: A concept may be a member of more than one concept scheme.
range: Concept Scheme
type: Property

has narrower transitive
sub property of: topObjectProperty
property disjoint with: has member
property disjoint with: has member list
type: TransitiveProperty
property disjoint with: is top concept in scheme
inverse of: has broader transitive
property disjoint with: has top concept
property disjoint with: is in scheme
property disjoint with: bottomObjectProperty
type: ObjectProperty
sub property of: is in semantic relation with
definition: skos:narrowerTransitive is a transitive superproperty of skos:narrower.
scope note: By convention, skos:narrowerTransitive is not used to make assertions. Rather, the properties can be used to draw inferences about the transitive closure of the hierarchical relation, which is useful e.g. when implementing a simple query expansion algorithm in a search application.
type: Property

New-Proposed
type: Concept
type: http://lodlaundromat.org/.well-known/genid/samples/pellet///predicate//9c665bc7b67f929ca1e8d5b167e0a84b/d8234c3b1439a879aea940e9009663be#1
type: Thing

Relation
property disjoint with: bottomObjectProperty
issued: 1999-07-02
type: Thing
type: ObjectProperty
modified: 2008-01-14
sub property of: topObjectProperty
has version: relation-006
description: Recommended best practice is to identify the related resource by means of a string conforming to a formal identification system.
type: Property
comment: A related resource.
note: A second property with the same name as this property has been declared in the dcterms: namespace (http://purl.org/dc/terms/). See the Introduction to the document "DCMI Metadata Terms" (http://dublincore.org/documents/dcmi-terms/) for an explanation.

has narrower match
property disjoint with: has member
sub property of: has narrower
property disjoint with: bottomObjectProperty
inverse of: has broader match
sub property of: has narrower transitive
sub property of: is in semantic relation with
sub property of: is in mapping relation with
type: ObjectProperty
property disjoint with: is in scheme
property disjoint with: is top concept in scheme
property disjoint with: has member list
property disjoint with: has top concept
sub property of: topObjectProperty
definition: skos:narrowMatch is used to state a hierarchical mapping link between two conceptual resources in different concept schemes.
type: Property

notation
sub property of: topDataProperty
property disjoint with: bottomDataProperty
type: DatatypeProperty
definition: A notation, also known as classification code, is a string of characters such as "T58.5" or "303.4833" used to uniquely identify a concept within the scope of a given concept scheme.
scope note: By convention, skos:notation is used with a typed literal in the object position of the triple.
type: Property

Progenitor
sub property of: Family member
property disjoint with: bottomObjectProperty
type: ObjectProperty
type: Thing
name: progenitor
status: New-Proposed
sub property of: topObjectProperty
sub property of: Related Family (Person)
definition: Die Person, von der die Familie abstammt. @de
domain: Person
label: Vorfahre, Stammvater @de
definition: A person from whom the family is descended.
type: Property

Real identity
type: ObjectProperty
property disjoint with: bottomObjectProperty
type: Thing
name: realIdentity
sub property of: topObjectProperty
status: New-Proposed
sub property of: Related Person (Person)
definition: A real person who assumes the alternate identity.
label: wirkliche Identität @de
definition: Die reale Person, die die andere Identität annimmt. @de
type: Property
domain: Person

Hierarchical superior
name: hierarchicalSuperior
type: ObjectProperty
sub property of: Related Corporate Body (Corporate Body)
type: Thing
property disjoint with: bottomObjectProperty
sub property of: topObjectProperty
status: New-Proposed
domain: CorporateBody
definition: Die Körperschaft, die einer anderen Körperschaft übergeordnet ist. @de
label: übergeordnete Körperschaft @de
definition: A corporate body that is hierarchically superior to the other corporate body.
type: Property

Related Person
type: ObjectProperty
property disjoint with: bottomObjectProperty
sub property of: topObjectProperty
status: New-Proposed
has subproperty: Related Person (Family)
type: Thing
has subproperty: Descendants
name: relatedPerson
label: In Beziehung stehende Person @de
type: Property
definition: Eine Person, die mit der Person, Familie oder Körperschaft in Verbindung steht, die durch eine Ansetzungsform des Sucheinstiegs und/oder Identifier repräsentiert wird (z. B. ein Mitarbeiter, ein Familienmitglied, ein Gründer einer Körperschaft). Zu den in Beziehung stehenden Personen gehören auch getrennte Identitäten, die durch ein Individuum begründet wurden. @de
definition: A person who is associated with the person, family, or corporate body represented by a preferred access point and/or identifier (e.g., a collaborator, a member of a family, a founder of a corporate body). Related persons include separate identities established by an individual.

Related Corporate Body (Family)
type: ObjectProperty
name: relatedCorporateBodyFamily
sub property of: Related Corporate Body
type: Thing
sub property of: topObjectProperty
property disjoint with: bottomObjectProperty
status: New-Proposed
type: Property
label: In Beziehung stehende Körperschaft (Familie) @de
definition: Eine Körperschaft, die mit der Person, Familie oder Körperschaft in Verbindung steht, die durch eine Ansetzungsform des Sucheinstiegs und/oder einen Identifier repräsentiert wird (z.B. eine Musikgruppe, der eine Person angehört, eine Tochterfirma). Zu den in Beziehung stehenden Körperschaften gehören auch Körperschaften, die der Institution, die durch eine Ansetzungsform des Sucheinstiegs und/oder einen Identifier repräsentiert wird, als Ergebnis einer Namensänderung vorangeht oder nachfolgt. @de
domain: Family
definition: A corporate body that is associated with the person, family, or corporate body represented by a preferred access point and/or identifier (e.g., a musical group to which a person belongs, a subsidiary company). Related corporate bodies include corporate bodies that precede or succeed the body represented by an authorized access point and/or identifier as the result of a change of name.

Successor
name: successor
status: New-Proposed
property disjoint with: bottomObjectProperty
type: Thing
sub property of: topObjectProperty
sub property of: Related Corporate Body (Corporate Body)
type: ObjectProperty
type: Property
label: Nachfolger @de
definition: Die Körperschaft, die einer anderen Körperschaft nachfolgt oder aus ihr hervorgeht. @de
definition: A corporate body that succeeds or follows the other corporate body.
domain: CorporateBody

Employee
name: employee
type: ObjectProperty
status: New-Proposed
sub property of: topObjectProperty
property disjoint with: bottomObjectProperty
sub property of: Related Corporate Body (Person)
type: Thing
definition: Die Person, die bei einer Körperschaft beschäftigt ist. @de
label: Arbeitnehmer @de
definition: A person employed by a corporate body.
domain: Person
type: Property

Date
has version: date-006
modified: 2008-01-14
description: Date may be used to express temporal information at any level of granularity. Recommended best practice is to use an encoding scheme, such as the W3CDTF profile of ISO 8601 [W3CDTF].
sub property of: topObjectProperty
type: ObjectProperty
property disjoint with: bottomObjectProperty
type: Thing
issued: 1999-07-02
type: Property
comment: A point or period of time associated with an event in the lifecycle of the resource.
note: A second property with the same name as this property has been declared in the dcterms: namespace (http://purl.org/dc/terms/). See the Introduction to the document "DCMI Metadata Terms" (http://dublincore.org/documents/dcmi-terms/) for an explanation.

has top concept
property disjoint with: has member
property disjoint with: is in mapping relation with
property disjoint with: has member list
type: ObjectProperty
property disjoint with: has close match
property disjoint with: has broader
property disjoint with: has narrower match
property disjoint with: has narrower transitive
property disjoint with: has related
property disjoint with: has exact match
property disjoint with: is top concept in scheme
property disjoint with: has narrower
inverse of: is top concept in scheme
property disjoint with: has related match
property disjoint with: bottomObjectProperty
property disjoint with: is in scheme
sub property of: topObjectProperty
property disjoint with: is in semantic relation with
property disjoint with: has broader transitive
property disjoint with: has broader match
definition: Relates, by convention, a concept scheme to a concept which is topmost in the broader/narrower concept hierarchies for that scheme, providing an entry point to these hierarchies.
domain: Concept Scheme
range: Concept
type: Property

Founding Family
type: ObjectProperty
sub property of: Related Corporate Body
type: Thing
status: New-Proposed
name: foundingFamily
property disjoint with: bottomObjectProperty
sub property of: topObjectProperty
type: Property
definition: Die Familie, welche die Körperschaft gegründet hat. @de
domain: Family
label: Gründerfamilie @de
definition: A family that founded the corporate body.

is in mapping relation with
property disjoint with: is in scheme
type: ObjectProperty
property disjoint with: has top concept
property disjoint with: bottomObjectProperty
property disjoint with: has member list
sub property of: topObjectProperty
sub property of: is in semantic relation with
property disjoint with: has member
property disjoint with: is top concept in scheme
definition: Relates two concepts coming, by convention, from different schemes, and that have comparable meanings
comment: These concept mapping relations mirror semantic relations, and the data model defined below is similar (with the exception of skos:exactMatch) to the data model defined for semantic relations. A distinct vocabulary is provided for concept mapping relations, to provide a convenient way to differentiate links within a concept scheme from links between concept schemes. However, this pattern of usage is not a formal requirement of the SKOS data model, and relies on informal definitions of best practice.
type: Property

has member list
type: ObjectProperty
property disjoint with: has broader transitive
property disjoint with: is in semantic relation with
property disjoint with: has related match
property disjoint with: has broader
property disjoint with: has narrower
property disjoint with: has narrower match
property disjoint with: has exact match
property disjoint with: has top concept
property disjoint with: has close match
property disjoint with: is top concept in scheme
property disjoint with: is in mapping relation with
sub property of: topObjectProperty
property disjoint with: has narrower transitive
property disjoint with: has related
property disjoint with: has broader match
property disjoint with: bottomObjectProperty
type: FunctionalProperty
definition: Relates an ordered collection to the RDF list containing its members.
domain: Ordered Collection
range: List
comment: For any resource, every item in the list given as the value of the skos:memberList property is also a value of the skos:member property.
type: Property

is in semantic relation with
property disjoint with: bottomObjectProperty
property disjoint with: has member list
property disjoint with: has member
sub property of: topObjectProperty
property disjoint with: is in scheme
type: ObjectProperty
property disjoint with: has top concept
property disjoint with: is top concept in scheme
definition: Links a concept to a concept related by meaning.
scope note: This property should not be used directly, but as a super-property for all properties denoting a relationship of meaning between concepts.
domain: Concept
range: Concept
type: Property

Product of a split
status: New-Proposed
type: ObjectProperty
name: productOfASplit
property disjoint with: bottomObjectProperty
sub property of: topObjectProperty
type: Thing
sub property of: Related Corporate Body (Corporate Body)
type: Property
domain: CorporateBody
definition: Die Körperschaft, die aus einer Spaltung oder Teilung von der anderen Körperschaft entsteht. @de
label: Ergebnis einer Teilung @de
definition: A corporate body that resulted from a split or division of the other corporate body.

Collection
disjoint with: Concept Scheme
disjoint with: Concept
disjoint with: Nothing
subclass of: http://lodlaundromat.org/.well-known/genid/samples/pellet///predicate//9c665bc7b67f929ca1e8d5b167e0a84b/d8234c3b1439a879aea940e9009663be#1
subclass of: Thing
type: Class
definition: A meaningful collection of concepts.
scope note: Labelled collections can be used where you would like a set of concepts to be displayed under a 'node label' in the hierarchy.

Related Family (Person)
name: relatedFamilyPerson
has subproperty: Family member
property disjoint with: bottomObjectProperty
type: Thing
sub property of: topObjectProperty
type: ObjectProperty
status: New-Proposed
domain: Person
definition: A family that is associated with the person, family, or corporate body represented by a preferred access point and/or identifier (e.g., a person’s family, a family that owns the controlling interest in a corporate body).
label: in beziehung stehende Familie (Person) @de
type: Property
definition: Eine Familie, die mit der Person, Familie oder Körperschaft in Verbindung steht, die durch eine Ansetzungsform des Sucheinstiegs und/oder einen Identifier repräsentiert wird (z. B. die Familie einer Person, eine Familie, die die Kapitalmehrheit in einer Körperschaft hat). @de

is top concept in scheme
type: ObjectProperty
property disjoint with: has narrower transitive
property disjoint with: has broader transitive
property disjoint with: has top concept
property disjoint with: has exact match
property disjoint with: has broader match
sub property of: topObjectProperty
sub property of: is in scheme
property disjoint with: is in mapping relation with
property disjoint with: is in semantic relation with
property disjoint with: has member
property disjoint with: has member list
property disjoint with: has narrower match
property disjoint with: has broader
inverse of: has top concept
property disjoint with: has close match
property disjoint with: has narrower
property disjoint with: has related match
property disjoint with: has related
property disjoint with: bottomObjectProperty
definition: Relates a concept to the concept scheme that it is a top level concept of.
type: Property
domain: Concept
range: Concept Scheme

has exact match
sub property of: is in mapping relation with
sub property of: has close match
property disjoint with: bottomObjectProperty
sub property of: topObjectProperty
property disjoint with: is in scheme
property disjoint with: is top concept in scheme
property disjoint with: has member list
property disjoint with: has member
type: SymmetricProperty
sub property of: is in semantic relation with
property disjoint with: has top concept
type: ObjectProperty
type: TransitiveProperty
definition: skos:exactMatch is used to link two concepts, indicating a high degree of confidence that the concepts can be used interchangeably across a wide range of information retrieval applications. skos:exactMatch is a transitive property, and is a sub-property of skos:closeMatch.
comment: skos:exactMatch is disjoint with each of the properties skos:broadMatch and skos:relatedMatch.
type: Property

Sponsoring Family
property disjoint with: bottomObjectProperty
type: Thing
sub property of: topObjectProperty
type: ObjectProperty
sub property of: Related Corporate Body
name: sponsoringFamily
status: New-Proposed
definition: Die Familie, welche die Körperschaft fördert. @de
type: Property
definition: A family that sponsors the corporate body.
domain: Family
label: Sponsorenfamilie @de

Contributor
issued: 1999-07-02
type: Thing
type: ObjectProperty
property disjoint with: bottomObjectProperty
modified: 2008-01-14
description: Examples of a Contributor include a person, an organization, or a service. Typically, the name of a Contributor should be used to indicate the entity.
sub property of: topObjectProperty
has version: contributor-006
type: Property
comment: An entity responsible for making contributions to the resource.
note: A second property with the same name as this property has been declared in the dcterms: namespace (http://purl.org/dc/terms/). See the Introduction to the document "DCMI Metadata Terms" (http://dublincore.org/documents/dcmi-terms/) for an explanation.

Coverage
description: Spatial topic and spatial applicability may be a named place or a location specified by its geographic coordinates. Temporal topic may be a named period, date, or date range. A jurisdiction may be a named administrative entity or a geographic place to which the resource applies. Recommended best practice is to use a controlled vocabulary such as the Thesaurus of Geographic Names [TGN]. Where appropriate, named places or time periods can be used in preference to numeric identifiers such as sets of coordinates or date ranges.
type: Thing
property disjoint with: bottomObjectProperty
type: ObjectProperty
modified: 2008-01-14
has version: coverage-006
issued: 1999-07-02
sub property of: topObjectProperty
type: Property
comment: The spatial or temporal topic of the resource, the spatial applicability of the resource, or the jurisdiction under which the resource is relevant.
note: A second property with the same name as this property has been declared in the dcterms: namespace (http://purl.org/dc/terms/). See the Introduction to the document "DCMI Metadata Terms" (http://dublincore.org/documents/dcmi-terms/) for an explanation.

Related Person (Person)
status: New-Proposed
has subproperty: Real identity
property disjoint with: bottomObjectProperty
sub property of: topObjectProperty
type: ObjectProperty
name: relatedPersonPerson
has subproperty: Alternate identity
type: Thing
definition: Eine Person, die mit der Person, Familie oder Körperschaft in Verbindung steht, die durch eine Ansetzungsform des Sucheinstiegs und/oder Identifier repräsentiert wird (z. B. ein Mitarbeiter, ein Familienmitglied, ein Gründer einer Körperschaft).Zu den in Beziehung stehenden Personen gehören auch getrennte Identitäten, die durch ein Individuum begründet wurden. @de
label: in Beziehung stehende Person (Person) @de
type: Property
definition: A person who is associated with the person, family, or corporate body represented by a preferred access point and/or identifier (e.g., a collaborator, a member of a family, a founder of a corporate body). Related persons include separate identities established by an individual.
domain: Person

has close match
sub property of: is in mapping relation with
type: SymmetricProperty
property disjoint with: is in scheme
sub property of: topObjectProperty
property disjoint with: is top concept in scheme
sub property of: is in semantic relation with
property disjoint with: has member
type: ObjectProperty
property disjoint with: bottomObjectProperty
property disjoint with: has member list
property disjoint with: has top concept
definition: skos:closeMatch is used to link two concepts that are sufficiently similar that they can be used interchangeably in some information retrieval applications. In order to avoid the possibility of "compound errors" when combining mappings across more than two concept schemes, skos:closeMatch is not declared to be a transitive property.
type: Property

Related Person (Corporate Body)
type: Thing
type: ObjectProperty
status: New-Proposed
sub property of: topObjectProperty
name: relatedPersonCorporateBody
property disjoint with: bottomObjectProperty
has subproperty: Employer
type: Property
definition: Eine Person, die mit der Person, Familie oder Körperschaft in Verbindung steht, die durch eine Ansetzungsform des Sucheinstiegs und/oder Identifier repräsentiert wird (z.B. ein Mitarbeiter, ein Familienmitglied, ein Gründer einer Körperschaft).Zu den in Beziehung stehenden Personen gehören auch getrennte Identitäten, die durch ein Individuum begründet wurden. @de
label: in Beziehung stehende Person (Körperschaft) @de
definition: A person who is associated with the person, family, or corporate body represented by a preferred access point and/or identifier (e.g., a collaborator, a member of a family, a founder of a corporate body). Related persons include separate identities established by an individual.
domain: CorporateBody

has member
property disjoint with: has narrower transitive
property disjoint with: has related match
property disjoint with: has exact match
property disjoint with: is in mapping relation with
property disjoint with: is in semantic relation with
sub property of: topObjectProperty
property disjoint with: is top concept in scheme
property disjoint with: has related
property disjoint with: has broader match
type: ObjectProperty
property disjoint with: bottomObjectProperty
property disjoint with: has narrower match
property disjoint with: has broader transitive
property disjoint with: has broader
property disjoint with: has narrower
property disjoint with: has top concept
property disjoint with: is in scheme
property disjoint with: has close match
definition: Relates a collection to one of its members.
domain: Collection
range: http://lodlaundromat.org/.well-known/genid/samples/pellet///predicate//9c665bc7b67f929ca1e8d5b167e0a84b/d8234c3b1439a879aea940e9009663be#1
type: Property

Rights
type: Thing
property disjoint with: bottomObjectProperty
has version: rights-006
description: Typically, rights information includes a statement about various property rights associated with the resource, including intellectual property rights.
issued: 1999-07-02
sub property of: topObjectProperty
type: ObjectProperty
modified: 2008-01-14
type: Property
comment: Information about rights held in and over the resource.
note: A second property with the same name as this property has been declared in the dcterms: namespace (http://purl.org/dc/terms/). See the Introduction to the document "DCMI Metadata Terms" (http://dublincore.org/documents/dcmi-terms/) for an explanation.

Sponsored organization
sub property of: topObjectProperty
status: New-Proposed
property disjoint with: bottomObjectProperty
name: sponsoredOrganization
type: ObjectProperty
sub property of: Related Family (Corporate Body)
type: Thing
definition: Die Körperschaft, welche von der Familie gefördert wird. @de
definition: A corporate body that the family sponsors.
label: geförderte Organisation @de
domain: CorporateBody
type: Property

Title
type: DatatypeProperty
issued: 1999-07-02
type: Thing
modified: 2008-01-14
sub property of: topDataProperty
property disjoint with: bottomDataProperty
has version: title-006
type: Property
comment: A name given to the resource.
note: A second property with the same name as this property has been declared in the dcterms: namespace (http://purl.org/dc/terms/). See the Introduction to the document "DCMI Metadata Terms" (http://dublincore.org/documents/dcmi-terms/) for an explanation.

definition
definition: A statement or formal explanation of the meaning of a concept.
type: AnnotationProperty
sub property of: note
type: Property

change note
definition: A note about a modification to a concept.
type: AnnotationProperty
sub property of: note
type: Property

hidden label
definition: A lexical label for a resource that should be hidden when generating visual displays of the resource, but should still be accessible to free text search operations.
type: AnnotationProperty
sub property of: label
comment: The range of skos:hiddenLabel is the class of RDF plain literals.
comment: skos:prefLabel, skos:altLabel and skos:hiddenLabel are pairwise disjoint properties.
type: Property

note
definition: A general note, for any purpose.
scope note: This property may be used directly, or as a super-property for more specific note types.
type: AnnotationProperty
type: Property

alternative label
definition: An alternative lexical label for a resource.
example: Acronyms, abbreviations, spelling variants, and irregular plural/singular forms may be included among the alternative labels for a concept. Mis-spelled terms are normally included as hidden labels (see skos:hiddenLabel).
type: AnnotationProperty
sub property of: label
comment: The range of skos:altLabel is the class of RDF plain literals.
comment: skos:prefLabel, skos:altLabel and skos:hiddenLabel are pairwise disjoint properties.
type: Property

history note
definition: A note about the past state/use/meaning of a concept.
type: AnnotationProperty
sub property of: note
type: Property

preferred label
definition: The preferred lexical label for a resource, in a given language.
type: AnnotationProperty
sub property of: label
comment: A resource has no more than one value of skos:prefLabel per language tag, and no more than one value of skos:prefLabel without language tag.
comment: The range of skos:prefLabel is the class of RDF plain literals.
comment: skos:prefLabel, skos:altLabel and skos:hiddenLabel are pairwise disjoint properties.
type: Property

example
definition: An example of the use of a concept.
type: AnnotationProperty
sub property of: note
type: Property

editorial note
definition: A note for an editor, translator or maintainer of the vocabulary.
type: AnnotationProperty
sub property of: note
type: Property

scope note
definition: A note that helps to clarify the meaning and/or the use of a concept.
type: AnnotationProperty
sub property of: note
type: Property