has related match
range: Thing
domain: Thing
sub property of: is in semantic relation with
definition: skos:relatedMatch is used to state an associative mapping link between two conceptual resources in different concept schemes.
type: ObjectProperty
sub property of: is in mapping relation with
sub property of: has related
type: SymmetricProperty
type: Property
note: skos:relatedMatch is used to state an associative mapping link between two conceptual resources in different concept schemes.
domain: Concept
domain: Resource
domain: http://lodlaundromat.org/.well-known/genid/samples/jena///predicate//9c665bc7b67f929ca1e8d5b167e0a84b/d8234c3b1439a879aea940e9009663be#1
range: Concept
range: Resource
range: http://lodlaundromat.org/.well-known/genid/samples/jena///predicate//9c665bc7b67f929ca1e8d5b167e0a84b/d8234c3b1439a879aea940e9009663be#1

has related
range: Thing
domain: Thing
definition: Relates a concept to a concept with which there is an associative semantic relationship.
type: ObjectProperty
sub property of: is in semantic relation with
type: SymmetricProperty
comment: skos:related is disjoint with skos:broaderTransitive
type: Property
note: Relates a concept to a concept with which there is an associative semantic relationship.
domain: Concept
domain: Resource
domain: http://lodlaundromat.org/.well-known/genid/samples/jena///predicate//9c665bc7b67f929ca1e8d5b167e0a84b/d8234c3b1439a879aea940e9009663be#1
range: Concept
range: Resource
range: http://lodlaundromat.org/.well-known/genid/samples/jena///predicate//9c665bc7b67f929ca1e8d5b167e0a84b/d8234c3b1439a879aea940e9009663be#1

Concept Scheme
subclass of: Thing
subclass of: Resource
type: Class
definition: A set of concepts, optionally including statements about semantic relationships between those concepts.
scope note: A concept scheme may be defined to include concepts from different sources.
example: Thesauri, classification schemes, subject heading lists, taxonomies, 'folksonomies', and other types of controlled vocabulary are all examples of concept schemes. Concept schemes are also embedded in glossaries and terminologies.
disjoint with: Concept
note: A concept scheme may be defined to include concepts from different sources.
note: Thesauri, classification schemes, subject heading lists, taxonomies, 'folksonomies', and other types of controlled vocabulary are all examples of concept schemes. Concept schemes are also embedded in glossaries and terminologies.
note: A set of concepts, optionally including statements about semantic relationships between those concepts.
disjoint with: Collection

has narrower
sub property of: is in semantic relation with
range: Thing
domain: Thing
definition: Relates a concept to a concept that is more specific in meaning.
scope note: By convention, skos:broader is only used to assert an immediate (i.e. direct) hierarchical link between two conceptual resources.
comment: Narrower concepts are typically rendered as children in a concept hierarchy (tree).
type: ObjectProperty
sub property of: has narrower transitive
inverse of: has broader
type: Property
note: By convention, skos:broader is only used to assert an immediate (i.e. direct) hierarchical link between two conceptual resources.
note: Relates a concept to a concept that is more specific in meaning.
domain: Concept
domain: Resource
domain: http://lodlaundromat.org/.well-known/genid/samples/jena///predicate//9c665bc7b67f929ca1e8d5b167e0a84b/d8234c3b1439a879aea940e9009663be#1
range: Concept
range: Resource
range: http://lodlaundromat.org/.well-known/genid/samples/jena///predicate//9c665bc7b67f929ca1e8d5b167e0a84b/d8234c3b1439a879aea940e9009663be#1

has broader
range: Thing
domain: Thing
sub property of: is in semantic relation with
definition: Relates a concept to a concept that is more general in meaning.
comment: Broader concepts are typically rendered as parents in a concept hierarchy (tree).
scope note: By convention, skos:broader is only used to assert an immediate (i.e. direct) hierarchical link between two conceptual resources.
type: ObjectProperty
sub property of: has broader transitive
inverse of: has narrower
type: Property
note: By convention, skos:broader is only used to assert an immediate (i.e. direct) hierarchical link between two conceptual resources.
note: Relates a concept to a concept that is more general in meaning.
domain: Concept
domain: Resource
domain: http://lodlaundromat.org/.well-known/genid/samples/jena///predicate//9c665bc7b67f929ca1e8d5b167e0a84b/d8234c3b1439a879aea940e9009663be#1
range: Concept
range: Resource
range: http://lodlaundromat.org/.well-known/genid/samples/jena///predicate//9c665bc7b67f929ca1e8d5b167e0a84b/d8234c3b1439a879aea940e9009663be#1

has broader transitive
range: Thing
domain: Thing
definition: skos:broaderTransitive is a transitive superproperty of skos:broader.
scope note: By convention, skos:broaderTransitive is not used to make assertions. Rather, the properties can be used to draw inferences about the transitive closure of the hierarchical relation, which is useful e.g. when implementing a simple query expansion algorithm in a search application.
type: ObjectProperty
sub property of: is in semantic relation with
type: TransitiveProperty
inverse of: has narrower transitive
type: Property
note: By convention, skos:broaderTransitive is not used to make assertions. Rather, the properties can be used to draw inferences about the transitive closure of the hierarchical relation, which is useful e.g. when implementing a simple query expansion algorithm in a search application.
note: skos:broaderTransitive is a transitive superproperty of skos:broader.
domain: Concept
domain: Resource
domain: http://lodlaundromat.org/.well-known/genid/samples/jena///predicate//9c665bc7b67f929ca1e8d5b167e0a84b/d8234c3b1439a879aea940e9009663be#1
range: Concept
range: Resource
range: http://lodlaundromat.org/.well-known/genid/samples/jena///predicate//9c665bc7b67f929ca1e8d5b167e0a84b/d8234c3b1439a879aea940e9009663be#1

Concept
subclass of: Thing
subclass of: Resource
type: Class
subclass of: http://lodlaundromat.org/.well-known/genid/samples/jena///predicate//9c665bc7b67f929ca1e8d5b167e0a84b/d8234c3b1439a879aea940e9009663be#1
definition: An idea or notion; a unit of thought.
note: An idea or notion; a unit of thought.
disjoint with: Collection
disjoint with: Concept Scheme

has broader match
sub property of: has broader transitive
sub property of: is in semantic relation with
range: Thing
domain: Thing
definition: skos:broadMatch is used to state a hierarchical mapping link between two conceptual resources in different concept schemes.
type: ObjectProperty
sub property of: is in mapping relation with
sub property of: has broader
inverse of: has narrower match
type: Property
note: skos:broadMatch is used to state a hierarchical mapping link between two conceptual resources in different concept schemes.
domain: Concept
domain: Resource
domain: http://lodlaundromat.org/.well-known/genid/samples/jena///predicate//9c665bc7b67f929ca1e8d5b167e0a84b/d8234c3b1439a879aea940e9009663be#1
range: Concept
range: Resource
range: http://lodlaundromat.org/.well-known/genid/samples/jena///predicate//9c665bc7b67f929ca1e8d5b167e0a84b/d8234c3b1439a879aea940e9009663be#1

Ordered Collection
subclass of: Thing
subclass of: Resource
type: Class
definition: An ordered collection of concepts, where both the grouping and the ordering are meaningful.
scope note: Ordered collections can be used where you would like a set of concepts to be displayed in a specific order, and optionally under a 'node label'.
subclass of: Collection
note: Ordered collections can be used where you would like a set of concepts to be displayed in a specific order, and optionally under a 'node label'.
note: An ordered collection of concepts, where both the grouping and the ordering are meaningful.
subclass of: http://lodlaundromat.org/.well-known/genid/samples/jena///predicate//9c665bc7b67f929ca1e8d5b167e0a84b/d8234c3b1439a879aea940e9009663be#1

is in scheme
range: Thing
domain: Thing
definition: Relates a resource (for example a concept) to a concept scheme in which it is included.
scope note: A concept may be a member of more than one concept scheme.
type: ObjectProperty
range: Concept Scheme
type: Property
note: A concept may be a member of more than one concept scheme.
note: Relates a resource (for example a concept) to a concept scheme in which it is included.
range: Resource
domain: Resource

has narrower transitive
range: Thing
domain: Thing
definition: skos:narrowerTransitive is a transitive superproperty of skos:narrower.
scope note: By convention, skos:narrowerTransitive is not used to make assertions. Rather, the properties can be used to draw inferences about the transitive closure of the hierarchical relation, which is useful e.g. when implementing a simple query expansion algorithm in a search application.
type: ObjectProperty
sub property of: is in semantic relation with
type: TransitiveProperty
inverse of: has broader transitive
type: Property
note: By convention, skos:narrowerTransitive is not used to make assertions. Rather, the properties can be used to draw inferences about the transitive closure of the hierarchical relation, which is useful e.g. when implementing a simple query expansion algorithm in a search application.
note: skos:narrowerTransitive is a transitive superproperty of skos:narrower.
domain: Concept
domain: Resource
domain: http://lodlaundromat.org/.well-known/genid/samples/jena///predicate//9c665bc7b67f929ca1e8d5b167e0a84b/d8234c3b1439a879aea940e9009663be#1
range: Concept
range: Resource
range: http://lodlaundromat.org/.well-known/genid/samples/jena///predicate//9c665bc7b67f929ca1e8d5b167e0a84b/d8234c3b1439a879aea940e9009663be#1

has narrower match
sub property of: has narrower transitive
range: Thing
domain: Thing
sub property of: is in semantic relation with
definition: skos:narrowMatch is used to state a hierarchical mapping link between two conceptual resources in different concept schemes.
type: ObjectProperty
sub property of: is in mapping relation with
sub property of: has narrower
inverse of: has broader match
type: Property
note: skos:narrowMatch is used to state a hierarchical mapping link between two conceptual resources in different concept schemes.
domain: Resource
domain: Concept
domain: http://lodlaundromat.org/.well-known/genid/samples/jena///predicate//9c665bc7b67f929ca1e8d5b167e0a84b/d8234c3b1439a879aea940e9009663be#1
range: Resource
range: Concept
range: http://lodlaundromat.org/.well-known/genid/samples/jena///predicate//9c665bc7b67f929ca1e8d5b167e0a84b/d8234c3b1439a879aea940e9009663be#1

Progenitor
sub property of: Related Family (Person)
sub property of: Family member
definition: Die Person, von der die Familie abstammt. @de
name: progenitor
status: New-Proposed
domain: Person
label: Vorfahre, Stammvater @de
definition: A person from whom the family is descended.
type: Property
note: A person from whom the family is descended.
note: Die Person, von der die Familie abstammt. @de
domain: Resource

has top concept
range: Thing
domain: Thing
definition: Relates, by convention, a concept scheme to a concept which is topmost in the broader/narrower concept hierarchies for that scheme, providing an entry point to these hierarchies.
type: ObjectProperty
domain: Concept Scheme
range: Concept
inverse of: is top concept in scheme
type: Property
note: Relates, by convention, a concept scheme to a concept which is topmost in the broader/narrower concept hierarchies for that scheme, providing an entry point to these hierarchies.
range: http://lodlaundromat.org/.well-known/genid/samples/jena///predicate//9c665bc7b67f929ca1e8d5b167e0a84b/d8234c3b1439a879aea940e9009663be#1
range: Resource
domain: Resource

is in mapping relation with
range: Thing
domain: Thing
definition: Relates two concepts coming, by convention, from different schemes, and that have comparable meanings
comment: These concept mapping relations mirror semantic relations, and the data model defined below is similar (with the exception of skos:exactMatch) to the data model defined for semantic relations. A distinct vocabulary is provided for concept mapping relations, to provide a convenient way to differentiate links within a concept scheme from links between concept schemes. However, this pattern of usage is not a formal requirement of the SKOS data model, and relies on informal definitions of best practice.
type: ObjectProperty
sub property of: is in semantic relation with
type: Property
note: Relates two concepts coming, by convention, from different schemes, and that have comparable meanings
domain: Concept
domain: Resource
domain: http://lodlaundromat.org/.well-known/genid/samples/jena///predicate//9c665bc7b67f929ca1e8d5b167e0a84b/d8234c3b1439a879aea940e9009663be#1
range: Concept
range: Resource
range: http://lodlaundromat.org/.well-known/genid/samples/jena///predicate//9c665bc7b67f929ca1e8d5b167e0a84b/d8234c3b1439a879aea940e9009663be#1

has member list
range: Thing
domain: Thing
definition: Relates an ordered collection to the RDF list containing its members.
type: ObjectProperty
domain: Ordered Collection
type: FunctionalProperty
range: List
comment: For any resource, every item in the list given as the value of the skos:memberList property is also a value of the skos:member property.
type: Property
note: Relates an ordered collection to the RDF list containing its members.
range: Resource
domain: Resource
domain: http://lodlaundromat.org/.well-known/genid/samples/jena///predicate//9c665bc7b67f929ca1e8d5b167e0a84b/d8234c3b1439a879aea940e9009663be#1
domain: Collection

is in semantic relation with
range: Thing
domain: Thing
definition: Links a concept to a concept related by meaning.
scope note: This property should not be used directly, but as a super-property for all properties denoting a relationship of meaning between concepts.
type: ObjectProperty
domain: Concept
range: Concept
type: Property
note: This property should not be used directly, but as a super-property for all properties denoting a relationship of meaning between concepts.
note: Links a concept to a concept related by meaning.
range: http://lodlaundromat.org/.well-known/genid/samples/jena///predicate//9c665bc7b67f929ca1e8d5b167e0a84b/d8234c3b1439a879aea940e9009663be#1
range: Resource
domain: Resource
domain: http://lodlaundromat.org/.well-known/genid/samples/jena///predicate//9c665bc7b67f929ca1e8d5b167e0a84b/d8234c3b1439a879aea940e9009663be#1

Collection
subclass of: Thing
subclass of: Resource
type: Class
subclass of: http://lodlaundromat.org/.well-known/genid/samples/jena///predicate//9c665bc7b67f929ca1e8d5b167e0a84b/d8234c3b1439a879aea940e9009663be#1
definition: A meaningful collection of concepts.
scope note: Labelled collections can be used where you would like a set of concepts to be displayed under a 'node label' in the hierarchy.
disjoint with: Concept
disjoint with: Concept Scheme
note: Labelled collections can be used where you would like a set of concepts to be displayed under a 'node label' in the hierarchy.
note: A meaningful collection of concepts.

is top concept in scheme
range: Thing
domain: Thing
definition: Relates a concept to the concept scheme that it is a top level concept of.
type: ObjectProperty
sub property of: is in scheme
inverse of: has top concept
type: Property
domain: Concept
range: Concept Scheme
note: Relates a concept to the concept scheme that it is a top level concept of.
domain: Resource
range: Resource
domain: http://lodlaundromat.org/.well-known/genid/samples/jena///predicate//9c665bc7b67f929ca1e8d5b167e0a84b/d8234c3b1439a879aea940e9009663be#1

has exact match
sub property of: is in semantic relation with
range: Thing
domain: Thing
sub property of: is in mapping relation with
definition: skos:exactMatch is used to link two concepts, indicating a high degree of confidence that the concepts can be used interchangeably across a wide range of information retrieval applications. skos:exactMatch is a transitive property, and is a sub-property of skos:closeMatch.
type: ObjectProperty
sub property of: has close match
type: SymmetricProperty
type: TransitiveProperty
comment: skos:exactMatch is disjoint with each of the properties skos:broadMatch and skos:relatedMatch.
type: Property
note: skos:exactMatch is used to link two concepts, indicating a high degree of confidence that the concepts can be used interchangeably across a wide range of information retrieval applications. skos:exactMatch is a transitive property, and is a sub-property of skos:closeMatch.
domain: Resource
domain: Concept
domain: http://lodlaundromat.org/.well-known/genid/samples/jena///predicate//9c665bc7b67f929ca1e8d5b167e0a84b/d8234c3b1439a879aea940e9009663be#1
range: Resource
range: Concept
range: http://lodlaundromat.org/.well-known/genid/samples/jena///predicate//9c665bc7b67f929ca1e8d5b167e0a84b/d8234c3b1439a879aea940e9009663be#1

has close match
sub property of: is in semantic relation with
range: Thing
domain: Thing
definition: skos:closeMatch is used to link two concepts that are sufficiently similar that they can be used interchangeably in some information retrieval applications. In order to avoid the possibility of "compound errors" when combining mappings across more than two concept schemes, skos:closeMatch is not declared to be a transitive property.
type: ObjectProperty
sub property of: is in mapping relation with
type: SymmetricProperty
type: Property
note: skos:closeMatch is used to link two concepts that are sufficiently similar that they can be used interchangeably in some information retrieval applications. In order to avoid the possibility of "compound errors" when combining mappings across more than two concept schemes, skos:closeMatch is not declared to be a transitive property.
domain: Concept
domain: Resource
domain: http://lodlaundromat.org/.well-known/genid/samples/jena///predicate//9c665bc7b67f929ca1e8d5b167e0a84b/d8234c3b1439a879aea940e9009663be#1
range: Concept
range: Resource
range: http://lodlaundromat.org/.well-known/genid/samples/jena///predicate//9c665bc7b67f929ca1e8d5b167e0a84b/d8234c3b1439a879aea940e9009663be#1

has member
range: Thing
domain: Thing
definition: Relates a collection to one of its members.
type: ObjectProperty
domain: Collection
range: http://lodlaundromat.org/.well-known/genid/samples/jena///predicate//9c665bc7b67f929ca1e8d5b167e0a84b/d8234c3b1439a879aea940e9009663be#1
type: Property
note: Relates a collection to one of its members.
range: Resource
domain: Resource
domain: http://lodlaundromat.org/.well-known/genid/samples/jena///predicate//9c665bc7b67f929ca1e8d5b167e0a84b/d8234c3b1439a879aea940e9009663be#1

Group member
name: groupMember
sub property of: Related Corporate Body (Person)
definition: Die Person, die ein Mitglied der aufführenden Gruppe, einer Expedition, etc. ist. @de
domain: Person
type: Property
label: Gruppenmitglied @de
definition: A person who is a member of the performing group, expedition, etc.
status: New-Proposed
note: Die Person, die ein Mitglied der aufführenden Gruppe, einer Expedition, etc. ist. @de
note: A person who is a member of the performing group, expedition, etc.
domain: Resource

definition
definition: A statement or formal explanation of the meaning of a concept.
type: AnnotationProperty
sub property of: note
type: Property
note: A statement or formal explanation of the meaning of a concept.

Hierarchical subordinate
type: Property
label: untergeordnete Körperschaft @de
name: hierarchicalSubordinate
domain: CorporateBody
status: New-Proposed
definition: A corporate body that is subordinate to the other corporate body (e.g., a parent body).
definition: Die Körperschaft, die einer anderen Körperschaft untergeordnet ist (z. B. der Muttergesellschaft). @de
note: Die Körperschaft, die einer anderen Körperschaft untergeordnet ist (z. B. der Muttergesellschaft). @de
note: A corporate body that is subordinate to the other corporate body (e.g., a parent body).
domain: Resource

Incumbent
type: Property
definition: Die Person, die ihren Amtssitz in der Körperschaft hat (z.B. der amtierende Präsident). @de
name: incumbent
status: New-Proposed
domain: Person
definition: A person holding an office in the corporate body (e.g., the incumbent president).
sub property of: Related Corporate Body (Person)
label: Amtsinhaber @de
note: A person holding an office in the corporate body (e.g., the incumbent president).
note: Die Person, die ihren Amtssitz in der Körperschaft hat (z.B. der amtierende Präsident). @de
domain: Resource

Related Corporate Body
definition: Eine Körperschaft, die mit der Person, Familie oder Körperschaft in Verbindung steht, die durch eine Ansetzungsform des Sucheinstiegs und/oder einen Identifier repräsentiert wird (z.B. eine Musikgruppe, der eine Person angehört, eine Tochterfirma). Zu den in Beziehung stehenden Körperschaften gehören auch Körperschaften, die der Institution, die durch eine Ansetzungsform des Sucheinstiegs und/oder einen Identifier repräsentiert wird, als Ergebnis einer Namensänderung vorangeht oder nachfolgt. @de
has subproperty: Related Corporate Body (Family)
type: Property
label: In Beziehung stehende Körperschaft @de
has subproperty: Founding Family
status: New-Proposed
has subproperty: Sponsoring Family
definition: A corporate body that is associated with the person, family, or corporate body represented by a preferred access point and/or identifier (e.g., a musical group to which a person belongs, a subsidiary company). Related corporate bodies include corporate bodies that precede or succeed the body represented by an authorized access point and/or identifier as the result of a change of name.
name: relatedCorporateBody
note: Eine Körperschaft, die mit der Person, Familie oder Körperschaft in Verbindung steht, die durch eine Ansetzungsform des Sucheinstiegs und/oder einen Identifier repräsentiert wird (z.B. eine Musikgruppe, der eine Person angehört, eine Tochterfirma). Zu den in Beziehung stehenden Körperschaften gehören auch Körperschaften, die der Institution, die durch eine Ansetzungsform des Sucheinstiegs und/oder einen Identifier repräsentiert wird, als Ergebnis einer Namensänderung vorangeht oder nachfolgt. @de
note: A corporate body that is associated with the person, family, or corporate body represented by a preferred access point and/or identifier (e.g., a musical group to which a person belongs, a subsidiary company). Related corporate bodies include corporate bodies that precede or succeed the body represented by an authorized access point and/or identifier as the result of a change of name.

Identifier
description: Recommended best practice is to identify the resource by means of a string conforming to a formal identification system.
has version: identifier-006
issued: 1999-07-02
modified: 2008-01-14
type: Property
comment: An unambiguous reference to the resource within a given context.
note: A second property with the same name as this property has been declared in the dcterms: namespace (http://purl.org/dc/terms/). See the Introduction to the document "DCMI Metadata Terms" (http://dublincore.org/documents/dcmi-terms/) for an explanation.

change note
definition: A note about a modification to a concept.
type: AnnotationProperty
sub property of: note
type: Property
note: A note about a modification to a concept.

Mergee
status: New-Proposed
name: mergee
definition: Die Körperschaft, die mit der anderen Körperschaft fusioniert hat. @de
domain: CorporateBody
sub property of: Related Corporate Body (Corporate Body)
label: fusionierte Körperschaft @de
definition: A corporate body that merged with the other corporate body to form a third.
type: Property
note: Die Körperschaft, die mit der anderen Körperschaft fusioniert hat. @de
note: A corporate body that merged with the other corporate body to form a third.
domain: Resource

Family member
label: Familienmitglied @de
has subproperty: Progenitor
definition: A person who is a member of the family.
status: New-Proposed
type: Property
name: familyMember
definition: Die Person, die ein Mitglied der Familie ist. @de
domain: Person
sub property of: Related Family (Person)
note: Die Person, die ein Mitglied der Familie ist. @de
note: A person who is a member of the family.
domain: Resource

Related Family
has subproperty: Related Family (Family)
has subproperty: Descendant Family
label: in Beziehung stehende Familie @de
definition: Eine Familie, die mit der Person, Familie oder Körperschaft in Verbindung steht, die durch eine Ansetzungsform des Sucheinstiegs und/oder einen Identifier repräsentiert wird (z. B. die Familie einer Person, eine Familie, die die Kapitalmehrheit in einer Körperschaft hat). @de
type: Property
status: New-Proposed
name: relatedFamily
definition: A family that is associated with the person, family, or corporate body represented by a preferred access point and/or identifier (e.g., a person’s family, a family that owns the controlling interest in a corporate body).
note: A family that is associated with the person, family, or corporate body represented by a preferred access point and/or identifier (e.g., a person’s family, a family that owns the controlling interest in a corporate body).
note: Eine Familie, die mit der Person, Familie oder Körperschaft in Verbindung steht, die durch eine Ansetzungsform des Sucheinstiegs und/oder einen Identifier repräsentiert wird (z. B. die Familie einer Person, eine Familie, die die Kapitalmehrheit in einer Körperschaft hat). @de

hidden label
definition: A lexical label for a resource that should be hidden when generating visual displays of the resource, but should still be accessible to free text search operations.
type: AnnotationProperty
sub property of: label
comment: The range of skos:hiddenLabel is the class of RDF plain literals.
comment: skos:prefLabel, skos:altLabel and skos:hiddenLabel are pairwise disjoint properties.
type: Property
note: A lexical label for a resource that should be hidden when generating visual displays of the resource, but should still be accessible to free text search operations.

Type
description: Recommended best practice is to use a controlled vocabulary such as the DCMI Type Vocabulary [DCMITYPE]. To describe the file format, physical medium, or dimensions of the resource, use the Format element.
has version: type-006
issued: 1999-07-02
modified: 2008-01-14
type: Property
comment: The nature or genre of the resource.
note: A second property with the same name as this property has been declared in the dcterms: namespace (http://purl.org/dc/terms/). See the Introduction to the document "DCMI Metadata Terms" (http://dublincore.org/documents/dcmi-terms/) for an explanation.

Subject
description: Typically, the subject will be represented using keywords, key phrases, or classification codes. Recommended best practice is to use a controlled vocabulary.
has version: subject-007
issued: 1999-07-02
modified: 2012-06-14
type: Property
comment: The topic of the resource.
note: A second property with the same name as this property has been declared in the dcterms: namespace (http://purl.org/dc/terms/). See the Introduction to the document "DCMI Metadata Terms" (http://dublincore.org/documents/dcmi-terms/) for an explanation.

Sponsor
type: Property
definition: A person sponsoring the corporate body.
name: sponsor
definition: Die Person, welche die Körperschaft fördert. @de
status: New-Proposed
domain: Person
sub property of: Related Corporate Body (Person)
note: Die Person, welche die Körperschaft fördert. @de
note: A person sponsoring the corporate body.
domain: Resource

note
definition: A general note, for any purpose.
scope note: This property may be used directly, or as a super-property for more specific note types.
type: AnnotationProperty
type: Property
note: This property may be used directly, or as a super-property for more specific note types.
note: A general note, for any purpose.

Language
issued: 1999-07-02
note: A second property with the same name as this property has been declared in the dcterms: namespace (http://purl.org/dc/terms/). See the Introduction to the document "DCMI Metadata Terms" (http://dublincore.org/documents/dcmi-terms/) for an explanation.
has version: language-007
description: Recommended best practice is to use a controlled vocabulary such as RFC 4646 [RFC4646].
type: Property
comment: A language of the resource.
modified: 2008-01-14

Explanation of Relationship
status: New-Proposed
name: explanationOfRelationship
domain: Agent
label: Erläuterung der Beziehung @de
definition: Information elaborating on or clarifying the relationship between an entity represented by a preferred access point and/or identifier and a related entity.
definition: Informationen, die die Beziehung zwischen einer Entität, die durch eine Ansetzungsform des Sucheinstiegs und/oder Identifier repräsentiert wird, und einer damit in Beziehung stehenden Entität herausstellt oder erläutert. @de
type: Property
note: Informationen, die die Beziehung zwischen einer Entität, die durch eine Ansetzungsform des Sucheinstiegs und/oder Identifier repräsentiert wird, und einer damit in Beziehung stehenden Entität herausstellt oder erläutert. @de
note: Information elaborating on or clarifying the relationship between an entity represented by a preferred access point and/or identifier and a related entity.
domain: Resource

Related Corporate Body (Person)
has subproperty: Incumbent
label: In Beziehung stehende Körperschaft (Person) @de
has subproperty: Sponsor
name: relatedCorporateBodyPerson
status: New-Proposed
type: Property
has subproperty: Alternate identity
has subproperty: Employee
domain: Person
has subproperty: Group member
has subproperty: Founder
definition: Eine Körperschaft, die mit der Person, Familie oder Körperschaft in Verbindung steht, die durch eine Ansetzungsform des Sucheinstiegs und/oder einen Identifier repräsentiert wird (z.B. eine Musikgruppe, der eine Person angehört, eine Tochterfirma). Zu den in Beziehung stehenden Körperschaften gehören auch Körperschaften, die der Institution, die durch eine Ansetzungsform des Sucheinstiegs und/oder einen Identifier repräsentiert wird, als Ergebnis einer Namensänderung vorangeht oder nachfolgt. @de
definition: A corporate body that is associated with the person, family, or corporate body represented by a preferred access point and/or identifier (e.g., a musical group to which a person belongs, a subsidiary company). Related corporate bodies include corporate bodies that precede or succeed the body represented by an authorized access point and/or identifier as the result of a change of name.
has subproperty: Real identity
note: A corporate body that is associated with the person, family, or corporate body represented by a preferred access point and/or identifier (e.g., a musical group to which a person belongs, a subsidiary company). Related corporate bodies include corporate bodies that precede or succeed the body represented by an authorized access point and/or identifier as the result of a change of name.
note: Eine Körperschaft, die mit der Person, Familie oder Körperschaft in Verbindung steht, die durch eine Ansetzungsform des Sucheinstiegs und/oder einen Identifier repräsentiert wird (z.B. eine Musikgruppe, der eine Person angehört, eine Tochterfirma). Zu den in Beziehung stehenden Körperschaften gehören auch Körperschaften, die der Institution, die durch eine Ansetzungsform des Sucheinstiegs und/oder einen Identifier repräsentiert wird, als Ergebnis einer Namensänderung vorangeht oder nachfolgt. @de
domain: Resource

Format
description: Examples of dimensions include size and duration. Recommended best practice is to use a controlled vocabulary such as the list of Internet Media Types [MIME].
has version: format-007
issued: 1999-07-02
modified: 2008-01-14
type: Property
comment: The file format, physical medium, or dimensions of the resource.
note: A second property with the same name as this property has been declared in the dcterms: namespace (http://purl.org/dc/terms/). See the Introduction to the document "DCMI Metadata Terms" (http://dublincore.org/documents/dcmi-terms/) for an explanation.

RDA Relationships for Persons, Corporate Bodies, Families (deprecated)
title: RDA Relationships for Persons, Corporate Bodies, Families

Predecessor
name: predecessor
domain: CorporateBody
sub property of: Related Corporate Body (Corporate Body)
status: New-Proposed
type: Property
label: Vorgänger @de
definition: A corporate body that precedes the other corporate body.
definition: Die Körperschaft, die einer anderen Körperschaft vorausgeht. @de
note: A corporate body that precedes the other corporate body.
note: Die Körperschaft, die einer anderen Körperschaft vorausgeht. @de
domain: Resource

Related Family (Family)
label: in Beziehung stehende Familie (Familie) @de
name: relatedFamilyFamily
sub property of: Related Family
status: New-Proposed
domain: Family
definition: A family that is associated with the person, family, or corporate body represented by a preferred access point and/or identifier (e.g., a person’s family, a family that owns the controlling interest in a corporate body).
definition: Eine Familie, die mit der Person, Familie oder Körperschaft in Verbindung steht, die durch eine Ansetzungsform des Sucheinstiegs und/oder einen Identifier repräsentiert wird (z. B. die Familie einer Person, eine Familie, die die Kapitalmehrheit in einer Körperschaft hat). @de
type: Property
note: A family that is associated with the person, family, or corporate body represented by a preferred access point and/or identifier (e.g., a person’s family, a family that owns the controlling interest in a corporate body).
note: Eine Familie, die mit der Person, Familie oder Körperschaft in Verbindung steht, die durch eine Ansetzungsform des Sucheinstiegs und/oder einen Identifier repräsentiert wird (z. B. die Familie einer Person, eine Familie, die die Kapitalmehrheit in einer Körperschaft hat). @de
domain: Resource

alternative label
definition: An alternative lexical label for a resource.
example: Acronyms, abbreviations, spelling variants, and irregular plural/singular forms may be included among the alternative labels for a concept. Mis-spelled terms are normally included as hidden labels (see skos:hiddenLabel).
type: AnnotationProperty
sub property of: label
comment: The range of skos:altLabel is the class of RDF plain literals.
comment: skos:prefLabel, skos:altLabel and skos:hiddenLabel are pairwise disjoint properties.
type: Property
note: Acronyms, abbreviations, spelling variants, and irregular plural/singular forms may be included among the alternative labels for a concept. Mis-spelled terms are normally included as hidden labels (see skos:hiddenLabel).
note: An alternative lexical label for a resource.

Descendant Family
type: Property
sub property of: Related Family
name: descendantFamily
status: New-Proposed
label: Abstammende Familie @de
domain: Family
definition: Die Familie, die von der anderen Familie abstammt. @de
definition: A family descended from the other family.
note: A family descended from the other family.
note: Die Familie, die von der anderen Familie abstammt. @de
domain: Resource

Dublin Core Metadata Element Set, Version 1.1
modified: 2012-06-14
publisher: DCMI

Description
description: Description may include but is not limited to: an abstract, a table of contents, a graphical representation, or a free-text account of the resource.
has version: description-006
issued: 1999-07-02
modified: 2008-01-14
type: Property
comment: An account of the resource.
note: A second property with the same name as this property has been declared in the dcterms: namespace (http://purl.org/dc/terms/). See the Introduction to the document "DCMI Metadata Terms" (http://dublincore.org/documents/dcmi-terms/) for an explanation.

Founded organization
definition: A corporate body that the family founded.
domain: CorporateBody
type: Property
name: foundedOrganization
status: New-Proposed
label: gegründete Organisation @de
sub property of: Related Family (Corporate Body)
definition: Die Körperschaft, welche die Familie gründete. @de
note: Die Körperschaft, welche die Familie gründete. @de
note: A corporate body that the family founded.
domain: Resource

Descendants
name: descendants
definition: A family descended from the particular person.
definition: Die Familie, die von der bestimmten Person abstammt. @de
status: New-Proposed
label: Nachkommen @de
domain: Family
sub property of: Related Person
type: Property
note: A family descended from the particular person.
note: Die Familie, die von der bestimmten Person abstammt. @de
domain: Resource

Related Person (Family)
domain: Family
type: Property
definition: Eine Person, die mit der Person, Familie oder Körperschaft in Verbindung steht, die durch eine Ansetzungsform des Sucheinstiegs und/oder Identifier repräsentiert wird (z. B. ein Mitarbeiter, ein Familienmitglied, ein Gründer einer Körperschaft).Zu den in Beziehung stehenden Personen gehören auch getrennte Identitäten, die durch ein Individuum begründet wurden. @de
label: in Beziehung stehende Person (Familie) @de
sub property of: Related Person
definition: A person who is associated with the person, family, or corporate body represented by a preferred access point and/or identifier (e.g., a collaborator, a member of a family, a founder of a corporate body). Related persons include separate identities established by an individual.
name: relatedPersonFamily
status: New-Proposed
note: Eine Person, die mit der Person, Familie oder Körperschaft in Verbindung steht, die durch eine Ansetzungsform des Sucheinstiegs und/oder Identifier repräsentiert wird (z. B. ein Mitarbeiter, ein Familienmitglied, ein Gründer einer Körperschaft).Zu den in Beziehung stehenden Personen gehören auch getrennte Identitäten, die durch ein Individuum begründet wurden. @de
note: A person who is associated with the person, family, or corporate body represented by a preferred access point and/or identifier (e.g., a collaborator, a member of a family, a founder of a corporate body). Related persons include separate identities established by an individual.
domain: Resource

Publisher
description: Examples of a Publisher include a person, an organization, or a service. Typically, the name of a Publisher should be used to indicate the entity.
has version: publisher-006
issued: 1999-07-02
modified: 2008-01-14
type: Property
comment: An entity responsible for making the resource available.
note: A second property with the same name as this property has been declared in the dcterms: namespace (http://purl.org/dc/terms/). See the Introduction to the document "DCMI Metadata Terms" (http://dublincore.org/documents/dcmi-terms/) for an explanation.

Source
description: The described resource may be derived from the related resource in whole or in part. Recommended best practice is to identify the related resource by means of a string conforming to a formal identification system.
has version: source-006
issued: 1999-07-02
modified: 2008-01-14
type: Property
comment: A related resource from which the described resource is derived.
note: A second property with the same name as this property has been declared in the dcterms: namespace (http://purl.org/dc/terms/). See the Introduction to the document "DCMI Metadata Terms" (http://dublincore.org/documents/dcmi-terms/) for an explanation.

Creator
description: Examples of a Creator include a person, an organization, or a service. Typically, the name of a Creator should be used to indicate the entity.
has version: creator-006
issued: 1999-07-02
modified: 2008-01-14
type: Property
comment: An entity primarily responsible for making the resource.
note: A second property with the same name as this property has been declared in the dcterms: namespace (http://purl.org/dc/terms/). See the Introduction to the document "DCMI Metadata Terms" (http://dublincore.org/documents/dcmi-terms/) for an explanation.

Related Corporate Body (Corporate Body)
has subproperty: Product of a split
has subproperty: Hierarchical superior
definition: Eine Körperschaft, die mit der Person, Familie oder Körperschaft in Verbindung steht, die durch eine Ansetzungsform des Sucheinstiegs und/oder einen Identifier repräsentiert wird (z.B. eine Musikgruppe, der eine Person angehört, eine Tochterfirma). Zu den in Beziehung stehenden Körperschaften gehören auch Körperschaften, die der Institution, die durch eine Ansetzungsform des Sucheinstiegs und/oder einen Identifier repräsentiert wird, als Ergebnis einer Namensänderung vorangeht oder nachfolgt. @de
has subproperty: Successor
domain: CorporateBody
has subproperty: Product of a merger
has subproperty: Mergee
label: In Beziehung stehende Körperschaft (Körperschaft) @de
has subproperty: Predecessor
type: Property
status: New-Proposed
name: relatedCorporateBodyCorporateBody
definition: A corporate body that is associated with the person, family, or corporate body represented by a preferred access point and/or identifier (e.g., a musical group to which a person belongs, a subsidiary company). Related corporate bodies include corporate bodies that precede or succeed the body represented by an authorized access point and/or identifier as the result of a change of name.
note: A corporate body that is associated with the person, family, or corporate body represented by a preferred access point and/or identifier (e.g., a musical group to which a person belongs, a subsidiary company). Related corporate bodies include corporate bodies that precede or succeed the body represented by an authorized access point and/or identifier as the result of a change of name.
note: Eine Körperschaft, die mit der Person, Familie oder Körperschaft in Verbindung steht, die durch eine Ansetzungsform des Sucheinstiegs und/oder einen Identifier repräsentiert wird (z.B. eine Musikgruppe, der eine Person angehört, eine Tochterfirma). Zu den in Beziehung stehenden Körperschaften gehören auch Körperschaften, die der Institution, die durch eine Ansetzungsform des Sucheinstiegs und/oder einen Identifier repräsentiert wird, als Ergebnis einer Namensänderung vorangeht oder nachfolgt. @de
domain: Resource

Related Family (Corporate Body)
label: in Beziehung stehende Familie @de
has subproperty: Sponsored organization
type: Property
status: New-Proposed
definition: A family that is associated with the person, family, or corporate body represented by a preferred access point and/or identifier (e.g., a person’s family, a family that owns the controlling interest in a corporate body).
has subproperty: Founded organization
name: relatedFamilyCorporateBody
definition: Eine Familie, die mit der Person, Familie oder Körperschaft in Verbindung steht, die durch eine Ansetzungsform des Sucheinstiegs und/oder einen Identifier repräsentiert wird (z. B. die Familie einer Person, eine Familie, die die Kapitalmehrheit in einer Körperschaft hat). @de
domain: CorporateBody
note: A family that is associated with the person, family, or corporate body represented by a preferred access point and/or identifier (e.g., a person’s family, a family that owns the controlling interest in a corporate body).
note: Eine Familie, die mit der Person, Familie oder Körperschaft in Verbindung steht, die durch eine Ansetzungsform des Sucheinstiegs und/oder einen Identifier repräsentiert wird (z. B. die Familie einer Person, eine Familie, die die Kapitalmehrheit in einer Körperschaft hat). @de
domain: Resource

history note
definition: A note about the past state/use/meaning of a concept.
type: AnnotationProperty
sub property of: note
type: Property
note: A note about the past state/use/meaning of a concept.

Employer
definition: A corporate body that employs the person.
name: employer
label: Arbeitgeber @de
type: Property
status: New-Proposed
domain: CorporateBody
definition: Die Körperschaft, welche die Person beschäftigt. @de
sub property of: Related Person (Corporate Body)
note: Die Körperschaft, welche die Person beschäftigt. @de
note: A corporate body that employs the person.
domain: Resource

SKOS Vocabulary
type: Ontology
contributor: Dave Beckett
contributor: Nikki Rogers
contributor: Participants in W3C's Semantic Web Deployment Working Group.
description: An RDF vocabulary for describing the basic structure and content of concept schemes such as thesauri, classification schemes, subject heading lists, taxonomies, 'folksonomies', other types of controlled vocabulary, and also concept schemes embedded in glossaries and terminologies.
creator: Alistair Miles
creator: Sean Bechhofer

Alternate identity
definition: A pseudonymous or other identity assumed by the person.
name: alternateIdentity
label: andere Identität @de
domain: Person
status: New-Proposed
type: Property
definition: Das Pseudonym bzw. die andere Identität, welche die Person annimmt. @de
sub property of: Related Person (Person)
note: A pseudonymous or other identity assumed by the person.
note: Das Pseudonym bzw. die andere Identität, welche die Person annimmt. @de
domain: Resource

Product of a merger
name: productOfAMerger
domain: CorporateBody
type: Property
definition: Die Körperschaft, die aus der Fusion einer oder mehrerer Körperschaften entsteht. @de
definition: A corporate body that resulted from a merger of two or more other corporate bodies.
status: New-Proposed
label: Ergebnis einer Fusion @de
sub property of: Related Corporate Body (Corporate Body)
note: Die Körperschaft, die aus der Fusion einer oder mehrerer Körperschaften entsteht. @de
note: A corporate body that resulted from a merger of two or more other corporate bodies.
domain: Resource

Founder
sub property of: Related Corporate Body (Person)
definition: A person who founded the corporate body.
name: founder
status: New-Proposed
definition: Die Person, welche die Körperschaft gegründet hat. @de
label: Gründer @de
type: Property
note: A person who founded the corporate body.
note: Die Person, welche die Körperschaft gegründet hat. @de
domain: Person
domain: Resource

preferred label
definition: The preferred lexical label for a resource, in a given language.
type: AnnotationProperty
sub property of: label
comment: A resource has no more than one value of skos:prefLabel per language tag, and no more than one value of skos:prefLabel without language tag.
comment: The range of skos:prefLabel is the class of RDF plain literals.
comment: skos:prefLabel, skos:altLabel and skos:hiddenLabel are pairwise disjoint properties.
type: Property
note: The preferred lexical label for a resource, in a given language.

New-Proposed
type: Concept
type: http://lodlaundromat.org/.well-known/genid/samples/jena///predicate//9c665bc7b67f929ca1e8d5b167e0a84b/d8234c3b1439a879aea940e9009663be#1
type: Thing

Relation
description: Recommended best practice is to identify the related resource by means of a string conforming to a formal identification system.
has version: relation-006
issued: 1999-07-02
modified: 2008-01-14
type: Property
comment: A related resource.
note: A second property with the same name as this property has been declared in the dcterms: namespace (http://purl.org/dc/terms/). See the Introduction to the document "DCMI Metadata Terms" (http://dublincore.org/documents/dcmi-terms/) for an explanation.

notation
definition: A notation, also known as classification code, is a string of characters such as "T58.5" or "303.4833" used to uniquely identify a concept within the scope of a given concept scheme.
scope note: By convention, skos:notation is used with a typed literal in the object position of the triple.
type: DatatypeProperty
type: Property
note: By convention, skos:notation is used with a typed literal in the object position of the triple.
note: A notation, also known as classification code, is a string of characters such as "T58.5" or "303.4833" used to uniquely identify a concept within the scope of a given concept scheme.

example
definition: An example of the use of a concept.
type: AnnotationProperty
sub property of: note
type: Property
note: An example of the use of a concept.

Real identity
definition: A real person who assumes the alternate identity.
name: realIdentity
label: wirkliche Identität @de
status: New-Proposed
definition: Die reale Person, die die andere Identität annimmt. @de
sub property of: Related Person (Person)
type: Property
domain: Person
note: Die reale Person, die die andere Identität annimmt. @de
note: A real person who assumes the alternate identity.
domain: Resource

Hierarchical superior
name: hierarchicalSuperior
domain: CorporateBody
status: New-Proposed
definition: Die Körperschaft, die einer anderen Körperschaft übergeordnet ist. @de
label: übergeordnete Körperschaft @de
sub property of: Related Corporate Body (Corporate Body)
definition: A corporate body that is hierarchically superior to the other corporate body.
type: Property
note: A corporate body that is hierarchically superior to the other corporate body.
note: Die Körperschaft, die einer anderen Körperschaft übergeordnet ist. @de
domain: Resource

Related Person
has subproperty: Related Person (Family)
label: In Beziehung stehende Person @de
type: Property
definition: Eine Person, die mit der Person, Familie oder Körperschaft in Verbindung steht, die durch eine Ansetzungsform des Sucheinstiegs und/oder Identifier repräsentiert wird (z. B. ein Mitarbeiter, ein Familienmitglied, ein Gründer einer Körperschaft). Zu den in Beziehung stehenden Personen gehören auch getrennte Identitäten, die durch ein Individuum begründet wurden. @de
status: New-Proposed
definition: A person who is associated with the person, family, or corporate body represented by a preferred access point and/or identifier (e.g., a collaborator, a member of a family, a founder of a corporate body). Related persons include separate identities established by an individual.
name: relatedPerson
has subproperty: Descendants
note: A person who is associated with the person, family, or corporate body represented by a preferred access point and/or identifier (e.g., a collaborator, a member of a family, a founder of a corporate body). Related persons include separate identities established by an individual.
note: Eine Person, die mit der Person, Familie oder Körperschaft in Verbindung steht, die durch eine Ansetzungsform des Sucheinstiegs und/oder Identifier repräsentiert wird (z. B. ein Mitarbeiter, ein Familienmitglied, ein Gründer einer Körperschaft). Zu den in Beziehung stehenden Personen gehören auch getrennte Identitäten, die durch ein Individuum begründet wurden. @de

Related Corporate Body (Family)
type: Property
name: relatedCorporateBodyFamily
label: In Beziehung stehende Körperschaft (Familie) @de
status: New-Proposed
sub property of: Related Corporate Body
definition: Eine Körperschaft, die mit der Person, Familie oder Körperschaft in Verbindung steht, die durch eine Ansetzungsform des Sucheinstiegs und/oder einen Identifier repräsentiert wird (z.B. eine Musikgruppe, der eine Person angehört, eine Tochterfirma). Zu den in Beziehung stehenden Körperschaften gehören auch Körperschaften, die der Institution, die durch eine Ansetzungsform des Sucheinstiegs und/oder einen Identifier repräsentiert wird, als Ergebnis einer Namensänderung vorangeht oder nachfolgt. @de
domain: Family
definition: A corporate body that is associated with the person, family, or corporate body represented by a preferred access point and/or identifier (e.g., a musical group to which a person belongs, a subsidiary company). Related corporate bodies include corporate bodies that precede or succeed the body represented by an authorized access point and/or identifier as the result of a change of name.
note: Eine Körperschaft, die mit der Person, Familie oder Körperschaft in Verbindung steht, die durch eine Ansetzungsform des Sucheinstiegs und/oder einen Identifier repräsentiert wird (z.B. eine Musikgruppe, der eine Person angehört, eine Tochterfirma). Zu den in Beziehung stehenden Körperschaften gehören auch Körperschaften, die der Institution, die durch eine Ansetzungsform des Sucheinstiegs und/oder einen Identifier repräsentiert wird, als Ergebnis einer Namensänderung vorangeht oder nachfolgt. @de
note: A corporate body that is associated with the person, family, or corporate body represented by a preferred access point and/or identifier (e.g., a musical group to which a person belongs, a subsidiary company). Related corporate bodies include corporate bodies that precede or succeed the body represented by an authorized access point and/or identifier as the result of a change of name.
domain: Resource

Successor
name: successor
type: Property
label: Nachfolger @de
status: New-Proposed
definition: Die Körperschaft, die einer anderen Körperschaft nachfolgt oder aus ihr hervorgeht. @de
definition: A corporate body that succeeds or follows the other corporate body.
sub property of: Related Corporate Body (Corporate Body)
domain: CorporateBody
note: A corporate body that succeeds or follows the other corporate body.
note: Die Körperschaft, die einer anderen Körperschaft nachfolgt oder aus ihr hervorgeht. @de
domain: Resource

Employee
name: employee
definition: Die Person, die bei einer Körperschaft beschäftigt ist. @de
label: Arbeitnehmer @de
status: New-Proposed
definition: A person employed by a corporate body.
domain: Person
sub property of: Related Corporate Body (Person)
type: Property
note: A person employed by a corporate body.
note: Die Person, die bei einer Körperschaft beschäftigt ist. @de
domain: Resource

Date
description: Date may be used to express temporal information at any level of granularity. Recommended best practice is to use an encoding scheme, such as the W3CDTF profile of ISO 8601 [W3CDTF].
has version: date-006
issued: 1999-07-02
modified: 2008-01-14
type: Property
comment: A point or period of time associated with an event in the lifecycle of the resource.
note: A second property with the same name as this property has been declared in the dcterms: namespace (http://purl.org/dc/terms/). See the Introduction to the document "DCMI Metadata Terms" (http://dublincore.org/documents/dcmi-terms/) for an explanation.

Founding Family
type: Property
definition: Die Familie, welche die Körperschaft gegründet hat. @de
domain: Family
sub property of: Related Corporate Body
label: Gründerfamilie @de
name: foundingFamily
definition: A family that founded the corporate body.
status: New-Proposed
note: Die Familie, welche die Körperschaft gegründet hat. @de
note: A family that founded the corporate body.
domain: Resource

Product of a split
type: Property
domain: CorporateBody
status: New-Proposed
name: productOfASplit
definition: Die Körperschaft, die aus einer Spaltung oder Teilung von der anderen Körperschaft entsteht. @de
label: Ergebnis einer Teilung @de
sub property of: Related Corporate Body (Corporate Body)
definition: A corporate body that resulted from a split or division of the other corporate body.
note: Die Körperschaft, die aus einer Spaltung oder Teilung von der anderen Körperschaft entsteht. @de
note: A corporate body that resulted from a split or division of the other corporate body.
domain: Resource

Related Family (Person)
domain: Person
definition: A family that is associated with the person, family, or corporate body represented by a preferred access point and/or identifier (e.g., a person’s family, a family that owns the controlling interest in a corporate body).
label: in beziehung stehende Familie (Person) @de
type: Property
name: relatedFamilyPerson
status: New-Proposed
has subproperty: Family member
definition: Eine Familie, die mit der Person, Familie oder Körperschaft in Verbindung steht, die durch eine Ansetzungsform des Sucheinstiegs und/oder einen Identifier repräsentiert wird (z. B. die Familie einer Person, eine Familie, die die Kapitalmehrheit in einer Körperschaft hat). @de
note: A family that is associated with the person, family, or corporate body represented by a preferred access point and/or identifier (e.g., a person’s family, a family that owns the controlling interest in a corporate body).
note: Eine Familie, die mit der Person, Familie oder Körperschaft in Verbindung steht, die durch eine Ansetzungsform des Sucheinstiegs und/oder einen Identifier repräsentiert wird (z. B. die Familie einer Person, eine Familie, die die Kapitalmehrheit in einer Körperschaft hat). @de
domain: Resource

Coverage
description: Spatial topic and spatial applicability may be a named place or a location specified by its geographic coordinates. Temporal topic may be a named period, date, or date range. A jurisdiction may be a named administrative entity or a geographic place to which the resource applies. Recommended best practice is to use a controlled vocabulary such as the Thesaurus of Geographic Names [TGN]. Where appropriate, named places or time periods can be used in preference to numeric identifiers such as sets of coordinates or date ranges.
has version: coverage-006
issued: 1999-07-02
modified: 2008-01-14
type: Property
comment: The spatial or temporal topic of the resource, the spatial applicability of the resource, or the jurisdiction under which the resource is relevant.
note: A second property with the same name as this property has been declared in the dcterms: namespace (http://purl.org/dc/terms/). See the Introduction to the document "DCMI Metadata Terms" (http://dublincore.org/documents/dcmi-terms/) for an explanation.

Contributor
description: Examples of a Contributor include a person, an organization, or a service. Typically, the name of a Contributor should be used to indicate the entity.
has version: contributor-006
issued: 1999-07-02
modified: 2008-01-14
type: Property
comment: An entity responsible for making contributions to the resource.
note: A second property with the same name as this property has been declared in the dcterms: namespace (http://purl.org/dc/terms/). See the Introduction to the document "DCMI Metadata Terms" (http://dublincore.org/documents/dcmi-terms/) for an explanation.

Sponsoring Family
definition: Die Familie, welche die Körperschaft fördert. @de
type: Property
name: sponsoringFamily
definition: A family that sponsors the corporate body.
domain: Family
label: Sponsorenfamilie @de
status: New-Proposed
sub property of: Related Corporate Body
note: Die Familie, welche die Körperschaft fördert. @de
note: A family that sponsors the corporate body.
domain: Resource

editorial note
definition: A note for an editor, translator or maintainer of the vocabulary.
type: AnnotationProperty
sub property of: note
type: Property
note: A note for an editor, translator or maintainer of the vocabulary.

Related Person (Person)
status: New-Proposed
definition: Eine Person, die mit der Person, Familie oder Körperschaft in Verbindung steht, die durch eine Ansetzungsform des Sucheinstiegs und/oder Identifier repräsentiert wird (z. B. ein Mitarbeiter, ein Familienmitglied, ein Gründer einer Körperschaft).Zu den in Beziehung stehenden Personen gehören auch getrennte Identitäten, die durch ein Individuum begründet wurden. @de
has subproperty: Real identity
name: relatedPersonPerson
label: in Beziehung stehende Person (Person) @de
type: Property
has subproperty: Alternate identity
definition: A person who is associated with the person, family, or corporate body represented by a preferred access point and/or identifier (e.g., a collaborator, a member of a family, a founder of a corporate body). Related persons include separate identities established by an individual.
domain: Person
note: A person who is associated with the person, family, or corporate body represented by a preferred access point and/or identifier (e.g., a collaborator, a member of a family, a founder of a corporate body). Related persons include separate identities established by an individual.
note: Eine Person, die mit der Person, Familie oder Körperschaft in Verbindung steht, die durch eine Ansetzungsform des Sucheinstiegs und/oder Identifier repräsentiert wird (z. B. ein Mitarbeiter, ein Familienmitglied, ein Gründer einer Körperschaft).Zu den in Beziehung stehenden Personen gehören auch getrennte Identitäten, die durch ein Individuum begründet wurden. @de
domain: Resource

Related Person (Corporate Body)
status: New-Proposed
type: Property
has subproperty: Employer
name: relatedPersonCorporateBody
definition: Eine Person, die mit der Person, Familie oder Körperschaft in Verbindung steht, die durch eine Ansetzungsform des Sucheinstiegs und/oder Identifier repräsentiert wird (z.B. ein Mitarbeiter, ein Familienmitglied, ein Gründer einer Körperschaft).Zu den in Beziehung stehenden Personen gehören auch getrennte Identitäten, die durch ein Individuum begründet wurden. @de
label: in Beziehung stehende Person (Körperschaft) @de
definition: A person who is associated with the person, family, or corporate body represented by a preferred access point and/or identifier (e.g., a collaborator, a member of a family, a founder of a corporate body). Related persons include separate identities established by an individual.
domain: CorporateBody
note: Eine Person, die mit der Person, Familie oder Körperschaft in Verbindung steht, die durch eine Ansetzungsform des Sucheinstiegs und/oder Identifier repräsentiert wird (z.B. ein Mitarbeiter, ein Familienmitglied, ein Gründer einer Körperschaft).Zu den in Beziehung stehenden Personen gehören auch getrennte Identitäten, die durch ein Individuum begründet wurden. @de
note: A person who is associated with the person, family, or corporate body represented by a preferred access point and/or identifier (e.g., a collaborator, a member of a family, a founder of a corporate body). Related persons include separate identities established by an individual.
domain: Resource

Rights
description: Typically, rights information includes a statement about various property rights associated with the resource, including intellectual property rights.
has version: rights-006
issued: 1999-07-02
modified: 2008-01-14
type: Property
comment: Information about rights held in and over the resource.
note: A second property with the same name as this property has been declared in the dcterms: namespace (http://purl.org/dc/terms/). See the Introduction to the document "DCMI Metadata Terms" (http://dublincore.org/documents/dcmi-terms/) for an explanation.

Sponsored organization
status: New-Proposed
definition: Die Körperschaft, welche von der Familie gefördert wird. @de
name: sponsoredOrganization
sub property of: Related Family (Corporate Body)
definition: A corporate body that the family sponsors.
label: geförderte Organisation @de
domain: CorporateBody
type: Property
note: A corporate body that the family sponsors.
note: Die Körperschaft, welche von der Familie gefördert wird. @de
domain: Resource

Title
has version: title-006
issued: 1999-07-02
modified: 2008-01-14
type: Property
comment: A name given to the resource.
note: A second property with the same name as this property has been declared in the dcterms: namespace (http://purl.org/dc/terms/). See the Introduction to the document "DCMI Metadata Terms" (http://dublincore.org/documents/dcmi-terms/) for an explanation.

scope note
definition: A note that helps to clarify the meaning and/or the use of a concept.
type: AnnotationProperty
sub property of: note
type: Property
note: A note that helps to clarify the meaning and/or the use of a concept.