maker
sub property of: Contributor
sub property of: Creator
range: Thing
equivalent property: Creator
comment: An agent that made this thing.
term status: stable
domain: Thing
inverse of: made
type: Property
range: Agent
type: ObjectProperty
range: Resource
domain: Resource

Method of Instruction
subclass of: Resource
Has Version: MethodOfInstruction-001
issued: 2008-01-14
type: Class
comment: A process that is used to engender knowledge, attitudes, and skills.
Relation: MethodOfInstruction-001
date: 2008-01-14

depiction
range: Thing
type: Property
type: ObjectProperty
comment: A depiction of some thing.
domain: Thing
range: Image
inverse of: depicts
term status: testing
domain: Resource
range: Document
range: Resource

write
subclass of: Resource
type: Class
subclass of: Access

graph
range: Thing
domain: Thing
type: ObjectProperty
comment: Graph for a triple filter.
domain: Filter
range: Graph
status: testing
type: Property
domain: Resource
range: Resource

knows
range: Thing
domain: Thing
type: Property
type: ObjectProperty
comment: A person known by this person (indicating some level of reciprocated interaction between the parties).
domain: Person
range: Person
term status: stable
domain: Agent
domain: Resource
domain: SpatialThing
range: Agent
range: Resource
range: SpatialThing

Rights Statement
subclass of: Resource
Has Version: RightsStatement-001
issued: 2008-01-14
type: Class
comment: A statement about the intellectual property rights (IPR) held in or over a Resource, a legal document giving official permission to do something with a resource, or a statement about access rights.
Relation: RightsStatement-001
date: 2008-01-14

Online Account
subclass of: Resource
type: Class
comment: An online account.
subclass of: Thing
term status: testing

predicate
range: Thing
domain: Thing
type: ObjectProperty
comment: Predicate for a triple filter.
domain: Filter
status: testing
type: Property
domain: Resource
range: Resource

Linguistic System
subclass of: Resource
description: Examples include written, spoken, sign, and computer languages.
Has Version: LinguisticSystem-001
issued: 2008-01-14
type: Class
comment: A system of signs, symbols, sounds, gestures, or rules used in communication.
Relation: LinguisticSystem-001
date: 2008-01-14

Agent Class
subclass of: Resource
description: Examples of Agent Class include groups seen as classes, such as students, women, charities, lecturers.
Has Version: AgentClass-003
issued: 2008-01-14
Date Modified: 2012-06-14
type: Class
comment: A group of agents.
subclass of: Class
Relation: AgentClass-003
date: 2012-06-14
date: 2008-01-14

Filter
subclass of: Thing
subclass of: Resource
type: Class
comment: A triple filter.
status: testing

Online Chat Account
subclass of: Resource
subclass of: Thing
type: Class
comment: An online chat account.
subclass of: Online Account
term status: unstable

Policy
subclass of: Resource
Has Version: Policy-001
issued: 2008-01-14
type: Class
comment: A plan or course of action by an authority, intended to influence and determine decisions, actions, and other matters.
Relation: Policy-001
date: 2008-01-14

thumbnail
range: Thing
domain: Thing
type: Property
type: ObjectProperty
comment: A derived thumbnail image.
domain: Image
range: Image
term status: testing
domain: Document
domain: Resource
range: Document
range: Resource

Provenance Statement
subclass of: Resource
Has Version: ProvenanceStatement-001
issued: 2008-01-14
type: Class
comment: A statement of any changes in ownership and custody of a resource since its creation that are significant for its authenticity, integrity, and interpretation.
Relation: ProvenanceStatement-001
date: 2008-01-14

Method of Accrual
subclass of: Resource
Has Version: MethodOfAccrual-001
issued: 2008-01-14
type: Class
comment: A method by which resources are added to a collection.
Relation: MethodOfAccrual-001
date: 2008-01-14

Period of Time
subclass of: Resource
Has Version: PeriodOfTime-001
issued: 2008-01-14
type: Class
comment: An interval of time that is named or defined by its start and end dates.
subclass of: Location, Period, or Jurisdiction
Relation: PeriodOfTime-001
date: 2008-01-14

Standard
subclass of: Resource
Has Version: Standard-001
issued: 2008-01-14
type: Class
comment: A basis for comparison; a reference point against which other things can be evaluated.
Relation: Standard-001
date: 2008-01-14

Access
subclass of: Resource
type: Class
comment: Any kind of access to a resource. Don't use this, use R W and RW
label: access

interest
range: Thing
domain: Thing
type: Property
type: ObjectProperty
comment: A page about a topic of interest to this person.
domain: Agent
range: Document
term status: testing
domain: Resource
range: Resource

depicts
domain: Thing
type: Property
type: ObjectProperty
comment: A thing depicted in this representation.
domain: Image
range: Thing
inverse of: depiction
term status: testing
domain: Document
domain: Resource
range: Resource

account
range: Thing
domain: Thing
type: Property
type: ObjectProperty
comment: Indicates an account held by this agent.
domain: Agent
range: Online Account
term status: testing
domain: Resource
range: Resource

Location
subclass of: Resource
Has Version: Location-001
issued: 2008-01-14
type: Class
comment: A spatial region or named place.
subclass of: Location, Period, or Jurisdiction
Relation: Location-001
date: 2008-01-14

Bibliographic Resource
subclass of: Resource
Has Version: BibliographicResource-001
issued: 2008-01-14
type: Class
comment: A book, article, or other documentary resource.
Relation: BibliographicResource-001
date: 2008-01-14

TripleAuthorization
subclass of: Thing
subclass of: Resource
type: Class
comment: A triple authorization.
subclass of: authorization
status: testing

schoolHomepage
range: Thing
domain: Thing
type: Property
type: ObjectProperty
comment: A homepage of a school attended by the person.
domain: Person
range: Document
term status: testing
domain: Agent
domain: Resource
domain: SpatialThing
range: Resource

Person
subclass of: Resource
subclass of: Thing
subclass of: Agent
comment: A person.
term status: stable
subclass of: SpatialThing
disjoint with: Project
type: Class
subclass of: Person
disjoint with: Organization

Physical Medium
subclass of: Resource
description: Examples include paper, canvas, or DVD.
Has Version: PhysicalMedium-001
issued: 2008-01-14
type: Class
comment: A physical material or carrier.
subclass of: Media Type
Relation: PhysicalMedium-001
date: 2008-01-14

topic
domain: Thing
type: Property
type: ObjectProperty
comment: A topic of some page or document.
domain: Document
range: Thing
inverse of: page
term status: testing
domain: Resource
range: Resource

member
range: Thing
domain: Thing
type: Property
type: ObjectProperty
comment: Indicates a member of a Group
domain: Group
range: Agent
term status: stable
domain: Agent
domain: Resource
range: Resource

Project
subclass of: Resource
subclass of: Thing
type: Class
comment: A project (a collective endeavour of some kind).
disjoint with: Person
disjoint with: Document
term status: testing

Media Type or Extent
subclass of: Resource
Has Version: MediaTypeOrExtent-001
issued: 2008-01-14
type: Class
comment: A media type or extent.
Relation: MediaTypeOrExtent-001
date: 2008-01-14

Source
sub property of: Relation
description: The described resource may be derived from the related resource in whole or in part. Recommended best practice is to identify the related resource by means of a string conforming to a formal identification system.
note: This term is intended to be used with non-literal values as defined in the DCMI Abstract Model (http://dublincore.org/documents/abstract-model/). As of December 2007, the DCMI Usage Board is seeking a way to express this intention with a formal range declaration.
comment: A related resource from which the described resource is derived.
type: Property
sub property of: Source
issued: 2008-01-14
Date Modified: 2008-01-14
Has Version: sourceT-001
Relation: sourceT-001
date: 2008-01-14

homepage
range: Thing
comment: A homepage for some thing.
range: Document
type: Property
term status: stable
sub property of: page
sub property of: is primary topic of
domain: Thing
type: ObjectProperty
type: InverseFunctionalProperty
range: Resource
domain: Resource

current project
domain: Thing
type: Property
type: ObjectProperty
comment: A current project this person works on.
domain: Person
range: Thing
term status: testing
domain: Agent
domain: Resource
domain: SpatialThing
range: Resource

filter
range: Thing
domain: Thing
type: ObjectProperty
comment: Contains triple filter rules.
domain: TripleAuthorization
range: Filter
status: testing
type: Property
domain: Resource
domain: authorization
range: Resource

weblog
range: Thing
domain: Thing
sub property of: page
type: Property
range: Document
term status: testing
comment: A weblog of some thing (whether person, group, company etc.).
domain: Agent
type: InverseFunctionalProperty
type: ObjectProperty
range: Resource
domain: Resource

statement
range: Thing
domain: Thing
type: ObjectProperty
comment: Statement for a triple filter.
domain: Filter
status: testing
type: Property
domain: Resource
range: Resource

phone
range: Thing
domain: Thing
type: Property
type: ObjectProperty
comment: A phone, specified using fully qualified tel: URI scheme (refs: http://www.w3.org/Addressing/schemes.html#tel).
term status: testing
domain: Resource
range: Resource

Image
subclass of: Resource
subclass of: Thing
type: Class
comment: An image.
subclass of: Document
term status: testing

made
domain: Thing
type: Property
type: ObjectProperty
comment: Something that was made by this agent.
domain: Agent
range: Thing
inverse of: maker
term status: stable
domain: Resource
range: Resource

is primary topic of
range: Thing
comment: A document that this thing is the primary topic of.
domain: Thing
sub property of: page
type: InverseFunctionalProperty
range: Document
type: Property
term status: stable
inverse of: primary topic
type: ObjectProperty
range: Resource
domain: Resource

subject
range: Thing
domain: Thing
type: ObjectProperty
comment: Subject for a triple filter.
domain: Filter
status: testing
type: Property
domain: Resource
range: Resource

Jurisdiction
subclass of: Resource
Has Version: Jurisdiction-001
issued: 2008-01-14
type: Class
comment: The extent or range of judicial, law enforcement, or other authority.
subclass of: Location, Period, or Jurisdiction
Relation: Jurisdiction-001
date: 2008-01-14

License Document
subclass of: Resource
Has Version: LicenseDocument-001
issued: 2008-01-14
type: Class
comment: A legal document giving official permission to do something with a Resource.
subclass of: Rights Statement
Relation: LicenseDocument-001
date: 2008-01-14

Document
subclass of: Resource
subclass of: Thing
type: Class
comment: A document.
disjoint with: Organization
disjoint with: Project
term status: testing

Online Gaming Account
subclass of: Resource
subclass of: Thing
type: Class
comment: An online gaming account.
subclass of: Online Account
term status: unstable

children
range: Thing
domain: Thing
type: ObjectProperty
comment: Contains sub triple authorization informations.
domain: TripleAuthorization
status: testing
type: Property
domain: Resource
domain: authorization
range: Resource

append
subclass of: Resource
type: Class
comment: Append accesses are specific write access which only add information, and do not remove information. For text files, for example, append access allows bytes to be added onto the end of the file. For RDF graphs, Append access allows adds triples to the graph but does not remove any. Append access is useful for dropbox functionality. Dropbox can be used for link notification, which the information added is a notification that a some link has been made elsewhere relevant to the given resource.
subclass of: Access
subclass of: write

Agent
subclass of: Resource
subclass of: Agent
description: Examples of Agent include person, organization, and software agent.
Has Version: Agent-001
issued: 2008-01-14
type: Agent Class
type: Class
comment: A resource that acts or has the power to act.
Relation: Agent-001
date: 2008-01-14
equivalent class: Agent

File Format
subclass of: Resource
description: Examples include the formats defined by the list of Internet Media Types.
Has Version: FileFormat-001
issued: 2008-01-14
type: Class
comment: A digital resource format.
subclass of: Media Type
Relation: FileFormat-001
date: 2008-01-14

workplace homepage
range: Thing
domain: Thing
type: Property
type: ObjectProperty
comment: A workplace homepage of some person; the homepage of an organization they work for.
domain: Person
range: Document
term status: testing
domain: Agent
domain: Resource
domain: SpatialThing
range: Resource

Size or Duration
subclass of: Resource
description: Examples include a number of pages, a specification of length, width, and breadth, or a period in hours, minutes, and seconds.
Has Version: SizeOrDuration-001
issued: 2008-01-14
type: Class
comment: A dimension or extent, or a time taken to play or execute.
subclass of: Media Type or Extent
Relation: SizeOrDuration-001
date: 2008-01-14

personal mailbox
domain: Thing
type: Property
type: InverseFunctionalProperty
type: ObjectProperty
comment: A personal mailbox, ie. an Internet mailbox associated with exactly one owner, the first owner of this mailbox. This is a 'static inverse functional property', in that there is (across time and change) at most one individual that ever has any particular value for foaf:mbox.
domain: Agent
range: Thing
term status: stable
domain: Resource
range: Resource

focus
domain: Thing
type: Property
type: ObjectProperty
comment: The underlying or 'focal' entity associated with some SKOS-described concept.
domain: Concept
range: Thing
term status: testing
domain: Resource
range: Resource

openid
range: Thing
domain: Thing
sub property of: page
range: Document
type: ObjectProperty
term status: testing
type: Property
domain: Agent
type: InverseFunctionalProperty
sub property of: is primary topic of
comment: An OpenID for an Agent.
range: Resource
domain: Resource

Online E-commerce Account
subclass of: Resource
subclass of: Thing
type: Class
comment: An online e-commerce account.
subclass of: Online Account
term status: unstable

Group
subclass of: Resource
subclass of: Thing
subclass of: Agent
type: Class
comment: A class of Agents.
term status: stable

Creator
sub property of: Contributor
sub property of: maker
Date Modified: 2010-10-11
comment: An entity primarily responsible for making the resource.
Has Version: creatorT-002
equivalent property: maker
issued: 2008-01-14
sub property of: Creator
type: Property
description: Examples of a Creator include a person, an organization, or a service.
range: Agent
Relation: creatorT-002
date: 2010-10-11
date: 2008-01-14
range: Thing
range: Resource
domain: Thing
domain: Resource

read
subclass of: Resource
type: Class
comment: The class of read operations
subclass of: Access

Agent
subclass of: Thing
subclass of: Resource
subclass of: Agent
type: Class
comment: An agent (eg. person, group, software or physical artifact).
equivalent class: Agent
term status: stable

control
subclass of: Resource
type: Class
comment: Allows read/write access to the ACL for the resource(s)
subclass of: Access

Label Property
subclass of: Resource
subclass of: Thing
type: Class
comment: A foaf:LabelProperty is any RDF property with texual values that serve as labels.
term status: unstable

Organization
subclass of: Resource
subclass of: Thing
subclass of: Agent
type: Class
comment: An organization.
disjoint with: Person
disjoint with: Document
term status: stable

publications
range: Thing
domain: Thing
type: Property
type: ObjectProperty
comment: A link to the publications of this person.
domain: Person
range: Document
term status: testing
domain: Agent
domain: Resource
domain: SpatialThing
range: Resource

authorization
subclass of: Resource
type: Class
comment: An element of access control, allowing agent to agents access of some kind to resources or classes of resources

accesToTriple
range: Thing
domain: Thing
type: ObjectProperty
comment: Contains triple authorization information.
domain: TripleAuthorization
domain: authorization
range: TripleAuthorization
status: testing
type: Property
domain: Resource
range: Resource
range: authorization

image
range: Thing
domain: Thing
type: Property
type: ObjectProperty
comment: An image that can be used to represent some thing (ie. those depictions which are particularly representative of something, eg. one's photo on a homepage).
domain: Person
range: Image
sub property of: depiction
term status: testing
range: Resource
range: Document
domain: Resource
domain: Agent
domain: SpatialThing

work info homepage
range: Thing
domain: Thing
type: Property
type: ObjectProperty
comment: A work info homepage of some person; a page about their work for some organization.
domain: Person
range: Document
term status: testing
domain: Agent
domain: Resource
domain: SpatialThing
range: Resource

PersonalProfileDocument
subclass of: Resource
subclass of: Thing
type: Class
comment: A personal profile RDF document.
subclass of: Document
term status: testing

Media Type
subclass of: Resource
Has Version: MediaType-001
issued: 2008-01-14
type: Class
comment: A file format or physical medium.
subclass of: Media Type or Extent
Relation: MediaType-001
date: 2008-01-14

required
range: Thing
domain: Thing
type: ObjectProperty
comment: If this property is true access to the parent triple is only granted if childrens are found.
domain: TripleAuthorization
status: testing
type: Property
domain: Resource
domain: authorization
range: Resource

primary topic
domain: Thing
domain: Document
type: FunctionalProperty
range: Thing
type: Property
term status: stable
type: ObjectProperty
comment: The primary topic of some page or document.
inverse of: is primary topic of
domain: Resource
range: Resource

based near
range: Thing
domain: Thing
type: Property
type: ObjectProperty
comment: A location that something is based near, for some broadly human notion of near.
domain: SpatialThing
range: SpatialThing
term status: testing
domain: Resource
range: Resource

account service homepage
range: Thing
domain: Thing
type: Property
type: ObjectProperty
comment: Indicates a homepage of the service provide for this online account.
domain: Online Account
range: Document
term status: testing
domain: Resource
range: Resource

page
range: Thing
type: Property
type: ObjectProperty
comment: A page or document about this thing.
domain: Thing
range: Document
inverse of: topic
term status: testing
domain: Resource
range: Resource

object
range: Thing
domain: Thing
type: ObjectProperty
comment: Object for a triple filter
domain: Filter
status: testing
type: Property
domain: Resource
range: Resource

topic_interest
domain: Thing
type: Property
type: ObjectProperty
comment: A thing of interest to this person.
domain: Agent
range: Thing
term status: testing
domain: Resource
range: Resource

Location, Period, or Jurisdiction
subclass of: Resource
Has Version: LocationPeriodOrJurisdiction-001
issued: 2008-01-14
type: Class
comment: A location, period of time, or jurisdiction.
Relation: LocationPeriodOrJurisdiction-001
date: 2008-01-14

account
range: Thing
domain: Thing
type: Property
type: ObjectProperty
comment: Indicates an account held by this agent.
domain: Agent
range: Online Account
term status: archaic
domain: Resource
range: Resource

Physical Resource
subclass of: Resource
Has Version: PhysicalResource-001
issued: 2008-01-14
type: Class
comment: A material thing.
Relation: PhysicalResource-001
date: 2008-01-14

mode
range: Thing
domain: Thing
type: ObjectProperty
comment: Access mode is defined per triple authorization.
domain: TripleAuthorization
sub property of: access mode
status: testing
type: Property
range: Class
range: Resource
domain: authorization
domain: Resource

Frequency
subclass of: Resource
Has Version: Frequency-001
issued: 2008-01-14
type: Class
comment: A rate at which something recurs.
Relation: Frequency-001
date: 2008-01-14

tipjar
range: Thing
domain: Thing
type: Property
type: ObjectProperty
comment: A tipjar document for this agent, describing means for payment and reward.
domain: Agent
range: Document
sub property of: page
term status: testing
range: Resource
domain: Resource

past project
domain: Thing
type: Property
type: ObjectProperty
comment: A project this person has previously worked on.
domain: Person
range: Thing
term status: testing
domain: Agent
domain: Resource
domain: SpatialThing
range: Resource

tab
type: Property
comment: A grouping label providing a mechanism for selecting the tab content that is to be rendered to the user.

application
type: Property
comment: A region declared as a web application, as opposed to a web document.

Date Created
sub property of: Date
range: Literal
Date Modified: 2008-01-14
comment: Date of creation of the resource.
type: Property
Has Version: created-003
issued: 2000-07-11
Relation: created-003
date: 2008-01-14
date: 2000-07-11
range: Resource

access control
type: Property
comment: The Access Control file for this information resource. This may of course be a virtual resorce implemented by the access control system. Note also HTTP's header Link: foo.meta ;rel=meta can be used for this.
domain: InformationResource
range: InformationResource
sub property of: seeAlso
domain: Resource
range: Resource

familyName
type: Property
type: DatatypeProperty
comment: The family name of some person.
domain: Person
range: Literal
term status: testing
domain: Thing
domain: Agent
domain: Resource
domain: SpatialThing
range: Resource

Skype ID
type: Property
type: DatatypeProperty
comment: A Skype ID
domain: Agent
range: Literal
sub property of: nickname
term status: testing
domain: Thing
domain: Resource
range: Resource

Accrual Method
Has Version: accrualMethod-003
issued: 2005-06-13
Date Modified: 2010-10-11
type: Property
comment: The method by which items are added to a collection.
domain: Collection
range: Method of Accrual
Relation: accrualMethod-003
date: 2010-10-11
date: 2005-06-13
domain: Resource
range: Resource

tablist
type: Property
comment: A list of tab elements, which are references to tabpanel elements.

search
type: Property
member: role-properties
comment: indicates that the section provides a search facility.

more info
type: Property
comment: more information about the status etc of a term, typically human oriented
term status: unstable

subsection
type: Property
member: relrev-properties
term: subsection
comment: subsection refers to a resource serving as a subsection in a collection.

Source
description: The described resource may be derived from the related resource in whole or in part. Recommended best practice is to identify the related resource by means of a string conforming to a formal identification system.
Has Version: source-006
issued: 1999-07-02
Date Modified: 2008-01-14
type: Property
comment: A related resource from which the described resource is derived.
note: A second property with the same name as this property has been declared in the dcterms: namespace (http://purl.org/dc/terms/). See the Introduction to the document "DCMI Metadata Terms" (http://dublincore.org/documents/dcmi-terms/) for an explanation.
Relation: source-006
date: 2008-01-14
date: 1999-07-02

Accrual Periodicity
Has Version: accrualPeriodicity-003
issued: 2005-06-13
Date Modified: 2010-10-11
type: Property
comment: The frequency with which items are added to a collection.
domain: Collection
range: Frequency
Relation: accrualPeriodicity-003
date: 2010-10-11
date: 2005-06-13
domain: Resource
range: Resource

agent
type: Property
comment: A person or social entity to being given the right
domain: authorization
range: Agent
domain: Resource
range: Thing
range: Resource

Description
description: Description may include but is not limited to: an abstract, a table of contents, a graphical representation, or a free-text account of the resource.
Has Version: descriptionT-001
issued: 2008-01-14
Date Modified: 2008-01-14
type: Property
comment: An account of the resource.
sub property of: Description
Relation: descriptionT-001
date: 2008-01-14

group
type: Property
comment: A set of user interface objects which are not intended to be included in a page summary or table of contents by assistive technologies.

treegrid
type: Property
comment: A grid whose rows can be expanded and collapsed in the same manner as for a tree.

radiogroup
type: Property
comment: A group of radio buttons.

UDC
Has Version: UDC-003
issued: 2000-07-11
Date Modified: 2008-01-14
type: VocabularyEncodingScheme
comment: The set of conceptual resources specified by the Universal Decimal Classification.
Relation: UDC-003
date: 2008-01-14
date: 2000-07-11

appendix
type: Property
member: relrev-properties
term: appendix
comment: appendix refers to a resource serving as an appendix in a collection.

help
type: Property
member: relrev-properties
term: help
comment: help refers to a resource offering help.

Is Replaced By
type: Property
sub property of: Relation
note: This term is intended to be used with non-literal values as defined in the DCMI Abstract Model (http://dublincore.org/documents/abstract-model/). As of December 2007, the DCMI Usage Board is seeking a way to express this intention with a formal range declaration.
Date Modified: 2008-01-14
issued: 2000-07-11
Has Version: isReplacedBy-003
comment: A related resource that supplants, displaces, or supersedes the described resource.
Relation: isReplacedBy-003
date: 2008-01-14
date: 2000-07-11

treeitem
type: Property
comment: An option item of a tree. This is an element within a tree that may be expanded or collapsed if it contains a sub-level group of treeitems.

Language
issued: 1999-07-02
note: A second property with the same name as this property has been declared in the dcterms: namespace (http://purl.org/dc/terms/). See the Introduction to the document "DCMI Metadata Terms" (http://dublincore.org/documents/dcmi-terms/) for an explanation.
Has Version: language-007
description: Recommended best practice is to use a controlled vocabulary such as RFC 4646 [RFC4646].
type: Property
comment: A language of the resource.
Date Modified: 2008-01-14
Relation: language-007
date: 2008-01-14
date: 1999-07-02

title
type: Property
type: DatatypeProperty
comment: Title (Mr, Mrs, Ms, Dr. etc)
term status: testing

Has Part
type: Property
Date Modified: 2008-01-14
issued: 2000-07-11
comment: A related resource that is included either physically or logically in the described resource.
note: This term is intended to be used with non-literal values as defined in the DCMI Abstract Model (http://dublincore.org/documents/abstract-model/). As of December 2007, the DCMI Usage Board is seeking a way to express this intention with a formal range declaration.
sub property of: Relation
Has Version: hasPart-003
Relation: hasPart-003
date: 2008-01-14
date: 2000-07-11

funded by
type: Property
type: ObjectProperty
comment: An organization funding a project or person.
domain: Thing
range: Thing
term status: archaic
domain: Resource
range: Resource

radio
type: Property
comment: A checkable input in a group of radio roles, only one of which can be checked at a time.

combobox
type: Property
comment: A presentation of a select; usually similar to a textbox where users can type ahead to select an option, or type to enter arbitrary text as a new item in the list. Also see listbox.

lastName
type: Property
type: DatatypeProperty
comment: The last name of a person.
domain: Person
range: Literal
term status: testing
domain: Thing
domain: Agent
domain: Resource
domain: SpatialThing
range: Resource

Type
description: Recommended best practice is to use a controlled vocabulary such as the DCMI Type Vocabulary [DCMITYPE]. To describe the file format, physical medium, or dimensions of the resource, use the Format element.
Has Version: type-006
issued: 1999-07-02
Date Modified: 2008-01-14
type: Property
comment: The nature or genre of the resource.
note: A second property with the same name as this property has been declared in the dcterms: namespace (http://purl.org/dc/terms/). See the Introduction to the document "DCMI Metadata Terms" (http://dublincore.org/documents/dcmi-terms/) for an explanation.
Relation: type-006
date: 2008-01-14
date: 1999-07-02

Relation
note: This term is intended to be used with non-literal values as defined in the DCMI Abstract Model (http://dublincore.org/documents/abstract-model/). As of December 2007, the DCMI Usage Board is seeking a way to express this intention with a formal range declaration.
comment: A related resource.
description: Recommended best practice is to identify the related resource by means of a string conforming to a formal identification system.
Has Version: relationT-001
type: Property
sub property of: Relation
issued: 2008-01-14
Date Modified: 2008-01-14
Relation: relationT-001
date: 2008-01-14

Is Part Of
issued: 2000-07-11
type: Property
sub property of: Relation
Date Modified: 2008-01-14
note: This term is intended to be used with non-literal values as defined in the DCMI Abstract Model (http://dublincore.org/documents/abstract-model/). As of December 2007, the DCMI Usage Board is seeking a way to express this intention with a formal range declaration.
Has Version: isPartOf-003
comment: A related resource in which the described resource is physically or logically included.
Relation: isPartOf-003
date: 2008-01-14
date: 2000-07-11

Surname
type: Property
type: DatatypeProperty
comment: The surname of some person.
domain: Person
range: Literal
term status: archaic
domain: Thing
domain: Agent
domain: Resource
domain: SpatialThing
range: Resource

document
type: Property
comment: A region containing related information that is declared as document content, as opposed to a web application.

menubar
type: Property
comment: A presentation of menu that usually remains visible and is usually presented horizontally.

Table Of Contents
Has Version: tableOfContents-003
issued: 2000-07-11
Date Modified: 2008-01-14
type: Property
comment: A list of subunits of the resource.
sub property of: Description
Relation: tableOfContents-003
date: 2008-01-14
date: 2000-07-11

RFC 5646
description: RFC 5646 obsoletes RFC 4646.
Has Version: RFC5646-001
issued: 2010-10-11
type: Datatype
comment: The set of tags constructed according to RFC 5646 for the identification of languages.
Relation: RFC5646-001
date: 2010-10-11
type: Class

Creator
description: Examples of a Creator include a person, an organization, or a service. Typically, the name of a Creator should be used to indicate the entity.
Has Version: creator-006
issued: 1999-07-02
Date Modified: 2008-01-14
type: Property
comment: An entity primarily responsible for making the resource.
note: A second property with the same name as this property has been declared in the dcterms: namespace (http://purl.org/dc/terms/). See the Introduction to the document "DCMI Metadata Terms" (http://dublincore.org/documents/dcmi-terms/) for an explanation.
Relation: creator-006
date: 2008-01-14
date: 1999-07-02

slider
type: Property
comment: A user input where the user selects a value from within a given range.

Date Copyrighted
range: Literal
type: Property
sub property of: Date
comment: Date of copyright.
issued: 2002-07-13
Date Modified: 2008-01-14
Has Version: dateCopyrighted-002
Relation: dateCopyrighted-002
date: 2008-01-14
date: 2002-07-13
range: Resource

Coverage
issued: 2008-01-14
comment: The spatial or temporal topic of the resource, the spatial applicability of the resource, or the jurisdiction under which the resource is relevant.
Has Version: coverageT-001
Date Modified: 2008-01-14
sub property of: Coverage
type: Property
range: Location, Period, or Jurisdiction
description: Spatial topic and spatial applicability may be a named place or a location specified by its geographic coordinates. Temporal topic may be a named period, date, or date range. A jurisdiction may be a named administrative entity or a geographic place to which the resource applies. Recommended best practice is to use a controlled vocabulary such as the Thesaurus of Geographic Names [TGN]. Where appropriate, named places or time periods can be used in preference to numeric identifiers such as sets of coordinates or date ranges.
Relation: coverageT-001
date: 2008-01-14
range: Resource

SemWeb Vocab Status ontology
creator: Libby Miller
preferred namespace prefix: vs
comment: This vocabulary was created in the FOAF project, based on experience with FOAF, Dublin Core and other early RDF vocabularies. Deployment experience shows that changing namespace URIs is expensive and unrewarding, so this vocabulary provides terms to support in-place evolution of structured data vocabularies. By indicating status at the level of terms rather than vocabularies, dictionary-style, fine grained improvements become easier. Different organizations and parties can agree or disagree on the status of a vocabulary term; however the status published alongside the term may deserve special attention. Future work could include patterns for citing announcements and decisions, or using SKOS to decentralise the extension of the basic status levels.
issued: 2003-06-01
Contributor: Pierre-Yves Vandenbussche
type: Ontology
creator: Dan Brickley
creator: Leigh Dodds
modified: 2011-12-12
description: An RDF vocabulary for relating SW vocabulary terms to their status.
preferred namespace uri: http://www.w3.org/2003/06/sw-vocab-status/ns#

NLM
Has Version: NLM-002
issued: 2005-06-13
Date Modified: 2008-01-14
type: VocabularyEncodingScheme
comment: The set of conceptual resources specified by the National Library of Medicine Classification.
Relation: NLM-002
date: 2008-01-14
date: 2005-06-13

Accrual Policy
Has Version: accrualPolicy-003
issued: 2005-06-13
Date Modified: 2010-10-11
type: Property
comment: The policy governing the addition of items to a collection.
domain: Collection
range: Policy
Relation: accrualPolicy-003
date: 2010-10-11
date: 2005-06-13
domain: Resource
range: Resource

DNA checksum
type: Property
type: DatatypeProperty
comment: A checksum for the DNA of some thing. Joke.
range: Literal
term status: archaic
range: Resource

membershipClass
type: Property
type: AnnotationProperty
comment: Indicates the class of individuals that are a member of a Group
term status: unstable

Provenance
description: The statement may include a description of any changes successive custodians made to the resource.
Has Version: provenance-002
issued: 2004-09-20
Date Modified: 2008-01-14
type: Property
comment: A statement of any changes in ownership and custody of the resource since its creation that are significant for its authenticity, integrity, and interpretation.
range: Provenance Statement
Relation: provenance-002
date: 2008-01-14
date: 2004-09-20
range: Resource

plan
type: Property
type: DatatypeProperty
comment: Aplan comment, in the tradition of finger and '.plan' files.
domain: Person
range: Literal
term status: testing
domain: Thing
domain: Agent
domain: Resource
domain: SpatialThing
range: Resource

to
type: Property
comment: The information resource to which access is being granted.
domain: authorization
range: InformationResource
domain: Resource
range: Resource

sha1sum (hex)
type: Property
type: DatatypeProperty
comment: A sha1sum hash, in hex.
domain: Document
term status: unstable
domain: Thing
domain: Resource

Given name
type: Property
type: DatatypeProperty
comment: The given name of some person.
term status: archaic

contents
type: Property
member: relrev-properties
term: contents
comment: contents refers to a resource serving as a table of contents.

Title
Has Version: title-006
issued: 1999-07-02
Date Modified: 2008-01-14
type: Property
comment: A name given to the resource.
note: A second property with the same name as this property has been declared in the dcterms: namespace (http://purl.org/dc/terms/). See the Introduction to the document "DCMI Metadata Terms" (http://dublincore.org/documents/dcmi-terms/) for an explanation.
Relation: title-006
date: 2008-01-14
date: 1999-07-02

LCC
Has Version: LCC-003
issued: 2000-07-11
Date Modified: 2008-01-14
type: VocabularyEncodingScheme
comment: The set of conceptual resources specified by the Library of Congress Classification.
Relation: LCC-003
date: 2008-01-14
date: 2000-07-11

up
type: Property
member: relrev-properties
term: up
comment: up refers to a resource "above" in a hierarchically structured set.

role
type: Property
member: relrev-properties
term: role
comment: role indicates the purpose of the resource. See the XHTML Role Vocabulary for roles in this vocabulary space, and XHTMLROLE for information on extending the collection of roles.
type: Container

Title
Has Version: titleT-002
issued: 2008-01-14
Date Modified: 2010-10-11
type: Property
comment: A name given to the resource.
range: Literal
sub property of: Title
Relation: titleT-002
date: 2010-10-11
date: 2008-01-14
range: Resource

IMT
Has Version: IMT-004
issued: 2000-07-11
Date Modified: 2008-01-14
type: VocabularyEncodingScheme
comment: The set of media types specified by the Internet Assigned Numbers Authority.
Relation: IMT-004
date: 2008-01-14
date: 2000-07-11

marquee
type: Property
comment: A type of live region where non-essential information changes frequently. Also see log.

Medium
range: Physical Medium
comment: The material or physical carrier of the resource.
domain: Physical Resource
issued: 2000-07-11
type: Property
Has Version: medium-003
sub property of: Format
Date Modified: 2008-01-14
Relation: medium-003
date: 2008-01-14
date: 2000-07-11
range: Media Type or Extent
range: Resource
domain: Resource
range: Media Type

term status
type: Property
comment: the status of a vocabulary term, expressed as a short symbolic string; known values include 'unstable','testing', 'stable' and 'archaic'
term status: unstable

glossary
type: Property
member: relrev-properties
term: glossary
comment: glossary refers to a resource providing a glossary of terms.

ICQ chat ID
sub property of: nickname
term status: testing
domain: Agent
range: Literal
comment: An ICQ chat ID
type: InverseFunctionalProperty
type: Property
type: DatatypeProperty
type: ObjectProperty
domain: Thing
domain: Resource
range: Resource

Date Available
comment: Date (often a range) that the resource became or will become available.
issued: 2000-07-11
Has Version: available-003
sub property of: Date
Date Modified: 2008-01-14
type: Property
range: Literal
Relation: available-003
date: 2008-01-14
date: 2000-07-11
range: Resource

list
type: Property
comment: A group of non-interactive list items. Also see listbox.

note
type: Property
member: role-properties
comment: indicates the content is parenthetic or ancillary to the main content of the resource.

Has Format
issued: 2000-07-11
Date Modified: 2008-01-14
type: Property
comment: A related resource that is substantially the same as the pre-existing described resource, but in another format.
Has Version: hasFormat-003
sub property of: Relation
note: This term is intended to be used with non-literal values as defined in the DCMI Abstract Model (http://dublincore.org/documents/abstract-model/). As of December 2007, the DCMI Usage Board is seeking a way to express this intention with a formal range declaration.
Relation: hasFormat-003
date: 2008-01-14
date: 2000-07-11

DDC
Has Version: DDC-003
issued: 2000-07-11
Date Modified: 2008-01-14
type: VocabularyEncodingScheme
comment: The set of conceptual resources specified by the Dewey Decimal Classification.
Relation: DDC-003
date: 2008-01-14
date: 2000-07-11

link
type: Property
comment: An interactive reference to an internal or external resource that, when activated, causes the user agent to navigate to that resource. Also see button.

copyright
type: Property
member: relrev-properties
term: copyright
comment: copyright refers to a copyright statement for the resource.

theme
type: Property
type: ObjectProperty
comment: A theme.
domain: Thing
range: Thing
term status: archaic
domain: Resource
range: Resource

contentinfo
type: Property
member: role-properties
comment: contains meta information about the content on the page or the page as a whole.

RFC 4646
description: RFC 4646 obsoletes RFC 3066.
Has Version: RFC4646-001
issued: 2008-01-14
type: Datatype
comment: The set of tags constructed according to RFC 4646 for the identification of languages.
Relation: RFC4646-001
date: 2008-01-14
type: Class

Bibliographic Citation
Has Version: bibliographicCitation-002
description: Recommended practice is to include sufficient bibliographic detail to identify the resource as unambiguously as possible.
range: Literal
domain: Bibliographic Resource
comment: A bibliographic reference for the resource.
type: Property
sub property of: Identifier
issued: 2003-02-15
Date Modified: 2008-01-14
Relation: bibliographicCitation-002
date: 2008-01-14
date: 2003-02-15
range: Resource
domain: Resource

Replaces
Has Version: replaces-003
note: This term is intended to be used with non-literal values as defined in the DCMI Abstract Model (http://dublincore.org/documents/abstract-model/). As of December 2007, the DCMI Usage Board is seeking a way to express this intention with a formal range declaration.
Date Modified: 2008-01-14
comment: A related resource that is supplanted, displaced, or superseded by the described resource.
sub property of: Relation
type: Property
issued: 2000-07-11
Relation: replaces-003
date: 2008-01-14
date: 2000-07-11

DCMI Box
Has Version: Box-003
issued: 2000-07-11
Date Modified: 2008-01-14
type: Datatype
comment: The set of regions in space defined by their geographic coordinates according to the DCMI Box Encoding Scheme.
Relation: Box-003
date: 2008-01-14
date: 2000-07-11
type: Class

icon
type: Property
member: relrev-properties
term: icon
comment: icon refers to a resource that represents an icon.

DCMI Metadata Terms - other
Date Modified: 2012-06-14
publisher: DCMI
date: 2012-06-14

Temporal Coverage
sub property of: Coverage
Has Version: temporal-003
type: Property
issued: 2000-07-11
Date Modified: 2008-01-14
range: Period of Time
comment: Temporal characteristics of the resource.
Relation: temporal-003
date: 2008-01-14
date: 2000-07-11
range: Location, Period, or Jurisdiction
range: Resource

ISO 639-2
Has Version: ISO639-2-003
issued: 2000-07-11
Date Modified: 2008-01-14
type: Datatype
comment: The three-letter alphabetic codes listed in ISO639-2 for the representation of names of languages.
Relation: ISO639-2-003
date: 2008-01-14
date: 2000-07-11
type: Class

rowheader
type: Property
comment: A cell containing header information for a row in a grid.

button
type: Property
comment: An input that allows for user-triggered actions when clicked or pressed. Also see link.

Date Valid
type: Property
range: Literal
issued: 2000-07-11
sub property of: Date
comment: Date (often a range) of validity of a resource.
Date Modified: 2008-01-14
Has Version: valid-003
Relation: valid-003
date: 2008-01-14
date: 2000-07-11
range: Resource

RFC 3066
description: RFC 3066 has been obsoleted by RFC 4646.
Has Version: RFC3066-002
issued: 2002-07-13
Date Modified: 2008-01-14
type: Datatype
comment: The set of tags constructed according to RFC 3066 for the identification of languages.
Relation: RFC3066-002
date: 2008-01-14
date: 2002-07-13
type: Class

bookmark
type: Property
member: relrev-properties
term: bookmark
comment: bookmark refers to a bookmark - a link to a key entry point within an extended document.

birthday
type: Property
type: FunctionalProperty
type: DatatypeProperty
comment: The birthday of this Agent, represented in mm-dd string form, eg. '12-31'.
domain: Agent
range: Literal
term status: unstable
domain: Thing
domain: Resource
range: Resource

timer
type: Property
comment: A type of live region containing a numerical counter which indicates an amount of elapsed time from a start point, or the time remaining until an end point.

Extent
type: Property
comment: The size or duration of the resource.
issued: 2000-07-11
range: Size or Duration
Has Version: extent-003
Date Modified: 2008-01-14
sub property of: Format
Relation: extent-003
date: 2008-01-14
date: 2000-07-11
range: Media Type or Extent
range: Resource

URI
Has Version: URI-003
issued: 2000-07-11
Date Modified: 2008-01-14
type: Datatype
comment: The set of identifiers constructed according to the generic syntax for Uniform Resource Identifiers as specified by the Internet Engineering Task Force.
Relation: URI-003
date: 2008-01-14
date: 2000-07-11
type: Class

Date
issued: 2008-01-14
comment: A point or period of time associated with an event in the lifecycle of the resource.
description: Date may be used to express temporal information at any level of granularity. Recommended best practice is to use an encoding scheme, such as the W3CDTF profile of ISO 8601 [W3CDTF].
Has Version: dateT-001
Date Modified: 2008-01-14
type: Property
range: Literal
sub property of: Date
Relation: dateT-001
date: 2008-01-14
range: Resource

W3C-DTF
Has Version: W3CDTF-003
issued: 2000-07-11
Date Modified: 2008-01-14
type: Datatype
comment: The set of dates and times constructed according to the W3C Date and Time Formats Specification.
Relation: W3CDTF-003
date: 2008-01-14
date: 2000-07-11
type: Class

p3pv1
type: Property
member: relrev-properties
term: p3pv1
comment: p3pv1 refers to a P3P Policy Reference File [P3P].

toolbar
type: Property
comment: A collection of commonly used function buttons represented in compact visual form.

Access Rights
range: Rights Statement
type: Property
issued: 2003-02-15
comment: Information about who can access the resource or an indication of its security status.
description: Access Rights may include information regarding access or restrictions based on privacy, security, or other policies.
sub property of: Rights
Date Modified: 2008-01-14
Has Version: accessRights-002
Relation: accessRights-002
date: 2008-01-14
date: 2003-02-15
range: Resource

Friend of a Friend (FOAF) vocabulary
type: Ontology
description: The Friend of a Friend (FOAF) RDF vocabulary, described using W3C RDF Schema and the Web Ontology Language.

rowgroup
type: Property
comment: A group containing one or more row elements in a grid.

banner
type: Property
member: role-properties
comment: contains the prime heading or internal title of a page.

TGN
Has Version: TGN-003
issued: 2000-07-11
Date Modified: 2008-01-14
type: VocabularyEncodingScheme
comment: The set of places specified by the Getty Thesaurus of Geographic Names.
Relation: TGN-003
date: 2008-01-14
date: 2000-07-11

alert
type: Property
comment: A message with important, and usually time-sensitive, information. Also see alertdialog and status.

Dublin Core Metadata Element Set, Version 1.1
Date Modified: 2012-06-14
publisher: DCMI
date: 2012-06-14

progressbar
type: Property
comment: An element that displays the progress status for tasks that take a long time.

DCMI Type Vocabulary
Has Version: DCMIType-005
issued: 2000-07-11
Date Modified: 2012-06-14
type: VocabularyEncodingScheme
comment: The set of classes specified by the DCMI Type Vocabulary, used to categorize the nature or genre of the resource.
Relation: DCMIType-005
date: 2012-06-14
date: 2000-07-11

Language
Date Modified: 2008-01-14
type: Property
Has Version: languageT-001
sub property of: Language
description: Recommended best practice is to use a controlled vocabulary such as RFC 4646 [RFC4646].
issued: 2008-01-14
comment: A language of the resource.
range: Linguistic System
Relation: languageT-001
date: 2008-01-14
range: Resource

listbox
type: Property
comment: A widget that allows the user to select one or more items from a list of choices. Also see combobox and list.

spinbutton
type: Property
comment: A form of range that expects a user to select from amongst discrete choices.

grid
type: Property
comment: A grid is an interactive control which contains cells of tabular data arranged in rows and columns, like a table.

itsRules
type: Property
member: relrev-properties
term: itsRules
comment: itsRules indicates that the designated resource is an [ITS] rule set.

heading
type: Property
comment: A heading for a section of the page.

img
type: Property
comment: A container for a collection of elements that form an image.

Given name
type: Property
type: DatatypeProperty
comment: The given name of some person.
term status: testing

directory
type: Property
comment: A list of references to members of a group, such as a static table of contents.

Is Required By
comment: A related resource that requires the described resource to support its function, delivery, or coherence.
type: Property
Date Modified: 2008-01-14
sub property of: Relation
note: This term is intended to be used with non-literal values as defined in the DCMI Abstract Model (http://dublincore.org/documents/abstract-model/). As of December 2007, the DCMI Usage Board is seeking a way to express this intention with a formal range declaration.
Has Version: isRequiredBy-003
issued: 2000-07-11
Relation: isRequiredBy-003
date: 2008-01-14
date: 2000-07-11

ISO 639-3
Has Version: ISO639-3-001
issued: 2008-01-14
type: Datatype
comment: The set of three-letter codes listed in ISO 639-3 for the representation of names of languages.
Relation: ISO639-3-001
date: 2008-01-14
type: Class

dialog
type: Property
comment: A dialog is an application window that is designed to interrupt the current processing of an application in order to prompt the user to enter information or require a response. Also see alertdialog.

gridcell
type: Property
comment: A cell in a grid or treegrid.

name
type: Property
type: DatatypeProperty
comment: A name for some thing.
domain: Thing
range: Literal
sub property of: label
term status: testing
domain: Resource
range: Resource

listitem
type: Property
comment: A single item in a list or directory.

Publisher
description: Examples of a Publisher include a person, an organization, or a service. Typically, the name of a Publisher should be used to indicate the entity.
Has Version: publisher-006
issued: 1999-07-02
Date Modified: 2008-01-14
type: Property
comment: An entity responsible for making the resource available.
note: A second property with the same name as this property has been declared in the dcterms: namespace (http://purl.org/dc/terms/). See the Introduction to the document "DCMI Metadata Terms" (http://dublincore.org/documents/dcmi-terms/) for an explanation.
Relation: publisher-006
date: 2008-01-14
date: 1999-07-02

cite
type: Property
member: relrev-properties
term: cite
comment: cite refers to a resource that defines a citation.

log
type: Property
comment: A type of live region where new information is added in meaningful order and old information may disappear. Also see marquee.

alternate
type: Property
member: relrev-properties
term: alternate
comment: alternate designates alternate versions for a resource.

option
type: Property
comment: A selectable item in a select list.

form
type: Property
comment: A landmark region that contains a collection of items and objects that, as a whole, combine to create a form. Also see search.

license
type: Property
member: relrev-properties
term: license
comment: license refers to a resource that defines the associated license.

presentation
type: Property
comment: An element whose implicit native role semantics will not be mapped to the accessibility API.

nickname
type: Property
type: DatatypeProperty
comment: A short informal nickname characterising an agent (includes login identifiers, IRC and other chat nicknames).
term status: testing

Is Version Of
note: This term is intended to be used with non-literal values as defined in the DCMI Abstract Model (http://dublincore.org/documents/abstract-model/). As of December 2007, the DCMI Usage Board is seeking a way to express this intention with a formal range declaration.
Has Version: isVersionOf-003
sub property of: Relation
type: Property
comment: A related resource of which the described resource is a version, edition, or adaptation.
issued: 2000-07-11
description: Changes in version imply substantive changes in content rather than differences in format.
Date Modified: 2008-01-14
Relation: isVersionOf-003
date: 2008-01-14
date: 2000-07-11

Conforms To
issued: 2001-05-21
Date Modified: 2008-01-14
range: Standard
sub property of: Relation
comment: An established standard to which the described resource conforms.
Has Version: conformsTo-003
type: Property
Relation: conformsTo-003
date: 2008-01-14
date: 2001-05-21
range: Resource

TripleAccessControl Ontology
date: 2011-09-15T20:00:00Z
creator: me
type: Ontology
is version of: TripleAccessControl Ontology
creator: samer
version info: 0.1
description: The TripleAccessControl Ontology is an extension to WebAccessControl Ontology to describe access control rules for RDF triples.
Rights: Copyright © 2011 Thomas Bergwinkl
type: Thing

Date Issued
range: Literal
sub property of: Date
comment: Date of formal issuance (e.g., publication) of the resource.
Has Version: issued-003
Date Modified: 2008-01-14
type: Property
issued: 2000-07-11
Relation: issued-003
date: 2008-01-14
date: 2000-07-11
range: Resource

menuitemcheckbox
type: Property
comment: A checkable menuitem that has three possible values: true, false, or mixed.

Yahoo chat ID
domain: Agent
term status: testing
range: Literal
comment: A Yahoo chat ID
type: DatatypeProperty
sub property of: nickname
type: Property
type: InverseFunctionalProperty
type: ObjectProperty
domain: Thing
domain: Resource
range: Resource

Abstract
Has Version: abstract-003
issued: 2000-07-11
Date Modified: 2008-01-14
type: Property
comment: A summary of the resource.
sub property of: Description
Relation: abstract-003
date: 2008-01-14
date: 2000-07-11

menu
type: Property
comment: A type of widget that offers a list of choices to the user.

AIM chat ID
type: Property
type: DatatypeProperty
domain: Agent
comment: An AIM chat ID
type: InverseFunctionalProperty
term status: testing
range: Literal
sub property of: nickname
type: ObjectProperty
domain: Thing
domain: Resource
range: Resource

Date
description: Date may be used to express temporal information at any level of granularity. Recommended best practice is to use an encoding scheme, such as the W3CDTF profile of ISO 8601 [W3CDTF].
Has Version: date-006
issued: 1999-07-02
Date Modified: 2008-01-14
type: Property
comment: A point or period of time associated with an event in the lifecycle of the resource.
note: A second property with the same name as this property has been declared in the dcterms: namespace (http://purl.org/dc/terms/). See the Introduction to the document "DCMI Metadata Terms" (http://dublincore.org/documents/dcmi-terms/) for an explanation.
Relation: date-006
date: 2008-01-14
date: 1999-07-02

default access for new things in
type: Property
comment: A directory for which this authorization is used for new files in the directory.
domain: authorization
domain: Resource

last
type: Property
member: relrev-properties
term: last
comment: last refers to the last resource in a collection of resources.

Audience
Has Version: audience-003
issued: 2001-05-21
Date Modified: 2008-01-14
type: Property
comment: A class of entity for whom the resource is intended or useful.
range: Agent Class
Relation: audience-003
date: 2008-01-14
date: 2001-05-21
range: Class
range: Resource

access mode
type: Property
comment: A mode of access such as read or write.
domain: authorization
range: Class
domain: Resource
range: Resource

article
type: Property
comment: A section of a page that consists of a composition that forms an independent part of a document, page, or site.

section
type: Property
member: relrev-properties
term: section
comment: section refers to a resource serving as a section in a collection.

References
type: Property
note: This term is intended to be used with non-literal values as defined in the DCMI Abstract Model (http://dublincore.org/documents/abstract-model/). As of December 2007, the DCMI Usage Board is seeking a way to express this intention with a formal range declaration.
issued: 2000-07-11
Date Modified: 2008-01-14
sub property of: Relation
Has Version: references-003
comment: A related resource that is referenced, cited, or otherwise pointed to by the described resource.
Relation: references-003
date: 2008-01-14
date: 2000-07-11

Alternative Title
sub property of: Title
type: Property
Date Modified: 2010-10-11
range: Literal
issued: 2000-07-11
description: The distinction between titles and alternative titles is application-specific.
Has Version: alternative-003
comment: An alternative name for the resource.
Relation: alternative-003
date: 2010-10-11
date: 2000-07-11
range: Resource

Identifier
sub property of: Identifier
range: Literal
Has Version: identifierT-001
description: Recommended best practice is to identify the resource by means of a string conforming to a formal identification system.
issued: 2008-01-14
type: Property
comment: An unambiguous reference to the resource within a given context.
Date Modified: 2008-01-14
Relation: identifierT-001
date: 2008-01-14
range: Resource

chapter
type: Property
member: relrev-properties
term: chapter
comment: chapter refers to a resource serving as a chapter in a collection.

Relation
description: Recommended best practice is to identify the related resource by means of a string conforming to a formal identification system.
Has Version: relation-006
issued: 1999-07-02
Date Modified: 2008-01-14
type: Property
comment: A related resource.
note: A second property with the same name as this property has been declared in the dcterms: namespace (http://purl.org/dc/terms/). See the Introduction to the document "DCMI Metadata Terms" (http://dublincore.org/documents/dcmi-terms/) for an explanation.
Relation: relation-006
date: 2008-01-14
date: 1999-07-02

Rights
description: Typically, rights information includes a statement about various property rights associated with the resource, including intellectual property rights.
Has Version: rights-006
issued: 1999-07-02
Date Modified: 2008-01-14
type: Property
comment: Information about rights held in and over the resource.
note: A second property with the same name as this property has been declared in the dcterms: namespace (http://purl.org/dc/terms/). See the Introduction to the document "DCMI Metadata Terms" (http://dublincore.org/documents/dcmi-terms/) for an explanation.
Relation: rights-006
date: 2008-01-14
date: 1999-07-02

textbox
type: Property
comment: Input that allows free-form text as its value.

Instructional Method
description: Instructional Method will typically include ways of presenting instructional materials or conducting instructional activities, patterns of learner-to-learner and learner-to-instructor interactions, and mechanisms by which group and individual levels of learning are measured. Instructional methods include all aspects of the instruction and learning processes from planning and implementation through evaluation and feedback.
Has Version: instructionalMethod-002
issued: 2005-06-13
Date Modified: 2008-01-14
type: Property
comment: A process, used to engender knowledge, attitudes and skills, that the described resource is designed to support.
range: Method of Instruction
Relation: instructionalMethod-002
date: 2008-01-14
date: 2005-06-13
range: Resource

geekcode
type: Property
type: DatatypeProperty
comment: A textual geekcode for this person, see http://www.geekcode.com/geek.html
domain: Person
range: Literal
term status: archaic
domain: Thing
domain: Agent
domain: Resource
domain: SpatialThing
range: Resource

status
type: Property
comment: A container whose content is advisory information for the user but is not important enough to justify an alert. Also see alert.

family_name
type: Property
type: DatatypeProperty
comment: The family name of some person.
domain: Person
range: Literal
term status: archaic
domain: Thing
domain: Agent
domain: Resource
domain: SpatialThing
range: Resource

Date Submitted
sub property of: Date
type: Property
range: Literal
comment: Date of submission of the resource.
Date Modified: 2008-01-14
issued: 2002-07-13
description: Examples of resources to which a Date Submitted may be relevant are a thesis (submitted to a university department) or an article (submitted to a journal).
Has Version: dateSubmitted-002
Relation: dateSubmitted-002
date: 2008-01-14
date: 2002-07-13
range: Resource

Is Format Of
Has Version: isFormatOf-003
Date Modified: 2008-01-14
issued: 2000-07-11
sub property of: Relation
type: Property
note: This term is intended to be used with non-literal values as defined in the DCMI Abstract Model (http://dublincore.org/documents/abstract-model/). As of December 2007, the DCMI Usage Board is seeking a way to express this intention with a formal range declaration.
comment: A related resource that is substantially the same as the described resource, but in another format.
Relation: isFormatOf-003
date: 2008-01-14
date: 2000-07-11

definition
type: Property
member: role-properties
comment: indicates the definition of a term or concept.

Mediator
type: Property
range: Agent Class
issued: 2001-05-21
Has Version: mediator-003
Date Modified: 2008-01-14
comment: An entity that mediates access to the resource and for whom the resource is intended or useful.
description: In an educational context, a mediator might be a parent, teacher, teaching assistant, or care-giver.
sub property of: Audience
Relation: mediator-003
date: 2008-01-14
date: 2001-05-21
range: Resource
range: Class

Coverage
description: Spatial topic and spatial applicability may be a named place or a location specified by its geographic coordinates. Temporal topic may be a named period, date, or date range. A jurisdiction may be a named administrative entity or a geographic place to which the resource applies. Recommended best practice is to use a controlled vocabulary such as the Thesaurus of Geographic Names [TGN]. Where appropriate, named places or time periods can be used in preference to numeric identifiers such as sets of coordinates or date ranges.
Has Version: coverage-006
issued: 1999-07-02
Date Modified: 2008-01-14
type: Property
comment: The spatial or temporal topic of the resource, the spatial applicability of the resource, or the jurisdiction under which the resource is relevant.
note: A second property with the same name as this property has been declared in the dcterms: namespace (http://purl.org/dc/terms/). See the Introduction to the document "DCMI Metadata Terms" (http://dublincore.org/documents/dcmi-terms/) for an explanation.
Relation: coverage-006
date: 2008-01-14
date: 1999-07-02

region
type: Property
comment: A large perceivable section of a web page or document, that the author feels is important enough to be included in a page summary or table of contents, for example, an area of the page containing live sporting event statistics.

checkbox
type: Property
comment: A checkable input that has three possible values: true, false, or mixed.

main
type: Property
member: role-properties
comment: acts as the main content of the document.

tooltip
type: Property
comment: A contextual popup that displays a description for an element.

index
type: Property
member: relrev-properties
term: index
comment: index refers to a resource providing an index.

Subject
description: Typically, the subject will be represented using keywords, key phrases, or classification codes. Recommended best practice is to use a controlled vocabulary.
Has Version: subject-007
issued: 1999-07-02
Date Modified: 2012-06-14
type: Property
comment: The topic of the resource.
note: A second property with the same name as this property has been declared in the dcterms: namespace (http://purl.org/dc/terms/). See the Introduction to the document "DCMI Metadata Terms" (http://dublincore.org/documents/dcmi-terms/) for an explanation.
Relation: subject-007
date: 2012-06-14
date: 1999-07-02

Format
description: Examples of dimensions include size and duration. Recommended best practice is to use a controlled vocabulary such as the list of Internet Media Types [MIME].
Has Version: format-007
issued: 1999-07-02
Date Modified: 2008-01-14
type: Property
comment: The file format, physical medium, or dimensions of the resource.
note: A second property with the same name as this property has been declared in the dcterms: namespace (http://purl.org/dc/terms/). See the Introduction to the document "DCMI Metadata Terms" (http://dublincore.org/documents/dcmi-terms/) for an explanation.
Relation: format-007
date: 2008-01-14
date: 1999-07-02

prev
type: Property
member: relrev-properties
term: prev
comment: prev refers to a previous resource (before the current one) in an ordered collection of resources.

Is Referenced By
Date Modified: 2008-01-14
issued: 2000-07-11
sub property of: Relation
note: This term is intended to be used with non-literal values as defined in the DCMI Abstract Model (http://dublincore.org/documents/abstract-model/). As of December 2007, the DCMI Usage Board is seeking a way to express this intention with a formal range declaration.
comment: A related resource that references, cites, or otherwise points to the described resource.
type: Property
Has Version: isReferencedBy-003
Relation: isReferencedBy-003
date: 2008-01-14
date: 2000-07-11

MSN chat ID
sub property of: nickname
type: InverseFunctionalProperty
comment: An MSN chat ID
domain: Agent
type: DatatypeProperty
term status: testing
type: Property
range: Literal
type: ObjectProperty
domain: Thing
domain: Resource
range: Resource

RFC 1766
Has Version: RFC1766-003
issued: 2000-07-11
Date Modified: 2008-01-14
type: Datatype
comment: The set of tags, constructed according to RFC 1766, for the identification of languages.
Relation: RFC1766-003
date: 2008-01-14
date: 2000-07-11
type: Class

stylesheet
type: Property
member: relrev-properties
term: stylesheet
comment: stylesheet refers to a resource serving as a stylesheet for a resource.

DCMI Point
Has Version: Point-003
issued: 2000-07-11
Date Modified: 2008-01-14
type: Datatype
comment: The set of points in space defined by their geographic coordinates according to the DCMI Point Encoding Scheme.
Relation: Point-003
date: 2008-01-14
date: 2000-07-11
type: Class

Requires
Has Version: requires-003
type: Property
comment: A related resource that is required by the described resource to support its function, delivery, or coherence.
issued: 2000-07-11
sub property of: Relation
note: This term is intended to be used with non-literal values as defined in the DCMI Abstract Model (http://dublincore.org/documents/abstract-model/). As of December 2007, the DCMI Usage Board is seeking a way to express this intention with a formal range declaration.
Date Modified: 2008-01-14
Relation: requires-003
date: 2008-01-14
date: 2000-07-11

tabpanel
type: Property
comment: A container for the resources associated with a tab, where each tab is contained in a tablist.

navigation
type: Property
member: role-properties
comment: indicates a collection of items suitable for navigating the document or related documents.

complementary
type: Property
member: role-properties
comment: indicates that the section supports but is separable from the main content of resource.

Rights
range: Rights Statement
issued: 2008-01-14
description: Typically, rights information includes a statement about various property rights associated with the resource, including intellectual property rights.
comment: Information about rights held in and over the resource.
Date Modified: 2008-01-14
type: Property
Has Version: rightsT-001
sub property of: Rights
Relation: rightsT-001
date: 2008-01-14
range: Resource

Subject
Has Version: subjectT-002
Date Modified: 2012-06-14
description: Typically, the subject will be represented using keywords, key phrases, or classification codes. Recommended best practice is to use a controlled vocabulary.
issued: 2008-01-14
sub property of: Subject
type: Property
note: This term is intended to be used with non-literal values as defined in the DCMI Abstract Model (http://dublincore.org/documents/abstract-model/). As of December 2007, the DCMI Usage Board is seeking a way to express this intention with a formal range declaration.
comment: The topic of the resource.
Relation: subjectT-002
date: 2012-06-14
date: 2008-01-14

sha1sum of a personal mailbox URI name
type: Property
type: InverseFunctionalProperty
type: DatatypeProperty
comment: The sha1sum of the URI of an Internet mailbox associated with exactly one owner, the first owner of the mailbox.
domain: Agent
range: Literal
term status: testing
type: ObjectProperty
domain: Thing
domain: Resource
range: Resource

columnheader
type: Property
comment: A cell containing header information for a column.

Contributor
description: Examples of a Contributor include a person, an organization, or a service. Typically, the name of a Contributor should be used to indicate the entity.
Has Version: contributor-006
issued: 1999-07-02
Date Modified: 2008-01-14
type: Property
comment: An entity responsible for making contributions to the resource.
note: A second property with the same name as this property has been declared in the dcterms: namespace (http://purl.org/dc/terms/). See the Introduction to the document "DCMI Metadata Terms" (http://dublincore.org/documents/dcmi-terms/) for an explanation.
Relation: contributor-006
date: 2008-01-14
date: 1999-07-02

Rights Holder
Has Version: rightsHolder-002
issued: 2004-06-14
Date Modified: 2008-01-14
type: Property
comment: A person or organization owning or managing rights over the resource.
range: Agent
Relation: rightsHolder-002
date: 2008-01-14
date: 2004-06-14
range: Thing
range: Resource

Spatial Coverage
type: Property
range: Location
comment: Spatial characteristics of the resource.
issued: 2000-07-11
Date Modified: 2008-01-14
Has Version: spatial-003
sub property of: Coverage
Relation: spatial-003
date: 2008-01-14
date: 2000-07-11
range: Location, Period, or Jurisdiction
range: Resource

Publisher
Date Modified: 2010-10-11
issued: 2008-01-14
range: Agent
comment: An entity responsible for making the resource available.
Has Version: publisherT-001
type: Property
description: Examples of a Publisher include a person, an organization, or a service.
sub property of: Publisher
Relation: publisherT-001
date: 2010-10-11
date: 2008-01-14
range: Thing
range: Resource

logo
type: Property
type: ObjectProperty
type: InverseFunctionalProperty
comment: A logo representing some thing.
domain: Thing
range: Thing
term status: testing
domain: Resource
range: Resource

top
type: Property
member: relrev-properties
term: top
comment: top is a synonym for start.

MeSH
Has Version: MESH-003
issued: 2000-07-11
Date Modified: 2008-01-14
type: VocabularyEncodingScheme
comment: The set of labeled concepts specified by the Medical Subject Headings.
Relation: MESH-003
date: 2008-01-14
date: 2000-07-11

menuitem
type: Property
comment: An option in a group of choices contained by a menu or menubar.

menuitemradio
type: Property
comment: A checkable menuitem in a group of menuitemradio roles, only one of which can be checked at a time.

account name
type: Property
type: DatatypeProperty
comment: Indicates the name (identifier) associated with this online account.
domain: Online Account
range: Literal
term status: testing
domain: Thing
domain: Resource
range: Resource

Identifier
description: Recommended best practice is to identify the resource by means of a string conforming to a formal identification system.
Has Version: identifier-006
issued: 1999-07-02
Date Modified: 2008-01-14
type: Property
comment: An unambiguous reference to the resource within a given context.
note: A second property with the same name as this property has been declared in the dcterms: namespace (http://purl.org/dc/terms/). See the Introduction to the document "DCMI Metadata Terms" (http://dublincore.org/documents/dcmi-terms/) for an explanation.
Relation: identifier-006
date: 2008-01-14
date: 1999-07-02

user docs
type: Property
comment: human-oriented documentation, examples etc for use of this term
term status: unstable

delegates
type: Property
comment: Delegates a person or another agent to act on behalf of the agent. For example, Alice delegates Bob to act on behalf of Alice for ACL purposes.
range: Agent
range: Thing
range: Resource

to all in
type: Property
comment: A class of information resources to which access is being granted.
domain: authorization
range: Class
domain: Resource
range: Resource

jabber ID
type: Property
type: DatatypeProperty
type: InverseFunctionalProperty
comment: A jabber ID for something.
domain: Agent
range: Literal
term status: testing
type: ObjectProperty
domain: Thing
domain: Resource
range: Resource

scrollbar
type: Property
comment: A graphical object that controls the scrolling of content within a viewing area, regardless of whether the content is fully displayed within the viewing area.

Format
Has Version: formatT-001
type: Property
description: Examples of dimensions include size and duration. Recommended best practice is to use a controlled vocabulary such as the list of Internet Media Types [MIME].
Date Modified: 2008-01-14
comment: The file format, physical medium, or dimensions of the resource.
issued: 2008-01-14
sub property of: Format
range: Media Type or Extent
Relation: formatT-001
date: 2008-01-14
range: Resource

agent group
type: Property
comment: A group of persons or social entities to being given the right
domain: authorization
range: Group
domain: Resource
range: Resource

LCSH
Has Version: LCSH-003
issued: 2000-07-11
Date Modified: 2008-01-14
type: VocabularyEncodingScheme
comment: The set of labeled concepts specified by the Library of Congress Subject Headings.
Relation: LCSH-003
date: 2008-01-14
date: 2000-07-11

age
type: Property
type: FunctionalProperty
type: DatatypeProperty
comment: The age in years of some agent.
domain: Agent
range: Literal
term status: unstable
domain: Thing
domain: Resource
range: Resource

start
type: Property
member: relrev-properties
term: start
comment: start refers to the first resource in a collection of resources.

next
type: Property
member: relrev-properties
term: next
comment: next refers to the next resource (after the current one) in an ordered collection of resources.

separator
type: Property
comment: A divider that separates and distinguishes sections of content or groups of menuitems.

Description
description: Description may include but is not limited to: an abstract, a table of contents, a graphical representation, or a free-text account of the resource.
Has Version: description-006
issued: 1999-07-02
Date Modified: 2008-01-14
type: Property
comment: An account of the resource.
note: A second property with the same name as this property has been declared in the dcterms: namespace (http://purl.org/dc/terms/). See the Introduction to the document "DCMI Metadata Terms" (http://dublincore.org/documents/dcmi-terms/) for an explanation.
Relation: description-006
date: 2008-01-14
date: 1999-07-02

License
comment: A legal document giving official permission to do something with the resource.
type: Property
range: License Document
sub property of: Rights
issued: 2004-06-14
Date Modified: 2008-01-14
Has Version: license-002
Relation: license-002
date: 2008-01-14
date: 2004-06-14
range: Rights Statement
range: Resource

firstName
type: Property
type: DatatypeProperty
comment: The first name of a person.
domain: Person
range: Literal
term status: testing
domain: Thing
domain: Agent
domain: Resource
domain: SpatialThing
range: Resource

Type
Has Version: typeT-001
sub property of: Type
description: Recommended best practice is to use a controlled vocabulary such as the DCMI Type Vocabulary [DCMITYPE]. To describe the file format, physical medium, or dimensions of the resource, use the Format element.
Date Modified: 2008-01-14
range: Class
type: Property
comment: The nature or genre of the resource.
issued: 2008-01-14
Relation: typeT-001
date: 2008-01-14
range: Resource

ISO 3166
Has Version: ISO3166-004
issued: 2000-07-11
Date Modified: 2008-01-14
type: Datatype
comment: The set of codes listed in ISO 3166-1 for the representation of names of countries.
Relation: ISO3166-004
date: 2008-01-14
date: 2000-07-11
type: Class

alertdialog
type: Property
comment: A type of dialog that contains an alert message, where initial focus goes an element within the dialog. Also see alert and dialog.

Contributor
comment: An entity responsible for making contributions to the resource.
description: Examples of a Contributor include a person, an organization, or a service.
type: Property
Date Modified: 2010-10-11
issued: 2008-01-14
sub property of: Contributor
range: Agent
Has Version: contributorT-001
Relation: contributorT-001
date: 2010-10-11
date: 2008-01-14
range: Thing
range: Resource

status
type: Property
type: DatatypeProperty
comment: A string expressing what the user is happy for the general public (normally) to know about their current activity.
domain: Agent
range: Literal
term status: unstable
domain: Thing
domain: Resource
range: Resource

tree
type: Property
comment: A type of list that may contain sub-level nested groups that can be collapsed and expanded.

owner
type: Property
comment: The person or other agent which owns this. For example, the owner of a file in a filesystem. There is a sense of right to control. Typically defaults to the agent who craeted something but can be changed.
range: Agent
range: Thing
range: Resource

gender
type: Property
type: FunctionalProperty
type: DatatypeProperty
comment: The gender of this Agent (typically but not necessarily 'male' or 'female').
domain: Agent
range: Literal
term status: testing
domain: Thing
domain: Resource
range: Resource

math
type: Property
comment: Content that represents a mathematical expression.

first
type: Property
member: relrev-properties
term: first
comment: first refers the first item in a collection (see also start and top).

Basic Access Control ontology
comment: Defines the class Authorization and its essential properties, and also some classes of access such as read and write.

myersBriggs
type: Property
type: DatatypeProperty
comment: A Myers Briggs (MBTI) personality classification.
domain: Person
range: Literal
term status: testing
domain: Thing
domain: Agent
domain: Resource
domain: SpatialThing
range: Resource

DCMI Period
Has Version: Period-003
issued: 2000-07-11
Date Modified: 2008-01-14
type: Datatype
comment: The set of time intervals defined by their limits according to the DCMI Period Encoding Scheme.
Relation: Period-003
date: 2008-01-14
date: 2000-07-11
type: Class

agent class
type: Property
comment: A class of persons or social entities to being given the right
domain: authorization
range: Class
domain: Resource
range: Resource

Date Modified
Date Modified: 2008-01-14
sub property of: Date
type: Property
range: Literal
issued: 2000-07-11
comment: Date on which the resource was changed.
Has Version: modified-003
Relation: modified-003
date: 2008-01-14
date: 2000-07-11
range: Resource

row
type: Property
comment: A row of cells in a grid.

Date Accepted
Date Modified: 2008-01-14
range: Literal
sub property of: Date
comment: Date of acceptance of the resource.
type: Property
description: Examples of resources to which a Date Accepted may be relevant are a thesis (accepted by a university department) or an article (accepted by a journal).
Has Version: dateAccepted-002
issued: 2002-07-13
Relation: dateAccepted-002
date: 2008-01-14
date: 2002-07-13
range: Resource

Audience Education Level
Has Version: educationLevel-002
issued: 2002-07-13
Date Modified: 2008-01-14
type: Property
comment: A class of entity, defined in terms of progression through an educational or training context, for which the described resource is intended.
range: Agent Class
sub property of: Audience
Relation: educationLevel-002
date: 2008-01-14
date: 2002-07-13
range: Resource
range: Class

meta
type: Property
member: relrev-properties
term: meta
comment: meta refers to a resource that provides metadata.

Has Version
Has Version: hasVersion-003
sub property of: Relation
comment: A related resource that is a version, edition, or adaptation of the described resource.
Date Modified: 2008-01-14
note: This term is intended to be used with non-literal values as defined in the DCMI Abstract Model (http://dublincore.org/documents/abstract-model/). As of December 2007, the DCMI Usage Board is seeking a way to express this intention with a formal range declaration.
issued: 2000-07-11
type: Property
Relation: hasVersion-003
date: 2008-01-14
date: 2000-07-11

TripleAccessControl Ontology
license: http://creativecommons.org/licenses/by/3.0/
alternate: triple-access-control.rdf
stylesheet: style.css
Has Format: triple-access-control.rdf
conforms to: rdfa-syntax
stylesheet: xmlns-style.css
primary topic: TripleAccessControl Ontology
Has Format: triple-access-control.ttl
alternate: triple-access-control.ttl
creator: me
type: Document
has version: TripleAccessControl Ontology
Relation: triple-access-control.ttl
Relation: triple-access-control.rdf
topic: TripleAccessControl Ontology
type: Thing