antagonist of
range: Human
range: Thing
domain: Thing
type: ObjectProperty
comment: "A person who opposes and contends against this person", similar to http://purl.org/vocab/relationship vocabulary, but with different domain and range. For clarity, <X antagonistOf Y> means X opposes, etc. Y, and also (by inference) <Y hasAntagonist X>. However, it does _not_ necessarily mean <Y antagonistOf X>, i.e. it is not necessarily reciprocal.
sub property of: knows
inverse of: has antagonist
type: Property
domain: Human
domain: Resource
domain: http://lodlaundromat.org/.well-known/genid/95b927528f181bcde227758947bac209#10
domain: http://lodlaundromat.org/.well-known/genid/95b927528f181bcde227758947bac209#22
domain: http://lodlaundromat.org/.well-known/genid/95b927528f181bcde227758947bac209#7
domain: http://lodlaundromat.org/.well-known/genid/95b927528f181bcde227758947bac209#19
domain: http://lodlaundromat.org/.well-known/genid/95b927528f181bcde227758947bac209#13
domain: http://lodlaundromat.org/.well-known/genid/95b927528f181bcde227758947bac209#4
domain: http://lodlaundromat.org/.well-known/genid/95b927528f181bcde227758947bac209#35
domain: http://lodlaundromat.org/.well-known/genid/95b927528f181bcde227758947bac209#38
domain: http://lodlaundromat.org/.well-known/genid/95b927528f181bcde227758947bac209#16
domain: Cognitive Agent
domain: Object
domain: http://lodlaundromat.org/.well-known/genid/95b927528f181bcde227758947bac209#30
domain: http://lodlaundromat.org/.well-known/genid/95b927528f181bcde227758947bac209#25
domain: Agent
range: Resource
range: http://lodlaundromat.org/.well-known/genid/95b927528f181bcde227758947bac209#10
range: http://lodlaundromat.org/.well-known/genid/95b927528f181bcde227758947bac209#22
range: http://lodlaundromat.org/.well-known/genid/95b927528f181bcde227758947bac209#7
range: http://lodlaundromat.org/.well-known/genid/95b927528f181bcde227758947bac209#19
range: http://lodlaundromat.org/.well-known/genid/95b927528f181bcde227758947bac209#13
range: http://lodlaundromat.org/.well-known/genid/95b927528f181bcde227758947bac209#4
range: http://lodlaundromat.org/.well-known/genid/95b927528f181bcde227758947bac209#35
range: http://lodlaundromat.org/.well-known/genid/95b927528f181bcde227758947bac209#38
range: http://lodlaundromat.org/.well-known/genid/95b927528f181bcde227758947bac209#16
range: Cognitive Agent
range: Object
range: http://lodlaundromat.org/.well-known/genid/95b927528f181bcde227758947bac209#30
range: http://lodlaundromat.org/.well-known/genid/95b927528f181bcde227758947bac209#25
range: Agent

Supernatural Being
subclass of: Resource
subclass of: Thing
type: Class
comment: A CognitiveAgent whose effects are not limited to the physical world. This includes the Lord Almighty, as well as supposed or imaginary deities.
subclass of: Cognitive Agent
subclass of: http://lodlaundromat.org/.well-known/genid/95b927528f181bcde227758947bac209#25
subclass of: http://lodlaundromat.org/.well-known/genid/95b927528f181bcde227758947bac209#30
subclass of: Object
subclass of: Agent

Political attribute
subclass of: Resource
subclass of: Thing
type: Class
comment: The attribute of ascribing to a PoliticalBeliefSystem, or belonging to a political party or system.
subclass of: Human attribute
subclass of: http://lodlaundromat.org/.well-known/genid/95b927528f181bcde227758947bac209#30
subclass of: http://lodlaundromat.org/.well-known/genid/95b927528f181bcde227758947bac209#25

Religious belief
subclass of: Resource
subclass of: Thing
type: Class
comment: The attribute of ascribing to a ReligiousBeliefSystem (which includes philosophies).
subclass of: Human attribute
subclass of: http://lodlaundromat.org/.well-known/genid/95b927528f181bcde227758947bac209#25
subclass of: http://lodlaundromat.org/.well-known/genid/95b927528f181bcde227758947bac209#30

Son of God
subclass of: Resource
subclass of: Thing
type: Class
comment: Both Human and God
subclass of: God
subclass of: Human
subclass of: Supernatural Being
subclass of: Agent
subclass of: http://lodlaundromat.org/.well-known/genid/95b927528f181bcde227758947bac209#25
subclass of: http://lodlaundromat.org/.well-known/genid/95b927528f181bcde227758947bac209#30
subclass of: Object
subclass of: Cognitive Agent
subclass of: http://lodlaundromat.org/.well-known/genid/95b927528f181bcde227758947bac209#4
subclass of: http://lodlaundromat.org/.well-known/genid/95b927528f181bcde227758947bac209#35
subclass of: http://lodlaundromat.org/.well-known/genid/95b927528f181bcde227758947bac209#13
subclass of: http://lodlaundromat.org/.well-known/genid/95b927528f181bcde227758947bac209#16
subclass of: http://lodlaundromat.org/.well-known/genid/95b927528f181bcde227758947bac209#19
subclass of: http://lodlaundromat.org/.well-known/genid/95b927528f181bcde227758947bac209#7
subclass of: http://lodlaundromat.org/.well-known/genid/95b927528f181bcde227758947bac209#10
subclass of: http://lodlaundromat.org/.well-known/genid/95b927528f181bcde227758947bac209#38
subclass of: http://lodlaundromat.org/.well-known/genid/95b927528f181bcde227758947bac209#22

Human attribute
subclass of: http://lodlaundromat.org/.well-known/genid/95b927528f181bcde227758947bac209#25
subclass of: Resource
subclass of: Thing
type: Class
subclass of: http://lodlaundromat.org/.well-known/genid/95b927528f181bcde227758947bac209#30
comment: Attributes of people, overlapping with the class hierarchy under suo:Group: this is unsatisfactory.

location
range: Thing
domain: Thing
type: FunctionalProperty
type: InverseFunctionalProperty
type: ObjectProperty
comment: The location property relates a GeographicArea to a GeographicLocation. Each GeographicArea is assumed to have only one location, and no GeographicAreas share a location.
domain: Geographic Area
range: Geographic Location
inverse of: locationOf
type: Property
domain: http://lodlaundromat.org/.well-known/genid/95b927528f181bcde227758947bac209#30
domain: Resource
domain: http://lodlaundromat.org/.well-known/genid/95b927528f181bcde227758947bac209#25
domain: Region
domain: Object
range: Resource

ethnicity
range: Thing
domain: Thing
type: ObjectProperty
comment: The ethnicity or, more generally, cultural heritage of a person. This can overlap with both religiousBelief (which may, however, change over time) and nativePlace (which, like ethnicity, does not change, though residency might). Whether a given property represents ethnicity or citizenship (nativePlace) can be a difficult decision, but in general, ethnic identities like "Jewish" or "Greek" take precedence. For example, we consider the Apostle Paul to have Jewish ethnicity, though he was a citizen of Tarsus, because he was raised as a Jew. Ethnicity is not specified without specific evidence, either textual or reliable tradition: for example, having a Greek name is not sufficient.
domain: Human
range: Ethnicity attribute
inverse of: ethnicity of
type: Property
domain: http://lodlaundromat.org/.well-known/genid/95b927528f181bcde227758947bac209#10
domain: Resource
domain: http://lodlaundromat.org/.well-known/genid/95b927528f181bcde227758947bac209#30
domain: http://lodlaundromat.org/.well-known/genid/95b927528f181bcde227758947bac209#25
domain: Object
domain: Agent
domain: http://lodlaundromat.org/.well-known/genid/95b927528f181bcde227758947bac209#35
domain: http://lodlaundromat.org/.well-known/genid/95b927528f181bcde227758947bac209#13
domain: Cognitive Agent
domain: http://lodlaundromat.org/.well-known/genid/95b927528f181bcde227758947bac209#16
domain: http://lodlaundromat.org/.well-known/genid/95b927528f181bcde227758947bac209#19
domain: http://lodlaundromat.org/.well-known/genid/95b927528f181bcde227758947bac209#22
domain: http://lodlaundromat.org/.well-known/genid/95b927528f181bcde227758947bac209#38
domain: http://lodlaundromat.org/.well-known/genid/95b927528f181bcde227758947bac209#4
domain: http://lodlaundromat.org/.well-known/genid/95b927528f181bcde227758947bac209#7
range: Resource
range: http://lodlaundromat.org/.well-known/genid/95b927528f181bcde227758947bac209#30
range: Human attribute
range: http://lodlaundromat.org/.well-known/genid/95b927528f181bcde227758947bac209#25

Tribe
subclass of: Resource
subclass of: Thing
type: Class
comment: Subclass for the Twelve Tribes of Israel
subclass of: Ethnic Group
subclass of: Group of People
subclass of: Agent
subclass of: http://lodlaundromat.org/.well-known/genid/95b927528f181bcde227758947bac209#25
subclass of: http://lodlaundromat.org/.well-known/genid/95b927528f181bcde227758947bac209#30
subclass of: Object
subclass of: http://lodlaundromat.org/.well-known/genid/95b927528f181bcde227758947bac209#16
subclass of: http://lodlaundromat.org/.well-known/genid/95b927528f181bcde227758947bac209#10
subclass of: http://lodlaundromat.org/.well-known/genid/95b927528f181bcde227758947bac209#22
subclass of: http://lodlaundromat.org/.well-known/genid/95b927528f181bcde227758947bac209#4
subclass of: http://lodlaundromat.org/.well-known/genid/95b927528f181bcde227758947bac209#35
subclass of: Group
subclass of: http://lodlaundromat.org/.well-known/genid/95b927528f181bcde227758947bac209#19
subclass of: http://lodlaundromat.org/.well-known/genid/95b927528f181bcde227758947bac209#13
subclass of: http://lodlaundromat.org/.well-known/genid/95b927528f181bcde227758947bac209#7
subclass of: http://lodlaundromat.org/.well-known/genid/95b927528f181bcde227758947bac209#38

knows
range: Thing
domain: Thing
type: ObjectProperty
type: SymmetricProperty
comment: "A person known by this person (indicating some level of reciprocated interaction between the parties)", similar to http://purl.org/vocab/relationship vocabulary, but with different domain and range. Therefore this is a symmetric relationship: if I know you, you also know me (or else we don't "know" each other in this sense).
domain: Human
range: Human
type: Property
domain: http://lodlaundromat.org/.well-known/genid/95b927528f181bcde227758947bac209#10
domain: Resource
domain: http://lodlaundromat.org/.well-known/genid/95b927528f181bcde227758947bac209#30
domain: http://lodlaundromat.org/.well-known/genid/95b927528f181bcde227758947bac209#25
domain: Object
domain: Agent
domain: http://lodlaundromat.org/.well-known/genid/95b927528f181bcde227758947bac209#35
domain: http://lodlaundromat.org/.well-known/genid/95b927528f181bcde227758947bac209#13
domain: Cognitive Agent
domain: http://lodlaundromat.org/.well-known/genid/95b927528f181bcde227758947bac209#16
domain: http://lodlaundromat.org/.well-known/genid/95b927528f181bcde227758947bac209#19
domain: http://lodlaundromat.org/.well-known/genid/95b927528f181bcde227758947bac209#22
domain: http://lodlaundromat.org/.well-known/genid/95b927528f181bcde227758947bac209#38
domain: http://lodlaundromat.org/.well-known/genid/95b927528f181bcde227758947bac209#4
domain: http://lodlaundromat.org/.well-known/genid/95b927528f181bcde227758947bac209#7
range: http://lodlaundromat.org/.well-known/genid/95b927528f181bcde227758947bac209#13
range: Resource
range: Object
range: http://lodlaundromat.org/.well-known/genid/95b927528f181bcde227758947bac209#35
range: http://lodlaundromat.org/.well-known/genid/95b927528f181bcde227758947bac209#4
range: http://lodlaundromat.org/.well-known/genid/95b927528f181bcde227758947bac209#22
range: http://lodlaundromat.org/.well-known/genid/95b927528f181bcde227758947bac209#30
range: http://lodlaundromat.org/.well-known/genid/95b927528f181bcde227758947bac209#38
range: http://lodlaundromat.org/.well-known/genid/95b927528f181bcde227758947bac209#25
range: http://lodlaundromat.org/.well-known/genid/95b927528f181bcde227758947bac209#16
range: http://lodlaundromat.org/.well-known/genid/95b927528f181bcde227758947bac209#19
range: http://lodlaundromat.org/.well-known/genid/95b927528f181bcde227758947bac209#7
range: http://lodlaundromat.org/.well-known/genid/95b927528f181bcde227758947bac209#10
range: Cognitive Agent
range: Agent

Salt Water Area
subclass of: Resource
subclass of: Thing
type: Class
comment: Based on SUMO, http://reliant.teknowledge.com/DAML/SUMO.owl#SaltWaterArea SUO 1.55: July 14, 2003 A &%WaterArea whose &%Water is saline, e.g. oceans and seas.
subclass of: Water Area
disjoint with: Fresh Water Area
subclass of: http://lodlaundromat.org/.well-known/genid/95b927528f181bcde227758947bac209#1
subclass of: Geographic Area
subclass of: Object
subclass of: http://lodlaundromat.org/.well-known/genid/95b927528f181bcde227758947bac209#30
subclass of: http://lodlaundromat.org/.well-known/genid/95b927528f181bcde227758947bac209#25
subclass of: Region

Natural Language
subclass of: Resource
subclass of: Thing
type: Class
comment: Broadly the same as http://reliant.teknowledge.com/DAML/SUMO.owl#NaturalLanguage SUO 1.55: July 14, 2003 The &%subclass of &%HumanLanguages which are not designed and which evolve from generation to generation. This &%Class includes all of the national languages, e.g. English, Spanish, Japanese, etc. Note that this class includes dialects of natural languages.
subclass of: Content Bearing Object
subclass of: Object
subclass of: http://lodlaundromat.org/.well-known/genid/95b927528f181bcde227758947bac209#25
subclass of: http://lodlaundromat.org/.well-known/genid/95b927528f181bcde227758947bac209#30

Geopolitical Area
subclass of: Resource
subclass of: Thing
type: Class
comment: Based on SUMO, http://reliant.teknowledge.com/DAML/SUMO.owl#GeopoliticalArea SUO 1.55: July 14, 2003 Any &%GeographicArea which is associated with some sort of political structure. This class includes &%Lands, &%Cities, districts of cities, counties, etc. Note that the identity of a &%GeopoliticalArea may remain constant after a change in borders.
subclass of: Geographic Area
subclass of: Object
subclass of: http://lodlaundromat.org/.well-known/genid/95b927528f181bcde227758947bac209#25
subclass of: http://lodlaundromat.org/.well-known/genid/95b927528f181bcde227758947bac209#30
subclass of: Region

Land Area
subclass of: Resource
subclass of: Thing
type: Class
comment: Based on SUMO, http://reliant.teknowledge.com/DAML/SUMO.owl#LandArea SUO 1.55: July 14, 2003 An area which is predominantly solid ground, e.g. a &%Nation, a mountain, a desert, etc. Note that a &%LandArea may contain some relatively small &%WaterAreas. For example, Australia is a &%LandArea even though it contains various rivers and lakes.
subclass of: Geographic Area
disjoint with: Water Area
subclass of: http://lodlaundromat.org/.well-known/genid/95b927528f181bcde227758947bac209#25
subclass of: http://lodlaundromat.org/.well-known/genid/95b927528f181bcde227758947bac209#30
subclass of: Object
subclass of: Region

native place
range: Thing
domain: Thing
range: Geographic Area
domain: http://lodlaundromat.org/.well-known/genid/95b927528f181bcde227758947bac209#38
type: FunctionalProperty
type: ObjectProperty
comment: Birthplace, or place in which a person grows up. Unlike residentOf, only one possible value. residentPlace is to be preferred unless the birthplace relationship is clearly identified.
domain: http://lodlaundromat.org/.well-known/genid/95b927528f181bcde227758947bac209#35
range: Region
sub property of: visited place
inverse of: nativePlaceOf
type: Property
domain: http://lodlaundromat.org/.well-known/genid/95b927528f181bcde227758947bac209#22
domain: http://lodlaundromat.org/.well-known/genid/95b927528f181bcde227758947bac209#4
domain: Resource
range: Resource
range: Object
range: http://lodlaundromat.org/.well-known/genid/95b927528f181bcde227758947bac209#30
range: http://lodlaundromat.org/.well-known/genid/95b927528f181bcde227758947bac209#25

Organization
subclass of: Resource
subclass of: Thing
type: Class
comment: Comparable to http://reliant.teknowledge.com/DAML/SUMO.owl#Organization SUO 1.55: July 14, 2003 An &%Organization is a corporate or similar institution. The &%members of an &%Organization typically have a common purpose or function. Note that this class also covers divisions, departments, etc. of organizations. For example, both the Shell Corporation and the accounting department at Shell would both be instances of &%Organization. Note too that the existence of an &%Organization is dependent on the existence of at least one &%member (since &%Organization is a subclass of &%Collection). Accordingly, in cases of purely legal organizations, a fictitious &%member should be assumed.
subclass of: Group of People
subclass of: http://lodlaundromat.org/.well-known/genid/95b927528f181bcde227758947bac209#38
subclass of: Group
subclass of: http://lodlaundromat.org/.well-known/genid/95b927528f181bcde227758947bac209#10
subclass of: http://lodlaundromat.org/.well-known/genid/95b927528f181bcde227758947bac209#35
subclass of: http://lodlaundromat.org/.well-known/genid/95b927528f181bcde227758947bac209#22
subclass of: http://lodlaundromat.org/.well-known/genid/95b927528f181bcde227758947bac209#16
subclass of: Object
subclass of: http://lodlaundromat.org/.well-known/genid/95b927528f181bcde227758947bac209#30
subclass of: http://lodlaundromat.org/.well-known/genid/95b927528f181bcde227758947bac209#25
subclass of: Agent
subclass of: http://lodlaundromat.org/.well-known/genid/95b927528f181bcde227758947bac209#4
subclass of: http://lodlaundromat.org/.well-known/genid/95b927528f181bcde227758947bac209#19
subclass of: http://lodlaundromat.org/.well-known/genid/95b927528f181bcde227758947bac209#13
subclass of: http://lodlaundromat.org/.well-known/genid/95b927528f181bcde227758947bac209#7

spouse of
range: Thing
domain: Thing
type: ObjectProperty
type: SymmetricProperty
comment: Similar to http://purl.org/vocab/relationship vocabulary, but with different domain and range. Multiple spouses are all included, whether sequential (Herodias) or simultaneous (the woman at the well).
domain: Human
range: Human
type: Property
domain: http://lodlaundromat.org/.well-known/genid/95b927528f181bcde227758947bac209#10
domain: Resource
domain: http://lodlaundromat.org/.well-known/genid/95b927528f181bcde227758947bac209#30
domain: http://lodlaundromat.org/.well-known/genid/95b927528f181bcde227758947bac209#25
domain: Object
domain: Agent
domain: http://lodlaundromat.org/.well-known/genid/95b927528f181bcde227758947bac209#35
domain: http://lodlaundromat.org/.well-known/genid/95b927528f181bcde227758947bac209#13
domain: Cognitive Agent
domain: http://lodlaundromat.org/.well-known/genid/95b927528f181bcde227758947bac209#16
domain: http://lodlaundromat.org/.well-known/genid/95b927528f181bcde227758947bac209#19
domain: http://lodlaundromat.org/.well-known/genid/95b927528f181bcde227758947bac209#22
domain: http://lodlaundromat.org/.well-known/genid/95b927528f181bcde227758947bac209#38
domain: http://lodlaundromat.org/.well-known/genid/95b927528f181bcde227758947bac209#4
domain: http://lodlaundromat.org/.well-known/genid/95b927528f181bcde227758947bac209#7
range: http://lodlaundromat.org/.well-known/genid/95b927528f181bcde227758947bac209#13
range: Resource
range: Object
range: http://lodlaundromat.org/.well-known/genid/95b927528f181bcde227758947bac209#35
range: http://lodlaundromat.org/.well-known/genid/95b927528f181bcde227758947bac209#4
range: http://lodlaundromat.org/.well-known/genid/95b927528f181bcde227758947bac209#22
range: http://lodlaundromat.org/.well-known/genid/95b927528f181bcde227758947bac209#30
range: http://lodlaundromat.org/.well-known/genid/95b927528f181bcde227758947bac209#38
range: http://lodlaundromat.org/.well-known/genid/95b927528f181bcde227758947bac209#25
range: http://lodlaundromat.org/.well-known/genid/95b927528f181bcde227758947bac209#16
range: http://lodlaundromat.org/.well-known/genid/95b927528f181bcde227758947bac209#19
range: http://lodlaundromat.org/.well-known/genid/95b927528f181bcde227758947bac209#7
range: http://lodlaundromat.org/.well-known/genid/95b927528f181bcde227758947bac209#10
range: Cognitive Agent
range: Agent

Man
subclass of: Resource
subclass of: Thing
type: Class
comment: SUO 1.55: July 14, 2003 The class of &%Male &%Humans.
subclass of: http://lodlaundromat.org/.well-known/genid/95b927528f181bcde227758947bac209#3
subclass of: Human
disjoint with: Woman
subclass of: http://lodlaundromat.org/.well-known/genid/95b927528f181bcde227758947bac209#13
subclass of: http://lodlaundromat.org/.well-known/genid/95b927528f181bcde227758947bac209#16
subclass of: Agent
subclass of: http://lodlaundromat.org/.well-known/genid/95b927528f181bcde227758947bac209#30
subclass of: http://lodlaundromat.org/.well-known/genid/95b927528f181bcde227758947bac209#25
subclass of: Object
subclass of: http://lodlaundromat.org/.well-known/genid/95b927528f181bcde227758947bac209#35
subclass of: Cognitive Agent
subclass of: http://lodlaundromat.org/.well-known/genid/95b927528f181bcde227758947bac209#10
subclass of: http://lodlaundromat.org/.well-known/genid/95b927528f181bcde227758947bac209#19
subclass of: http://lodlaundromat.org/.well-known/genid/95b927528f181bcde227758947bac209#4
subclass of: http://lodlaundromat.org/.well-known/genid/95b927528f181bcde227758947bac209#22
subclass of: http://lodlaundromat.org/.well-known/genid/95b927528f181bcde227758947bac209#38
subclass of: http://lodlaundromat.org/.well-known/genid/95b927528f181bcde227758947bac209#7

Citizenship attribute
subclass of: Resource
subclass of: Thing
type: Class
comment: Belonging to the citizenry of a country (e.g. Roman). There may be parallel ethnicity attributes (Roman being the primary example) which are not easily distinguished. In the case of Roman, while all ethnic Romans (in the general sense, though not necessarily legal sense [e.g. slaves]) are Roman citizens, there are other Roman citizens (e.g. Paul) who have different ethnicity.
subclass of: Human attribute
subclass of: http://lodlaundromat.org/.well-known/genid/95b927528f181bcde227758947bac209#30
subclass of: http://lodlaundromat.org/.well-known/genid/95b927528f181bcde227758947bac209#25

Series
subclass of: Resource
subclass of: Thing
type: Class
comment: Broadly the same as http://reliant.teknowledge.com/DAML/SUMO.owl#Series SUO 1.55: July 14, 2003 A &%Text consisting of multiple self-contained units. Some examples are an encyclopedia containing a couple dozen volumes, a television series made up of many episodes, a film serial, etc.
subclass of: Content Bearing Object
subclass of: http://lodlaundromat.org/.well-known/genid/95b927528f181bcde227758947bac209#25
subclass of: http://lodlaundromat.org/.well-known/genid/95b927528f181bcde227758947bac209#30
subclass of: Object

Political Organization
subclass of: Resource
subclass of: Thing
type: Class
comment: Comparable to http://reliant.teknowledge.com/DAML/SUMO.owl#PoliticalOrganization SUO 1.55: July 14, 2003 An &%Organization that is a &%Government, a &%subOrganization of a &%Government, or an &%Organization that is attempting to bring about some sort of political change.
subclass of: Organization
subclass of: Group of People
subclass of: http://lodlaundromat.org/.well-known/genid/95b927528f181bcde227758947bac209#19
subclass of: http://lodlaundromat.org/.well-known/genid/95b927528f181bcde227758947bac209#7
subclass of: http://lodlaundromat.org/.well-known/genid/95b927528f181bcde227758947bac209#10
subclass of: http://lodlaundromat.org/.well-known/genid/95b927528f181bcde227758947bac209#30
subclass of: http://lodlaundromat.org/.well-known/genid/95b927528f181bcde227758947bac209#25
subclass of: Object
subclass of: Agent
subclass of: http://lodlaundromat.org/.well-known/genid/95b927528f181bcde227758947bac209#16
subclass of: http://lodlaundromat.org/.well-known/genid/95b927528f181bcde227758947bac209#4
subclass of: http://lodlaundromat.org/.well-known/genid/95b927528f181bcde227758947bac209#38
subclass of: http://lodlaundromat.org/.well-known/genid/95b927528f181bcde227758947bac209#22
subclass of: http://lodlaundromat.org/.well-known/genid/95b927528f181bcde227758947bac209#13
subclass of: http://lodlaundromat.org/.well-known/genid/95b927528f181bcde227758947bac209#35
subclass of: Group

Ethnic Group
subclass of: Resource
subclass of: Thing
type: Class
comment: Comparable to http://reliant.teknowledge.com/DAML/SUMO.owl#EthnicGroup SUO 1.55: July 14, 2003 A &%Group whose &%members originate from the same &%GeographicArea or share the same &%Language and/or cultural practices.
subclass of: Group of People
subclass of: http://lodlaundromat.org/.well-known/genid/95b927528f181bcde227758947bac209#19
subclass of: http://lodlaundromat.org/.well-known/genid/95b927528f181bcde227758947bac209#35
subclass of: http://lodlaundromat.org/.well-known/genid/95b927528f181bcde227758947bac209#38
subclass of: http://lodlaundromat.org/.well-known/genid/95b927528f181bcde227758947bac209#4
subclass of: http://lodlaundromat.org/.well-known/genid/95b927528f181bcde227758947bac209#22
subclass of: http://lodlaundromat.org/.well-known/genid/95b927528f181bcde227758947bac209#7
subclass of: http://lodlaundromat.org/.well-known/genid/95b927528f181bcde227758947bac209#16
subclass of: Object
subclass of: http://lodlaundromat.org/.well-known/genid/95b927528f181bcde227758947bac209#25
subclass of: http://lodlaundromat.org/.well-known/genid/95b927528f181bcde227758947bac209#30
subclass of: Agent
subclass of: http://lodlaundromat.org/.well-known/genid/95b927528f181bcde227758947bac209#13
subclass of: http://lodlaundromat.org/.well-known/genid/95b927528f181bcde227758947bac209#10
subclass of: Group

Residency attribute
subclass of: Resource
subclass of: Thing
type: Class
comment: The attribute of living in a particular City or Province. Unlike Ethnicity, which is permanent, Residency can change.
subclass of: Human attribute
subclass of: http://lodlaundromat.org/.well-known/genid/95b927528f181bcde227758947bac209#25
subclass of: http://lodlaundromat.org/.well-known/genid/95b927528f181bcde227758947bac209#30

Religious Organization
subclass of: Resource
subclass of: Thing
type: Class
comment: Comparable to http://reliant.teknowledge.com/DAML/SUMO.owl#ReligiousOrganization SUO 1.55: July 14, 2003 An &%Organization whose members share a set of religious beliefs.
subclass of: Belief Group
subclass of: Organization
subclass of: Group of People
subclass of: http://lodlaundromat.org/.well-known/genid/95b927528f181bcde227758947bac209#4
subclass of: http://lodlaundromat.org/.well-known/genid/95b927528f181bcde227758947bac209#16
subclass of: Group
subclass of: Object
subclass of: http://lodlaundromat.org/.well-known/genid/95b927528f181bcde227758947bac209#30
subclass of: http://lodlaundromat.org/.well-known/genid/95b927528f181bcde227758947bac209#25
subclass of: Agent
subclass of: http://lodlaundromat.org/.well-known/genid/95b927528f181bcde227758947bac209#13
subclass of: http://lodlaundromat.org/.well-known/genid/95b927528f181bcde227758947bac209#22
subclass of: http://lodlaundromat.org/.well-known/genid/95b927528f181bcde227758947bac209#38
subclass of: http://lodlaundromat.org/.well-known/genid/95b927528f181bcde227758947bac209#10
subclass of: http://lodlaundromat.org/.well-known/genid/95b927528f181bcde227758947bac209#7
subclass of: http://lodlaundromat.org/.well-known/genid/95b927528f181bcde227758947bac209#35
subclass of: http://lodlaundromat.org/.well-known/genid/95b927528f181bcde227758947bac209#19

visited place
domain: http://lodlaundromat.org/.well-known/genid/95b927528f181bcde227758947bac209#22
range: Thing
domain: Thing
type: ObjectProperty
comment: Places that a human visited. For current purposes, only instances which are explicitly mentioned in Scripture are included, not those that might be inferred (e.g. if going from from A to B implies visiting C, C would not be listed).
domain: http://lodlaundromat.org/.well-known/genid/95b927528f181bcde227758947bac209#4
range: Region
inverse of: visitedPlaceOf
type: Property
domain: Resource
range: Resource
range: Object
range: http://lodlaundromat.org/.well-known/genid/95b927528f181bcde227758947bac209#30
range: http://lodlaundromat.org/.well-known/genid/95b927528f181bcde227758947bac209#25

Geographic Location
subclass of: Thing
subclass of: Resource
type: Class
comment: A collection of properties describing geographic location.

religious belief
range: Thing
domain: Thing
domain: http://lodlaundromat.org/.well-known/genid/95b927528f181bcde227758947bac209#16
type: ObjectProperty
comment: Having a ReligiousBelief as an attribute
domain: http://lodlaundromat.org/.well-known/genid/95b927528f181bcde227758947bac209#7
range: Religious belief system
inverse of: religious belief of
type: Property
domain: Resource
range: Resource
range: http://lodlaundromat.org/.well-known/genid/95b927528f181bcde227758947bac209#30
range: http://lodlaundromat.org/.well-known/genid/95b927528f181bcde227758947bac209#25
range: Belief system

SupernaturalRegion
subclass of: Resource
subclass of: Thing
type: Class
comment: Those regions that are outside normal human existence.
subclass of: Region
subclass of: http://lodlaundromat.org/.well-known/genid/95b927528f181bcde227758947bac209#25
subclass of: http://lodlaundromat.org/.well-known/genid/95b927528f181bcde227758947bac209#30
subclass of: Object

religious belief of
range: http://lodlaundromat.org/.well-known/genid/95b927528f181bcde227758947bac209#7
range: Thing
domain: Thing
type: ObjectProperty
domain: Religious belief system
range: http://lodlaundromat.org/.well-known/genid/95b927528f181bcde227758947bac209#16
inverse of: religious belief
type: Property
domain: http://lodlaundromat.org/.well-known/genid/95b927528f181bcde227758947bac209#25
domain: Belief system
domain: http://lodlaundromat.org/.well-known/genid/95b927528f181bcde227758947bac209#30
domain: Resource
range: Resource

Ethnicity attribute
subclass of: Thing
subclass of: Resource
type: Class
comment: The attribute of belonging to a particular ethnic group, or originating from a GeographicArea. Unlike Residency, which can change, Ethnicity is considered permanent.
subclass of: Human attribute
subclass of: http://lodlaundromat.org/.well-known/genid/95b927528f181bcde227758947bac209#25
subclass of: http://lodlaundromat.org/.well-known/genid/95b927528f181bcde227758947bac209#30

Geographic Area
subclass of: Thing
subclass of: Resource
type: Class
comment: Based on SUMO, http://reliant.teknowledge.com/DAML/SUMO.owl#GeographicArea SUO 1.55: July 14, 2003 A geographic location, generally having definite boundaries. Note that this differs from its immediate superclass &%Region in that a &%GeographicArea is a three-dimensional &%Region of the earth. Accordingly, all astronomical objects other than earth and all one-dimensional and two-dimensional &%Regions are not classed under &%GeographicArea.
subclass of: Region
subclass of: http://lodlaundromat.org/.well-known/genid/95b927528f181bcde227758947bac209#25
subclass of: http://lodlaundromat.org/.well-known/genid/95b927528f181bcde227758947bac209#30
subclass of: Object

Island
subclass of: Resource
subclass of: Thing
type: Class
comment: Based on SUMO, http://reliant.teknowledge.com/DAML/SUMO.owl#Island SUO 1.55: July 14, 2003 A &%LandArea that is completely surrounded by a &%WaterArea.
subclass of: Land Area
subclass of: Geographic Area
subclass of: Region
subclass of: http://lodlaundromat.org/.well-known/genid/95b927528f181bcde227758947bac209#25
subclass of: http://lodlaundromat.org/.well-known/genid/95b927528f181bcde227758947bac209#30
subclass of: Object

State or Province
subclass of: Resource
subclass of: Thing
type: Class
comment: Based on SUMO, http://reliant.teknowledge.com/DAML/SUMO.owl#StateOrProvince SUO 1.55: July 14, 2003 Administrative subdivisions of a &%Nation that are broader than any other political subdivisions that may exist. This &%Class includes the states of the United States, as well as the provinces of Canada and European countries. Here it covers both provinces and districts.
subclass of: Geopolitical Area
subclass of: Land Area
subclass of: Geographic Area
subclass of: Region
subclass of: http://lodlaundromat.org/.well-known/genid/95b927528f181bcde227758947bac209#25
subclass of: http://lodlaundromat.org/.well-known/genid/95b927528f181bcde227758947bac209#30
subclass of: Object

subregion of
range: Thing
domain: Thing
type: ObjectProperty
type: TransitiveProperty
comment: A smaller GeographicArea is a subregionOf a larger one (e.g. Jerusalem is a subregionOf Israel).
domain: Geographic Area
range: Geographic Area
inverse of: subregion
type: Property
domain: http://lodlaundromat.org/.well-known/genid/95b927528f181bcde227758947bac209#30
domain: Resource
domain: http://lodlaundromat.org/.well-known/genid/95b927528f181bcde227758947bac209#25
domain: Region
domain: Object
range: Region
range: Resource
range: Object
range: http://lodlaundromat.org/.well-known/genid/95b927528f181bcde227758947bac209#30
range: http://lodlaundromat.org/.well-known/genid/95b927528f181bcde227758947bac209#25

Fixed holiday
subclass of: http://lodlaundromat.org/.well-known/genid/95b927528f181bcde227758947bac209#25
subclass of: Resource
subclass of: Thing
type: Class
subclass of: http://lodlaundromat.org/.well-known/genid/95b927528f181bcde227758947bac209#30
comment: Would be a subclass of http://reliant.teknowledge.com/DAML/SUMO.owl#TimeInterval, but is specified within MILO. MILO: &%FixedHoliday is the class of &%Holidays whose observance is fixed to recurrences of the calendar day that the holiday commemorates.

Group of People
subclass of: Resource
subclass of: http://lodlaundromat.org/.well-known/genid/95b927528f181bcde227758947bac209#35
subclass of: http://lodlaundromat.org/.well-known/genid/95b927528f181bcde227758947bac209#38
type: Class
subclass of: Thing
subclass of: http://lodlaundromat.org/.well-known/genid/95b927528f181bcde227758947bac209#19
subclass of: http://lodlaundromat.org/.well-known/genid/95b927528f181bcde227758947bac209#22
subclass of: http://lodlaundromat.org/.well-known/genid/95b927528f181bcde227758947bac209#13
subclass of: http://lodlaundromat.org/.well-known/genid/95b927528f181bcde227758947bac209#16
subclass of: http://lodlaundromat.org/.well-known/genid/95b927528f181bcde227758947bac209#4
subclass of: http://lodlaundromat.org/.well-known/genid/95b927528f181bcde227758947bac209#10
subclass of: http://lodlaundromat.org/.well-known/genid/95b927528f181bcde227758947bac209#7
comment: Comparable to http://reliant.teknowledge.com/DAML/SUMO.owl#GroupOfPeople SUO 1.55: July 14, 2003 Any &%Group whose &%members are exclusively &%Humans.
subclass of: Group
subclass of: Agent
subclass of: Object
subclass of: http://lodlaundromat.org/.well-known/genid/95b927528f181bcde227758947bac209#25
subclass of: http://lodlaundromat.org/.well-known/genid/95b927528f181bcde227758947bac209#30

Angel
subclass of: Resource
subclass of: Thing
type: Class
comment: Supernatural beings that work to support God's purposes as his agents.
subclass of: Supernatural Being
disjoint with: God
subclass of: Cognitive Agent
subclass of: http://lodlaundromat.org/.well-known/genid/95b927528f181bcde227758947bac209#30
subclass of: http://lodlaundromat.org/.well-known/genid/95b927528f181bcde227758947bac209#25
subclass of: Object
subclass of: Agent

Nation
subclass of: Resource
subclass of: Thing
type: Class
comment: Based on SUMO, http://reliant.teknowledge.com/DAML/SUMO.owl#Nation SUO 1.55: July 14, 2003 The broadest &%GeopoliticalArea, i.e. &%Nations are &%GeopoliticalAreas that are not part of any other overarching and comprehensive governance structure (excepting commonwealths and other sorts of loose international organizations). Note that modern nations referred to in the New Testament (Spain, Italy, Libya) are typically not instances of Nation, but rather of Region (if the borders are indefinite) or of LandArea.
subclass of: Geopolitical Area
subclass of: Land Area
subclass of: Geographic Area
subclass of: Region
subclass of: http://lodlaundromat.org/.well-known/genid/95b927528f181bcde227758947bac209#25
subclass of: http://lodlaundromat.org/.well-known/genid/95b927528f181bcde227758947bac209#30
subclass of: Object

Belief Group
subclass of: Resource
subclass of: Thing
type: Class
comment: Comparable to http://reliant.teknowledge.com/DAML/SUMO.owl#BeliefGroup SUO 1.55: July 14, 2003 A &%Group whose &%members share a belief or set of beliefs. For NTN, this covers groups defined by a particular set of beliefs (orthodox or heretical) which are informal, rather than formal, in membership and activity.
subclass of: Group of People
subclass of: Agent
subclass of: http://lodlaundromat.org/.well-known/genid/95b927528f181bcde227758947bac209#25
subclass of: http://lodlaundromat.org/.well-known/genid/95b927528f181bcde227758947bac209#30
subclass of: Object
subclass of: http://lodlaundromat.org/.well-known/genid/95b927528f181bcde227758947bac209#4
subclass of: http://lodlaundromat.org/.well-known/genid/95b927528f181bcde227758947bac209#7
subclass of: http://lodlaundromat.org/.well-known/genid/95b927528f181bcde227758947bac209#38
subclass of: http://lodlaundromat.org/.well-known/genid/95b927528f181bcde227758947bac209#10
subclass of: http://lodlaundromat.org/.well-known/genid/95b927528f181bcde227758947bac209#22
subclass of: http://lodlaundromat.org/.well-known/genid/95b927528f181bcde227758947bac209#16
subclass of: http://lodlaundromat.org/.well-known/genid/95b927528f181bcde227758947bac209#35
subclass of: http://lodlaundromat.org/.well-known/genid/95b927528f181bcde227758947bac209#13
subclass of: http://lodlaundromat.org/.well-known/genid/95b927528f181bcde227758947bac209#19
subclass of: Group

God
subclass of: Resource
subclass of: Thing
type: Class
comment: Self-documenting
subclass of: Supernatural Being
disjoint with: Angel
disjoint with: Evil Supernatural Being
subclass of: Agent
subclass of: Object
subclass of: http://lodlaundromat.org/.well-known/genid/95b927528f181bcde227758947bac209#25
subclass of: http://lodlaundromat.org/.well-known/genid/95b927528f181bcde227758947bac209#30
subclass of: Cognitive Agent

Evil Supernatural Being
subclass of: Resource
subclass of: Thing
type: Class
comment: Class of malevolent supernatural beings, whose instances include Satan and demons.
subclass of: Supernatural Being
disjoint with: God
subclass of: http://lodlaundromat.org/.well-known/genid/95b927528f181bcde227758947bac209#30
subclass of: http://lodlaundromat.org/.well-known/genid/95b927528f181bcde227758947bac209#25
subclass of: Object
subclass of: Agent
subclass of: Cognitive Agent

Belief system
subclass of: http://lodlaundromat.org/.well-known/genid/95b927528f181bcde227758947bac209#25
subclass of: Resource
subclass of: Thing
type: Class
subclass of: http://lodlaundromat.org/.well-known/genid/95b927528f181bcde227758947bac209#30
comment: An organization of propositions into an identifiable belief system. A person who holds to a belief system can be considered a member of the corresponding BeliefGroup. The notion of Proposition here is derived from http://reliant.teknowledge.com/DAML/SUMO.owl#Proposition.

relative of
range: Thing
domain: Thing
type: ObjectProperty
type: SymmetricProperty
comment: A person who is related by kinship to this person. No attempt is made to delineate precisely which kinship relations qualify: this is used when a description indicates two people are "related". parent/child/siblingOf are subproperties of this, properly speaking.
domain: Human
range: Human
type: Property
domain: http://lodlaundromat.org/.well-known/genid/95b927528f181bcde227758947bac209#10
domain: Resource
domain: http://lodlaundromat.org/.well-known/genid/95b927528f181bcde227758947bac209#30
domain: http://lodlaundromat.org/.well-known/genid/95b927528f181bcde227758947bac209#25
domain: Object
domain: Agent
domain: http://lodlaundromat.org/.well-known/genid/95b927528f181bcde227758947bac209#35
domain: http://lodlaundromat.org/.well-known/genid/95b927528f181bcde227758947bac209#13
domain: Cognitive Agent
domain: http://lodlaundromat.org/.well-known/genid/95b927528f181bcde227758947bac209#16
domain: http://lodlaundromat.org/.well-known/genid/95b927528f181bcde227758947bac209#19
domain: http://lodlaundromat.org/.well-known/genid/95b927528f181bcde227758947bac209#22
domain: http://lodlaundromat.org/.well-known/genid/95b927528f181bcde227758947bac209#38
domain: http://lodlaundromat.org/.well-known/genid/95b927528f181bcde227758947bac209#4
domain: http://lodlaundromat.org/.well-known/genid/95b927528f181bcde227758947bac209#7
range: http://lodlaundromat.org/.well-known/genid/95b927528f181bcde227758947bac209#13
range: Resource
range: Object
range: http://lodlaundromat.org/.well-known/genid/95b927528f181bcde227758947bac209#35
range: http://lodlaundromat.org/.well-known/genid/95b927528f181bcde227758947bac209#4
range: http://lodlaundromat.org/.well-known/genid/95b927528f181bcde227758947bac209#22
range: http://lodlaundromat.org/.well-known/genid/95b927528f181bcde227758947bac209#30
range: http://lodlaundromat.org/.well-known/genid/95b927528f181bcde227758947bac209#38
range: http://lodlaundromat.org/.well-known/genid/95b927528f181bcde227758947bac209#25
range: http://lodlaundromat.org/.well-known/genid/95b927528f181bcde227758947bac209#16
range: http://lodlaundromat.org/.well-known/genid/95b927528f181bcde227758947bac209#19
range: http://lodlaundromat.org/.well-known/genid/95b927528f181bcde227758947bac209#7
range: http://lodlaundromat.org/.well-known/genid/95b927528f181bcde227758947bac209#10
range: Cognitive Agent
range: Agent

Group
subclass of: Resource
subclass of: Thing
type: Class
comment: Comparable to http://reliant.teknowledge.com/DAML/SUMO.owl#Group SUO 1.55: July 14, 2003 A &%Collection of &%Agents, e.g. a flock of sheep, a herd of goats, or the local Boy Scout troop.
subclass of: Agent
subclass of: http://lodlaundromat.org/.well-known/genid/95b927528f181bcde227758947bac209#30
subclass of: http://lodlaundromat.org/.well-known/genid/95b927528f181bcde227758947bac209#25
subclass of: Object

member
range: Thing
domain: Thing
type: ObjectProperty
comment: Group has member Human. Inverse of memberOf. No provision for membership changes over time.
domain: Group
range: Human
inverse of: member of
type: Property
domain: Resource
domain: Object
domain: Agent
domain: http://lodlaundromat.org/.well-known/genid/95b927528f181bcde227758947bac209#25
domain: http://lodlaundromat.org/.well-known/genid/95b927528f181bcde227758947bac209#30
range: http://lodlaundromat.org/.well-known/genid/95b927528f181bcde227758947bac209#13
range: Resource
range: Object
range: http://lodlaundromat.org/.well-known/genid/95b927528f181bcde227758947bac209#35
range: http://lodlaundromat.org/.well-known/genid/95b927528f181bcde227758947bac209#4
range: http://lodlaundromat.org/.well-known/genid/95b927528f181bcde227758947bac209#22
range: http://lodlaundromat.org/.well-known/genid/95b927528f181bcde227758947bac209#30
range: http://lodlaundromat.org/.well-known/genid/95b927528f181bcde227758947bac209#38
range: http://lodlaundromat.org/.well-known/genid/95b927528f181bcde227758947bac209#25
range: http://lodlaundromat.org/.well-known/genid/95b927528f181bcde227758947bac209#16
range: http://lodlaundromat.org/.well-known/genid/95b927528f181bcde227758947bac209#19
range: http://lodlaundromat.org/.well-known/genid/95b927528f181bcde227758947bac209#7
range: http://lodlaundromat.org/.well-known/genid/95b927528f181bcde227758947bac209#10
range: Cognitive Agent
range: Agent

Object
subclass of: http://lodlaundromat.org/.well-known/genid/95b927528f181bcde227758947bac209#25
subclass of: Resource
subclass of: Thing
type: Class
subclass of: http://lodlaundromat.org/.well-known/genid/95b927528f181bcde227758947bac209#30
comment: Following http://reliant.teknowledge.com/DAML/SUMO.owl#Object, this "Corresponds roughly to the class of ordinary objects. Examples include normal physical objects, geographical regions, and locations of &%Processes, the complement of &%Objects in the &%Physical class. "

Religious belief system
subclass of: Thing
subclass of: Resource
type: Class
comment: A system of religious beliefs, or a philosophy.
subclass of: Belief system
subclass of: http://lodlaundromat.org/.well-known/genid/95b927528f181bcde227758947bac209#30
subclass of: http://lodlaundromat.org/.well-known/genid/95b927528f181bcde227758947bac209#25

Political belief system
subclass of: Resource
subclass of: Thing
type: Class
subclass of: Belief system
subclass of: http://lodlaundromat.org/.well-known/genid/95b927528f181bcde227758947bac209#30
subclass of: http://lodlaundromat.org/.well-known/genid/95b927528f181bcde227758947bac209#25

City
subclass of: Resource
subclass of: Thing
type: Class
comment: Based on SUMO, http://reliant.teknowledge.com/DAML/SUMO.owl#City SUO 1.55: July 14, 2003 A &%LandArea of relatively small size, inhabited by a community of people, and having some sort of political structure. Note that this class includes both large cities and small settlements like towns, villages, hamlets, etc.
subclass of: Geopolitical Area
subclass of: Land Area
subclass of: Geographic Area
subclass of: Region
subclass of: Object
subclass of: http://lodlaundromat.org/.well-known/genid/95b927528f181bcde227758947bac209#25
subclass of: http://lodlaundromat.org/.well-known/genid/95b927528f181bcde227758947bac209#30

possibly same person as
range: Thing
domain: Thing
type: ObjectProperty
type: SymmetricProperty
comment: This person may be the same as the other person, though there isn't enough evidence to definitively say so. Typically the individuals will have the same name, and some overlap of circumstances that makes it possible.
domain: Human
range: Human
type: Property
domain: http://lodlaundromat.org/.well-known/genid/95b927528f181bcde227758947bac209#10
domain: Resource
domain: http://lodlaundromat.org/.well-known/genid/95b927528f181bcde227758947bac209#30
domain: http://lodlaundromat.org/.well-known/genid/95b927528f181bcde227758947bac209#25
domain: Object
domain: Agent
domain: http://lodlaundromat.org/.well-known/genid/95b927528f181bcde227758947bac209#35
domain: http://lodlaundromat.org/.well-known/genid/95b927528f181bcde227758947bac209#13
domain: Cognitive Agent
domain: http://lodlaundromat.org/.well-known/genid/95b927528f181bcde227758947bac209#16
domain: http://lodlaundromat.org/.well-known/genid/95b927528f181bcde227758947bac209#19
domain: http://lodlaundromat.org/.well-known/genid/95b927528f181bcde227758947bac209#22
domain: http://lodlaundromat.org/.well-known/genid/95b927528f181bcde227758947bac209#38
domain: http://lodlaundromat.org/.well-known/genid/95b927528f181bcde227758947bac209#4
domain: http://lodlaundromat.org/.well-known/genid/95b927528f181bcde227758947bac209#7
range: http://lodlaundromat.org/.well-known/genid/95b927528f181bcde227758947bac209#13
range: Resource
range: Object
range: http://lodlaundromat.org/.well-known/genid/95b927528f181bcde227758947bac209#35
range: http://lodlaundromat.org/.well-known/genid/95b927528f181bcde227758947bac209#4
range: http://lodlaundromat.org/.well-known/genid/95b927528f181bcde227758947bac209#22
range: http://lodlaundromat.org/.well-known/genid/95b927528f181bcde227758947bac209#30
range: http://lodlaundromat.org/.well-known/genid/95b927528f181bcde227758947bac209#38
range: http://lodlaundromat.org/.well-known/genid/95b927528f181bcde227758947bac209#25
range: http://lodlaundromat.org/.well-known/genid/95b927528f181bcde227758947bac209#16
range: http://lodlaundromat.org/.well-known/genid/95b927528f181bcde227758947bac209#19
range: http://lodlaundromat.org/.well-known/genid/95b927528f181bcde227758947bac209#7
range: http://lodlaundromat.org/.well-known/genid/95b927528f181bcde227758947bac209#10
range: Cognitive Agent
range: Agent

Agent
subclass of: Resource
subclass of: Thing
type: Class
comment: Comparable to http://reliant.teknowledge.com/DAML/SUMO.owl#Agent SUO 1.55: July 14, 2003 Something or someone that can act on its own and produce changes in the world.
subclass of: Object
subclass of: http://lodlaundromat.org/.well-known/genid/95b927528f181bcde227758947bac209#30
subclass of: http://lodlaundromat.org/.well-known/genid/95b927528f181bcde227758947bac209#25

ethnicity of
range: Thing
domain: Thing
type: ObjectProperty
domain: Ethnicity attribute
range: Human
inverse of: ethnicity
type: Property
domain: Resource
domain: Human attribute
domain: http://lodlaundromat.org/.well-known/genid/95b927528f181bcde227758947bac209#30
domain: http://lodlaundromat.org/.well-known/genid/95b927528f181bcde227758947bac209#25
range: http://lodlaundromat.org/.well-known/genid/95b927528f181bcde227758947bac209#13
range: Resource
range: Object
range: http://lodlaundromat.org/.well-known/genid/95b927528f181bcde227758947bac209#35
range: http://lodlaundromat.org/.well-known/genid/95b927528f181bcde227758947bac209#4
range: http://lodlaundromat.org/.well-known/genid/95b927528f181bcde227758947bac209#22
range: http://lodlaundromat.org/.well-known/genid/95b927528f181bcde227758947bac209#30
range: http://lodlaundromat.org/.well-known/genid/95b927528f181bcde227758947bac209#38
range: http://lodlaundromat.org/.well-known/genid/95b927528f181bcde227758947bac209#25
range: http://lodlaundromat.org/.well-known/genid/95b927528f181bcde227758947bac209#16
range: http://lodlaundromat.org/.well-known/genid/95b927528f181bcde227758947bac209#19
range: http://lodlaundromat.org/.well-known/genid/95b927528f181bcde227758947bac209#7
range: http://lodlaundromat.org/.well-known/genid/95b927528f181bcde227758947bac209#10
range: Cognitive Agent
range: Agent

enemy of
range: Human
domain: Human
range: Thing
domain: Thing
type: ObjectProperty
comment: "A person towards whom this person feels hatred, intends injury to, or opposes the interests of", similar to http://purl.org/vocab/relationship vocabulary, but with different domain and range. For clarity, <X, enemyOf, Y> means X feels hatred, etc. towards Y, and also (by inference) <Y, hasEnemy, X>. However, it does _not_ necessarily mean <Y, enemyOf, X>, i.e. it is not necessarily reciprocal.
sub property of: knows
inverse of: has enemy
type: Property
domain: Resource
domain: http://lodlaundromat.org/.well-known/genid/95b927528f181bcde227758947bac209#10
domain: http://lodlaundromat.org/.well-known/genid/95b927528f181bcde227758947bac209#22
domain: http://lodlaundromat.org/.well-known/genid/95b927528f181bcde227758947bac209#7
domain: http://lodlaundromat.org/.well-known/genid/95b927528f181bcde227758947bac209#19
domain: http://lodlaundromat.org/.well-known/genid/95b927528f181bcde227758947bac209#13
domain: http://lodlaundromat.org/.well-known/genid/95b927528f181bcde227758947bac209#4
domain: http://lodlaundromat.org/.well-known/genid/95b927528f181bcde227758947bac209#35
domain: http://lodlaundromat.org/.well-known/genid/95b927528f181bcde227758947bac209#38
domain: http://lodlaundromat.org/.well-known/genid/95b927528f181bcde227758947bac209#16
domain: Cognitive Agent
domain: Object
domain: http://lodlaundromat.org/.well-known/genid/95b927528f181bcde227758947bac209#30
domain: http://lodlaundromat.org/.well-known/genid/95b927528f181bcde227758947bac209#25
domain: Agent
range: Resource
range: http://lodlaundromat.org/.well-known/genid/95b927528f181bcde227758947bac209#10
range: http://lodlaundromat.org/.well-known/genid/95b927528f181bcde227758947bac209#22
range: http://lodlaundromat.org/.well-known/genid/95b927528f181bcde227758947bac209#7
range: http://lodlaundromat.org/.well-known/genid/95b927528f181bcde227758947bac209#19
range: http://lodlaundromat.org/.well-known/genid/95b927528f181bcde227758947bac209#13
range: http://lodlaundromat.org/.well-known/genid/95b927528f181bcde227758947bac209#4
range: http://lodlaundromat.org/.well-known/genid/95b927528f181bcde227758947bac209#35
range: http://lodlaundromat.org/.well-known/genid/95b927528f181bcde227758947bac209#38
range: http://lodlaundromat.org/.well-known/genid/95b927528f181bcde227758947bac209#16
range: Cognitive Agent
range: Object
range: http://lodlaundromat.org/.well-known/genid/95b927528f181bcde227758947bac209#30
range: http://lodlaundromat.org/.well-known/genid/95b927528f181bcde227758947bac209#25
range: Agent

parent of
range: Thing
domain: Thing
type: ObjectProperty
comment: Similar to http://purl.org/vocab/relationship vocabulary, but with different domain and range.
domain: Human
range: Human
sub property of: relative of
inverse of: child of
type: Property
domain: Resource
domain: http://lodlaundromat.org/.well-known/genid/95b927528f181bcde227758947bac209#10
domain: http://lodlaundromat.org/.well-known/genid/95b927528f181bcde227758947bac209#22
domain: http://lodlaundromat.org/.well-known/genid/95b927528f181bcde227758947bac209#7
domain: http://lodlaundromat.org/.well-known/genid/95b927528f181bcde227758947bac209#19
domain: http://lodlaundromat.org/.well-known/genid/95b927528f181bcde227758947bac209#13
domain: http://lodlaundromat.org/.well-known/genid/95b927528f181bcde227758947bac209#4
domain: http://lodlaundromat.org/.well-known/genid/95b927528f181bcde227758947bac209#35
domain: http://lodlaundromat.org/.well-known/genid/95b927528f181bcde227758947bac209#38
domain: http://lodlaundromat.org/.well-known/genid/95b927528f181bcde227758947bac209#16
domain: Cognitive Agent
domain: Object
domain: http://lodlaundromat.org/.well-known/genid/95b927528f181bcde227758947bac209#30
domain: http://lodlaundromat.org/.well-known/genid/95b927528f181bcde227758947bac209#25
domain: Agent
range: Resource
range: http://lodlaundromat.org/.well-known/genid/95b927528f181bcde227758947bac209#10
range: http://lodlaundromat.org/.well-known/genid/95b927528f181bcde227758947bac209#22
range: http://lodlaundromat.org/.well-known/genid/95b927528f181bcde227758947bac209#7
range: http://lodlaundromat.org/.well-known/genid/95b927528f181bcde227758947bac209#19
range: http://lodlaundromat.org/.well-known/genid/95b927528f181bcde227758947bac209#13
range: http://lodlaundromat.org/.well-known/genid/95b927528f181bcde227758947bac209#4
range: http://lodlaundromat.org/.well-known/genid/95b927528f181bcde227758947bac209#35
range: http://lodlaundromat.org/.well-known/genid/95b927528f181bcde227758947bac209#38
range: http://lodlaundromat.org/.well-known/genid/95b927528f181bcde227758947bac209#16
range: Cognitive Agent
range: Object
range: http://lodlaundromat.org/.well-known/genid/95b927528f181bcde227758947bac209#30
range: http://lodlaundromat.org/.well-known/genid/95b927528f181bcde227758947bac209#25
range: Agent

Region
subclass of: Thing
subclass of: Resource
type: Class
comment: Comparable to http://reliant.teknowledge.com/DAML/SUMO.owl#Region: "A topographic location. Regions encompass surfaces of Objects, imaginary places, and GeographicAreas. "
subclass of: Object
subclass of: http://lodlaundromat.org/.well-known/genid/95b927528f181bcde227758947bac209#30
subclass of: http://lodlaundromat.org/.well-known/genid/95b927528f181bcde227758947bac209#25

child of
range: Thing
domain: Thing
type: ObjectProperty
comment: Similar to http://purl.org/vocab/relationship vocabulary, but with different domain and range. In-laws are considered relatives.
domain: Human
range: Human
sub property of: relative of
inverse of: parent of
type: Property
domain: Resource
domain: http://lodlaundromat.org/.well-known/genid/95b927528f181bcde227758947bac209#10
domain: http://lodlaundromat.org/.well-known/genid/95b927528f181bcde227758947bac209#22
domain: http://lodlaundromat.org/.well-known/genid/95b927528f181bcde227758947bac209#7
domain: http://lodlaundromat.org/.well-known/genid/95b927528f181bcde227758947bac209#19
domain: http://lodlaundromat.org/.well-known/genid/95b927528f181bcde227758947bac209#13
domain: http://lodlaundromat.org/.well-known/genid/95b927528f181bcde227758947bac209#4
domain: http://lodlaundromat.org/.well-known/genid/95b927528f181bcde227758947bac209#35
domain: http://lodlaundromat.org/.well-known/genid/95b927528f181bcde227758947bac209#38
domain: http://lodlaundromat.org/.well-known/genid/95b927528f181bcde227758947bac209#16
domain: Cognitive Agent
domain: Object
domain: http://lodlaundromat.org/.well-known/genid/95b927528f181bcde227758947bac209#30
domain: http://lodlaundromat.org/.well-known/genid/95b927528f181bcde227758947bac209#25
domain: Agent
range: Resource
range: http://lodlaundromat.org/.well-known/genid/95b927528f181bcde227758947bac209#10
range: http://lodlaundromat.org/.well-known/genid/95b927528f181bcde227758947bac209#22
range: http://lodlaundromat.org/.well-known/genid/95b927528f181bcde227758947bac209#7
range: http://lodlaundromat.org/.well-known/genid/95b927528f181bcde227758947bac209#19
range: http://lodlaundromat.org/.well-known/genid/95b927528f181bcde227758947bac209#13
range: http://lodlaundromat.org/.well-known/genid/95b927528f181bcde227758947bac209#4
range: http://lodlaundromat.org/.well-known/genid/95b927528f181bcde227758947bac209#35
range: http://lodlaundromat.org/.well-known/genid/95b927528f181bcde227758947bac209#38
range: http://lodlaundromat.org/.well-known/genid/95b927528f181bcde227758947bac209#16
range: Cognitive Agent
range: Object
range: http://lodlaundromat.org/.well-known/genid/95b927528f181bcde227758947bac209#30
range: http://lodlaundromat.org/.well-known/genid/95b927528f181bcde227758947bac209#25
range: Agent

Cognitive Agent
subclass of: Resource
subclass of: Thing
type: Class
comment: Comparable to http://reliant.teknowledge.com/DAML/SUMO.owl#CognitiveAgent SUO 1.55: July 14, 2003 A &%SentientAgent with responsibilities and the ability to reason, deliberate, make plans, etc. This is essentially the legal/ethical notion of a person. Note that, although &%Human is a subclass of &%CognitiveAgent, there may be instances of &%CognitiveAgent which are not also instances of &%Human. For example, chimpanzees, gorillas, dolphins, whales, and some extraterrestrials (if they exist) may be &%CognitiveAgents.
subclass of: Agent
subclass of: Object
subclass of: http://lodlaundromat.org/.well-known/genid/95b927528f181bcde227758947bac209#30
subclass of: http://lodlaundromat.org/.well-known/genid/95b927528f181bcde227758947bac209#25

Residence Group
subclass of: Resource
subclass of: Thing
type: Class
comment: A group identified by common residence in a City or StateOrProvince. At the level of Nation, this should generally be EthnicGroup. Unlike EthnicGroup, they need not have cultural or ethnic features in common.
subclass of: Group of People
subclass of: http://lodlaundromat.org/.well-known/genid/95b927528f181bcde227758947bac209#22
subclass of: http://lodlaundromat.org/.well-known/genid/95b927528f181bcde227758947bac209#19
subclass of: http://lodlaundromat.org/.well-known/genid/95b927528f181bcde227758947bac209#10
subclass of: http://lodlaundromat.org/.well-known/genid/95b927528f181bcde227758947bac209#16
subclass of: http://lodlaundromat.org/.well-known/genid/95b927528f181bcde227758947bac209#38
subclass of: http://lodlaundromat.org/.well-known/genid/95b927528f181bcde227758947bac209#4
subclass of: Group
subclass of: Agent
subclass of: Object
subclass of: http://lodlaundromat.org/.well-known/genid/95b927528f181bcde227758947bac209#25
subclass of: http://lodlaundromat.org/.well-known/genid/95b927528f181bcde227758947bac209#30
subclass of: http://lodlaundromat.org/.well-known/genid/95b927528f181bcde227758947bac209#13
subclass of: http://lodlaundromat.org/.well-known/genid/95b927528f181bcde227758947bac209#7
subclass of: http://lodlaundromat.org/.well-known/genid/95b927528f181bcde227758947bac209#35

Water Area
subclass of: Resource
subclass of: Thing
type: Class
comment: Based on SUMO, http://reliant.teknowledge.com/DAML/SUMO.owl#WaterArea SUO 1.55: July 14, 2003 A body which is made up predominantly of water, e.g. rivers, lakes, oceans, etc.
subclass of: http://lodlaundromat.org/.well-known/genid/95b927528f181bcde227758947bac209#1
subclass of: Geographic Area
disjoint with: Land Area
subclass of: Object
subclass of: http://lodlaundromat.org/.well-known/genid/95b927528f181bcde227758947bac209#30
subclass of: http://lodlaundromat.org/.well-known/genid/95b927528f181bcde227758947bac209#25
subclass of: Region

political belief
range: Thing
domain: Thing
type: ObjectProperty
comment: Holding to a PoliticalBelief
domain: http://lodlaundromat.org/.well-known/genid/95b927528f181bcde227758947bac209#13
range: Political belief system
type: Property
domain: Resource
range: Resource
range: http://lodlaundromat.org/.well-known/genid/95b927528f181bcde227758947bac209#30
range: http://lodlaundromat.org/.well-known/genid/95b927528f181bcde227758947bac209#25
range: Belief system

collaborates with
range: Thing
domain: Thing
type: ObjectProperty
type: SymmetricProperty
comment: "A person who works toward a common goal with this person", similar to http://purl.org/vocab/relationship vocabulary, but with different domain and range. Those to whom the author of a New Testament Epistle send greetings are assumed to be collaborators, though this is perhaps broader than the general sense of the word. However, simple Christian fellowship or conversion do not constitute collaboration in this sense.
domain: Human
range: Human
sub property of: knows
type: Property
domain: Resource
domain: http://lodlaundromat.org/.well-known/genid/95b927528f181bcde227758947bac209#10
domain: http://lodlaundromat.org/.well-known/genid/95b927528f181bcde227758947bac209#22
domain: http://lodlaundromat.org/.well-known/genid/95b927528f181bcde227758947bac209#7
domain: http://lodlaundromat.org/.well-known/genid/95b927528f181bcde227758947bac209#19
domain: http://lodlaundromat.org/.well-known/genid/95b927528f181bcde227758947bac209#13
domain: http://lodlaundromat.org/.well-known/genid/95b927528f181bcde227758947bac209#4
domain: http://lodlaundromat.org/.well-known/genid/95b927528f181bcde227758947bac209#35
domain: http://lodlaundromat.org/.well-known/genid/95b927528f181bcde227758947bac209#38
domain: http://lodlaundromat.org/.well-known/genid/95b927528f181bcde227758947bac209#16
domain: Cognitive Agent
domain: Object
domain: http://lodlaundromat.org/.well-known/genid/95b927528f181bcde227758947bac209#30
domain: http://lodlaundromat.org/.well-known/genid/95b927528f181bcde227758947bac209#25
domain: Agent
range: Resource
range: http://lodlaundromat.org/.well-known/genid/95b927528f181bcde227758947bac209#10
range: http://lodlaundromat.org/.well-known/genid/95b927528f181bcde227758947bac209#22
range: http://lodlaundromat.org/.well-known/genid/95b927528f181bcde227758947bac209#7
range: http://lodlaundromat.org/.well-known/genid/95b927528f181bcde227758947bac209#19
range: http://lodlaundromat.org/.well-known/genid/95b927528f181bcde227758947bac209#13
range: http://lodlaundromat.org/.well-known/genid/95b927528f181bcde227758947bac209#4
range: http://lodlaundromat.org/.well-known/genid/95b927528f181bcde227758947bac209#35
range: http://lodlaundromat.org/.well-known/genid/95b927528f181bcde227758947bac209#38
range: http://lodlaundromat.org/.well-known/genid/95b927528f181bcde227758947bac209#16
range: Cognitive Agent
range: Object
range: http://lodlaundromat.org/.well-known/genid/95b927528f181bcde227758947bac209#30
range: http://lodlaundromat.org/.well-known/genid/95b927528f181bcde227758947bac209#25
range: Agent

has enemy
range: Thing
domain: Thing
type: ObjectProperty
comment: inverse of enemyOf, which is not necessarily reciprocal
domain: Human
range: Human
sub property of: knows
inverse of: enemy of
type: Property
domain: Resource
domain: http://lodlaundromat.org/.well-known/genid/95b927528f181bcde227758947bac209#10
domain: http://lodlaundromat.org/.well-known/genid/95b927528f181bcde227758947bac209#22
domain: http://lodlaundromat.org/.well-known/genid/95b927528f181bcde227758947bac209#7
domain: http://lodlaundromat.org/.well-known/genid/95b927528f181bcde227758947bac209#19
domain: http://lodlaundromat.org/.well-known/genid/95b927528f181bcde227758947bac209#13
domain: http://lodlaundromat.org/.well-known/genid/95b927528f181bcde227758947bac209#4
domain: http://lodlaundromat.org/.well-known/genid/95b927528f181bcde227758947bac209#35
domain: http://lodlaundromat.org/.well-known/genid/95b927528f181bcde227758947bac209#38
domain: http://lodlaundromat.org/.well-known/genid/95b927528f181bcde227758947bac209#16
domain: Cognitive Agent
domain: Object
domain: http://lodlaundromat.org/.well-known/genid/95b927528f181bcde227758947bac209#30
domain: http://lodlaundromat.org/.well-known/genid/95b927528f181bcde227758947bac209#25
domain: Agent
range: Resource
range: http://lodlaundromat.org/.well-known/genid/95b927528f181bcde227758947bac209#10
range: http://lodlaundromat.org/.well-known/genid/95b927528f181bcde227758947bac209#22
range: http://lodlaundromat.org/.well-known/genid/95b927528f181bcde227758947bac209#7
range: http://lodlaundromat.org/.well-known/genid/95b927528f181bcde227758947bac209#19
range: http://lodlaundromat.org/.well-known/genid/95b927528f181bcde227758947bac209#13
range: http://lodlaundromat.org/.well-known/genid/95b927528f181bcde227758947bac209#4
range: http://lodlaundromat.org/.well-known/genid/95b927528f181bcde227758947bac209#35
range: http://lodlaundromat.org/.well-known/genid/95b927528f181bcde227758947bac209#38
range: http://lodlaundromat.org/.well-known/genid/95b927528f181bcde227758947bac209#16
range: Cognitive Agent
range: Object
range: http://lodlaundromat.org/.well-known/genid/95b927528f181bcde227758947bac209#30
range: http://lodlaundromat.org/.well-known/genid/95b927528f181bcde227758947bac209#25
range: Agent

Human
subclass of: http://lodlaundromat.org/.well-known/genid/95b927528f181bcde227758947bac209#10
type: Class
subclass of: http://lodlaundromat.org/.well-known/genid/95b927528f181bcde227758947bac209#22
subclass of: Resource
subclass of: http://lodlaundromat.org/.well-known/genid/95b927528f181bcde227758947bac209#7
subclass of: Thing
subclass of: http://lodlaundromat.org/.well-known/genid/95b927528f181bcde227758947bac209#19
subclass of: http://lodlaundromat.org/.well-known/genid/95b927528f181bcde227758947bac209#13
subclass of: http://lodlaundromat.org/.well-known/genid/95b927528f181bcde227758947bac209#4
subclass of: http://lodlaundromat.org/.well-known/genid/95b927528f181bcde227758947bac209#35
subclass of: http://lodlaundromat.org/.well-known/genid/95b927528f181bcde227758947bac209#38
subclass of: http://lodlaundromat.org/.well-known/genid/95b927528f181bcde227758947bac209#16
comment: Comparable to http://reliant.teknowledge.com/DAML/SUMO.owl#Human SUO 1.55: July 14, 2003 Modern man, the only remaining species of the Homo genus.
subclass of: Cognitive Agent
subclass of: Object
subclass of: http://lodlaundromat.org/.well-known/genid/95b927528f181bcde227758947bac209#30
subclass of: http://lodlaundromat.org/.well-known/genid/95b927528f181bcde227758947bac209#25
subclass of: Agent

member of
range: Thing
domain: Thing
type: ObjectProperty
comment: Human is a memberOf a Group. Inverse of member. There are subtleties about Collections in SUMO that i'm omiting here.
domain: Human
range: Group
inverse of: member
type: Property
domain: http://lodlaundromat.org/.well-known/genid/95b927528f181bcde227758947bac209#10
domain: Resource
domain: http://lodlaundromat.org/.well-known/genid/95b927528f181bcde227758947bac209#30
domain: http://lodlaundromat.org/.well-known/genid/95b927528f181bcde227758947bac209#25
domain: Object
domain: Agent
domain: http://lodlaundromat.org/.well-known/genid/95b927528f181bcde227758947bac209#35
domain: http://lodlaundromat.org/.well-known/genid/95b927528f181bcde227758947bac209#13
domain: Cognitive Agent
domain: http://lodlaundromat.org/.well-known/genid/95b927528f181bcde227758947bac209#16
domain: http://lodlaundromat.org/.well-known/genid/95b927528f181bcde227758947bac209#19
domain: http://lodlaundromat.org/.well-known/genid/95b927528f181bcde227758947bac209#22
domain: http://lodlaundromat.org/.well-known/genid/95b927528f181bcde227758947bac209#38
domain: http://lodlaundromat.org/.well-known/genid/95b927528f181bcde227758947bac209#4
domain: http://lodlaundromat.org/.well-known/genid/95b927528f181bcde227758947bac209#7
range: Resource
range: Object
range: http://lodlaundromat.org/.well-known/genid/95b927528f181bcde227758947bac209#30
range: http://lodlaundromat.org/.well-known/genid/95b927528f181bcde227758947bac209#25
range: Agent

Woman
subclass of: Resource
subclass of: Thing
type: Class
comment: SUO 1.55: July 14, 2003 The class of &%Female &%Humans.
subclass of: http://lodlaundromat.org/.well-known/genid/95b927528f181bcde227758947bac209#2
subclass of: Human
disjoint with: Man
subclass of: http://lodlaundromat.org/.well-known/genid/95b927528f181bcde227758947bac209#16
subclass of: http://lodlaundromat.org/.well-known/genid/95b927528f181bcde227758947bac209#38
subclass of: http://lodlaundromat.org/.well-known/genid/95b927528f181bcde227758947bac209#10
subclass of: http://lodlaundromat.org/.well-known/genid/95b927528f181bcde227758947bac209#22
subclass of: Cognitive Agent
subclass of: Object
subclass of: http://lodlaundromat.org/.well-known/genid/95b927528f181bcde227758947bac209#25
subclass of: http://lodlaundromat.org/.well-known/genid/95b927528f181bcde227758947bac209#30
subclass of: Agent
subclass of: http://lodlaundromat.org/.well-known/genid/95b927528f181bcde227758947bac209#19
subclass of: http://lodlaundromat.org/.well-known/genid/95b927528f181bcde227758947bac209#13
subclass of: http://lodlaundromat.org/.well-known/genid/95b927528f181bcde227758947bac209#7
subclass of: http://lodlaundromat.org/.well-known/genid/95b927528f181bcde227758947bac209#4
subclass of: http://lodlaundromat.org/.well-known/genid/95b927528f181bcde227758947bac209#35

subregion
range: Thing
domain: Thing
type: ObjectProperty
type: TransitiveProperty
comment: Inverse of subregionOf
domain: Geographic Area
range: Geographic Area
inverse of: subregion of
type: Property
domain: http://lodlaundromat.org/.well-known/genid/95b927528f181bcde227758947bac209#30
domain: Resource
domain: http://lodlaundromat.org/.well-known/genid/95b927528f181bcde227758947bac209#25
domain: Region
domain: Object
range: Region
range: Resource
range: Object
range: http://lodlaundromat.org/.well-known/genid/95b927528f181bcde227758947bac209#30
range: http://lodlaundromat.org/.well-known/genid/95b927528f181bcde227758947bac209#25

http://lodlaundromat.org/.well-known/genid/95b927528f181bcde227758947bac209#1
type: Class
subclass of: Thing
subclass of: Resource
type: Restriction
cardinality: 0
on property: nativePlaceOf

Content Bearing Object
subclass of: Resource
subclass of: Thing
type: Class
comment: Broadly the same as http://reliant.teknowledge.com/DAML/SUMO.owl#ContentBearingObject SUO 1.55: July 14, 2003 Any &%SelfConnectedObject that expresses information.
subclass of: Object
subclass of: http://lodlaundromat.org/.well-known/genid/95b927528f181bcde227758947bac209#25
subclass of: http://lodlaundromat.org/.well-known/genid/95b927528f181bcde227758947bac209#30

has antagonist
range: Thing
domain: Thing
type: ObjectProperty
comment: inverse of antagonistOf, which is not necessarily reciprocal
domain: Human
sub property of: knows
inverse of: antagonist of
type: Property
domain: Resource
domain: http://lodlaundromat.org/.well-known/genid/95b927528f181bcde227758947bac209#10
domain: http://lodlaundromat.org/.well-known/genid/95b927528f181bcde227758947bac209#22
domain: http://lodlaundromat.org/.well-known/genid/95b927528f181bcde227758947bac209#7
domain: http://lodlaundromat.org/.well-known/genid/95b927528f181bcde227758947bac209#19
domain: http://lodlaundromat.org/.well-known/genid/95b927528f181bcde227758947bac209#13
domain: http://lodlaundromat.org/.well-known/genid/95b927528f181bcde227758947bac209#4
domain: http://lodlaundromat.org/.well-known/genid/95b927528f181bcde227758947bac209#35
domain: http://lodlaundromat.org/.well-known/genid/95b927528f181bcde227758947bac209#38
domain: http://lodlaundromat.org/.well-known/genid/95b927528f181bcde227758947bac209#16
domain: Cognitive Agent
domain: Object
domain: http://lodlaundromat.org/.well-known/genid/95b927528f181bcde227758947bac209#30
domain: http://lodlaundromat.org/.well-known/genid/95b927528f181bcde227758947bac209#25
domain: Agent
range: Human
range: Resource
range: http://lodlaundromat.org/.well-known/genid/95b927528f181bcde227758947bac209#10
range: http://lodlaundromat.org/.well-known/genid/95b927528f181bcde227758947bac209#22
range: http://lodlaundromat.org/.well-known/genid/95b927528f181bcde227758947bac209#7
range: http://lodlaundromat.org/.well-known/genid/95b927528f181bcde227758947bac209#19
range: http://lodlaundromat.org/.well-known/genid/95b927528f181bcde227758947bac209#13
range: http://lodlaundromat.org/.well-known/genid/95b927528f181bcde227758947bac209#4
range: http://lodlaundromat.org/.well-known/genid/95b927528f181bcde227758947bac209#35
range: http://lodlaundromat.org/.well-known/genid/95b927528f181bcde227758947bac209#38
range: http://lodlaundromat.org/.well-known/genid/95b927528f181bcde227758947bac209#16
range: Cognitive Agent
range: Object
range: http://lodlaundromat.org/.well-known/genid/95b927528f181bcde227758947bac209#30
range: http://lodlaundromat.org/.well-known/genid/95b927528f181bcde227758947bac209#25
range: Agent

Mountain
subclass of: Resource
subclass of: Thing
type: Class
comment: Wordnet: "a land mass that projects well above its surroundings; higher than a hill. " Used here for things referred to as "mount", even though some of these might seem like hills to well-traveled observers.
subclass of: Land Area
subclass of: Geographic Area
subclass of: Region
subclass of: http://lodlaundromat.org/.well-known/genid/95b927528f181bcde227758947bac209#30
subclass of: http://lodlaundromat.org/.well-known/genid/95b927528f181bcde227758947bac209#25
subclass of: Object

Character
subclass of: Resource
subclass of: Thing
type: Class
comment: Broadly the same as http://reliant.teknowledge.com/DAML/SUMO.owl#Character SUO 1.55: July 14, 2003 An element of an alphabet, a set of numerals, etc. Note that a &%Character may or may not be part of a &%Language. &%Character is a subclass of &%SymbolicString, because every instance of &%Character is an alphanumeric sequence consisting of a single element.
subclass of: Content Bearing Object
subclass of: Object
subclass of: http://lodlaundromat.org/.well-known/genid/95b927528f181bcde227758947bac209#25
subclass of: http://lodlaundromat.org/.well-known/genid/95b927528f181bcde227758947bac209#30

sibling of
range: Thing
domain: Thing
type: ObjectProperty
type: SymmetricProperty
type: TransitiveProperty
comment: Similar to http://purl.org/vocab/relationship vocabulary, but with different domain and range.
domain: Human
range: Human
sub property of: relative of
type: Property
domain: Resource
domain: http://lodlaundromat.org/.well-known/genid/95b927528f181bcde227758947bac209#10
domain: http://lodlaundromat.org/.well-known/genid/95b927528f181bcde227758947bac209#22
domain: http://lodlaundromat.org/.well-known/genid/95b927528f181bcde227758947bac209#7
domain: http://lodlaundromat.org/.well-known/genid/95b927528f181bcde227758947bac209#19
domain: http://lodlaundromat.org/.well-known/genid/95b927528f181bcde227758947bac209#13
domain: http://lodlaundromat.org/.well-known/genid/95b927528f181bcde227758947bac209#4
domain: http://lodlaundromat.org/.well-known/genid/95b927528f181bcde227758947bac209#35
domain: http://lodlaundromat.org/.well-known/genid/95b927528f181bcde227758947bac209#38
domain: http://lodlaundromat.org/.well-known/genid/95b927528f181bcde227758947bac209#16
domain: Cognitive Agent
domain: Object
domain: http://lodlaundromat.org/.well-known/genid/95b927528f181bcde227758947bac209#30
domain: http://lodlaundromat.org/.well-known/genid/95b927528f181bcde227758947bac209#25
domain: Agent
range: Resource
range: http://lodlaundromat.org/.well-known/genid/95b927528f181bcde227758947bac209#10
range: http://lodlaundromat.org/.well-known/genid/95b927528f181bcde227758947bac209#22
range: http://lodlaundromat.org/.well-known/genid/95b927528f181bcde227758947bac209#7
range: http://lodlaundromat.org/.well-known/genid/95b927528f181bcde227758947bac209#19
range: http://lodlaundromat.org/.well-known/genid/95b927528f181bcde227758947bac209#13
range: http://lodlaundromat.org/.well-known/genid/95b927528f181bcde227758947bac209#4
range: http://lodlaundromat.org/.well-known/genid/95b927528f181bcde227758947bac209#35
range: http://lodlaundromat.org/.well-known/genid/95b927528f181bcde227758947bac209#38
range: http://lodlaundromat.org/.well-known/genid/95b927528f181bcde227758947bac209#16
range: Cognitive Agent
range: Object
range: http://lodlaundromat.org/.well-known/genid/95b927528f181bcde227758947bac209#30
range: http://lodlaundromat.org/.well-known/genid/95b927528f181bcde227758947bac209#25
range: Agent

Fresh Water Area
subclass of: Resource
subclass of: Thing
type: Class
comment: Based on SUMO, http://reliant.teknowledge.com/DAML/SUMO.owl#FreshWaterArea SUO 1.55: July 14, 2003 A &%WaterArea whose &%Water is not saline, e.g. most rivers and lakes.
subclass of: Water Area
disjoint with: Salt Water Area
subclass of: http://lodlaundromat.org/.well-known/genid/95b927528f181bcde227758947bac209#1
subclass of: Geographic Area
subclass of: Region
subclass of: http://lodlaundromat.org/.well-known/genid/95b927528f181bcde227758947bac209#25
subclass of: http://lodlaundromat.org/.well-known/genid/95b927528f181bcde227758947bac209#30
subclass of: Object

resident place
range: Thing
domain: Thing
domain: http://lodlaundromat.org/.well-known/genid/95b927528f181bcde227758947bac209#19
type: ObjectProperty
comment: The location a person or group of people resides in. Range values may change over time: no attempt is made to capture this. Transient residence of very short duration is assumed to be visited, not resident. People addressed in a letter bound for a specific destination (e.g. the epistle of Paul to the Romans) are assumed to be resident there unless there is indication to the contrary (since the timing of a letter's arrival could not be determined with high precision).
domain: http://lodlaundromat.org/.well-known/genid/95b927528f181bcde227758947bac209#10
range: Region
sub property of: visited place
inverse of: residentPlaceOf
type: Property
domain: http://lodlaundromat.org/.well-known/genid/95b927528f181bcde227758947bac209#22
domain: http://lodlaundromat.org/.well-known/genid/95b927528f181bcde227758947bac209#4
domain: Resource
range: Resource
range: Object
range: http://lodlaundromat.org/.well-known/genid/95b927528f181bcde227758947bac209#30
range: http://lodlaundromat.org/.well-known/genid/95b927528f181bcde227758947bac209#25

latitude
type: DatatypeProperty
comment: The latitude component of a GeographicLocation
domain: Geographic Location
range: double
type: Property
domain: Resource
domain: Thing
range: Resource

altitude
type: DatatypeProperty
comment: The altitude component of a GeographicLocation
domain: Geographic Location
range: int
type: Property
domain: Resource
domain: Thing
range: Resource
range: decimal
range: integer
range: long

Louw-Nida identifier
type: DatatypeProperty
type: FunctionalProperty
comment: Louw-Nida identifier, keying specific Greek terms (and their English translations) to their taxonomy of semantic domains. A string like "33.X'.439" identifies the term sumballo, which can be translated as "to express differences of opinion in a forceful way". In their scheme, this has domain index 33 (Communication), with sub-domain index X' (Dispute, Debate). The final integer index uniquely defines this term (but the same term may have multiple senses). The sub-domain index can be determined from the term index, but it seems helpful to include both. Note the possible values of the sub-domain index are A-Z, then A'-Z', etc.
range: string
type: Property
range: Resource

Greek name
type: DatatypeProperty
comment: The human language name of an Object in Koine (not Modern) Greek, in the standard dictionary form (nominative case). Since Protege (3.0 build 141) doesn't seem to support loading and saving xml:lang attributes on properties, different subproperties are used for representing names in different languages. "grc" is the three-letter ISO-639-2 standard designator for Koine Greek.
domain: http://lodlaundromat.org/.well-known/genid/95b927528f181bcde227758947bac209#25
range: string
type: Property
domain: Resource
domain: Thing
range: Resource

English name
type: DatatypeProperty
comment: The human language name of an Object in English. Since Protege (3.0 build 141) doesn't seem to support loading and saving xml:lang attributes on properties, different subproperties are used for representing names in different languages.
domain: http://lodlaundromat.org/.well-known/genid/95b927528f181bcde227758947bac209#30
range: string
type: Property
domain: Resource
domain: Thing
range: Resource

NTNames
type: Ontology
comment: The names here are as transliterated in the English Standard Version (ESV), copyright © 2001 by Crossway Bibles, a division of Good News Publishers. Reuse note: where feasible, class names coincide with SUMO (Suggested Upper Merged Ontology), as developed within the IEEE Standard Upper Ontology Working Group, described at http://www.ontologyportal.org/, and available as OWL at http://reliant.teknowledge.com/DAML/SUMO.owl (but not without some problems). I've copied, rather than re-used, but this provides a future migration path toward coordinating the two ontologies.
version info: 1.0

longitude
type: DatatypeProperty
comment: The longiitude component of a GeographicLocation
domain: Geographic Location
range: double
type: Property
domain: Resource
domain: Thing
range: Resource

has only genealogy mention
type: DatatypeProperty
type: FunctionalProperty
comment: The only mention of this person in the New Testament text is the genealogies of Jesus recorded in Matthew 1 and/or Luke 3. Since only limited information (their ancestry) is available about this special subset of names, this property exists to support filtering them out (or in).
domain: Human
range: boolean
type: Property
domain: http://lodlaundromat.org/.well-known/genid/95b927528f181bcde227758947bac209#10
domain: Resource
domain: Thing
domain: http://lodlaundromat.org/.well-known/genid/95b927528f181bcde227758947bac209#30
domain: http://lodlaundromat.org/.well-known/genid/95b927528f181bcde227758947bac209#25
domain: Object
domain: Agent
domain: http://lodlaundromat.org/.well-known/genid/95b927528f181bcde227758947bac209#35
domain: http://lodlaundromat.org/.well-known/genid/95b927528f181bcde227758947bac209#13
domain: Cognitive Agent
domain: http://lodlaundromat.org/.well-known/genid/95b927528f181bcde227758947bac209#16
domain: http://lodlaundromat.org/.well-known/genid/95b927528f181bcde227758947bac209#19
domain: http://lodlaundromat.org/.well-known/genid/95b927528f181bcde227758947bac209#22
domain: http://lodlaundromat.org/.well-known/genid/95b927528f181bcde227758947bac209#38
domain: http://lodlaundromat.org/.well-known/genid/95b927528f181bcde227758947bac209#4
domain: http://lodlaundromat.org/.well-known/genid/95b927528f181bcde227758947bac209#7
range: Resource

description
type: DatatypeProperty
comment: A brief description of the salient aspects of a Human, based on their being mentioned in Scripture. This is not the way to enter dictionary-style definitions.
domain: Human
range: string
type: Property
domain: http://lodlaundromat.org/.well-known/genid/95b927528f181bcde227758947bac209#10
domain: Resource
domain: Thing
domain: http://lodlaundromat.org/.well-known/genid/95b927528f181bcde227758947bac209#30
domain: http://lodlaundromat.org/.well-known/genid/95b927528f181bcde227758947bac209#25
domain: Object
domain: Agent
domain: http://lodlaundromat.org/.well-known/genid/95b927528f181bcde227758947bac209#35
domain: http://lodlaundromat.org/.well-known/genid/95b927528f181bcde227758947bac209#13
domain: Cognitive Agent
domain: http://lodlaundromat.org/.well-known/genid/95b927528f181bcde227758947bac209#16
domain: http://lodlaundromat.org/.well-known/genid/95b927528f181bcde227758947bac209#19
domain: http://lodlaundromat.org/.well-known/genid/95b927528f181bcde227758947bac209#22
domain: http://lodlaundromat.org/.well-known/genid/95b927528f181bcde227758947bac209#38
domain: http://lodlaundromat.org/.well-known/genid/95b927528f181bcde227758947bac209#4
domain: http://lodlaundromat.org/.well-known/genid/95b927528f181bcde227758947bac209#7
range: Resource

occupation
type: DatatypeProperty
domain: Human
range: string
type: Property
domain: http://lodlaundromat.org/.well-known/genid/95b927528f181bcde227758947bac209#10
domain: Resource
domain: Thing
domain: http://lodlaundromat.org/.well-known/genid/95b927528f181bcde227758947bac209#30
domain: http://lodlaundromat.org/.well-known/genid/95b927528f181bcde227758947bac209#25
domain: Object
domain: Agent
domain: http://lodlaundromat.org/.well-known/genid/95b927528f181bcde227758947bac209#35
domain: http://lodlaundromat.org/.well-known/genid/95b927528f181bcde227758947bac209#13
domain: Cognitive Agent
domain: http://lodlaundromat.org/.well-known/genid/95b927528f181bcde227758947bac209#16
domain: http://lodlaundromat.org/.well-known/genid/95b927528f181bcde227758947bac209#19
domain: http://lodlaundromat.org/.well-known/genid/95b927528f181bcde227758947bac209#22
domain: http://lodlaundromat.org/.well-known/genid/95b927528f181bcde227758947bac209#38
domain: http://lodlaundromat.org/.well-known/genid/95b927528f181bcde227758947bac209#4
domain: http://lodlaundromat.org/.well-known/genid/95b927528f181bcde227758947bac209#7
range: Resource