Next transform
range: Thing
domain: Thing
type: Property
type: ObjectProperty
label: Folgende Transformation @de
label: Transformación siguiente @es
label: Transformation suivante @fr
label: Volgende transformatie @nl
domain: Morphological Transform
range: Morphological Transform
range: Resource
range: http://lodlaundromat.org/.well-known/genid/samples/jena///predicate//92ec2d3e130663ac5e2030d8244a513a/a99c4cd928f1d217346ef7b0d86e91a0#17
range: http://lodlaundromat.org/.well-known/genid/samples/jena///predicate//92ec2d3e130663ac5e2030d8244a513a/a99c4cd928f1d217346ef7b0d86e91a0#5
range: LemonElement
domain: Resource
domain: http://lodlaundromat.org/.well-known/genid/samples/jena///predicate//92ec2d3e130663ac5e2030d8244a513a/a99c4cd928f1d217346ef7b0d86e91a0#17
domain: http://lodlaundromat.org/.well-known/genid/samples/jena///predicate//92ec2d3e130663ac5e2030d8244a513a/a99c4cd928f1d217346ef7b0d86e91a0#5
domain: LemonElement

Sense relation
range: Thing
domain: Thing
label: Sinn-Relation @de
label: Relation de Signification @fr
domain: Lexical sense
label: Relación de Acepción @es
label: Zin relatie @nl
type: Property
range: Lexical sense
comment: Denotes a relationship between senses
type: ObjectProperty
range: Resource
range: http://lodlaundromat.org/.well-known/genid/samples/jena///predicate//92ec2d3e130663ac5e2030d8244a513a/a99c4cd928f1d217346ef7b0d86e91a0#18
range: http://lodlaundromat.org/.well-known/genid/samples/jena///predicate//92ec2d3e130663ac5e2030d8244a513a/a99c4cd928f1d217346ef7b0d86e91a0#17
range: http://lodlaundromat.org/.well-known/genid/samples/jena///predicate//92ec2d3e130663ac5e2030d8244a513a/a99c4cd928f1d217346ef7b0d86e91a0#5
range: LemonElement
domain: Resource
domain: http://lodlaundromat.org/.well-known/genid/samples/jena///predicate//92ec2d3e130663ac5e2030d8244a513a/a99c4cd928f1d217346ef7b0d86e91a0#18
domain: http://lodlaundromat.org/.well-known/genid/samples/jena///predicate//92ec2d3e130663ac5e2030d8244a513a/a99c4cd928f1d217346ef7b0d86e91a0#17
domain: http://lodlaundromat.org/.well-known/genid/samples/jena///predicate//92ec2d3e130663ac5e2030d8244a513a/a99c4cd928f1d217346ef7b0d86e91a0#5
domain: LemonElement

Context
range: Thing
domain: Thing
label: Contexto @es
type: Property
type: ObjectProperty
domain: Lexical sense
label: Contexte @fr
label: Kontext @de
comment: Denotes the pragmatic or discursive context of a sense mapping or a constraint on the mapping by syntactic or semantic properites
range: Lexical Context
range: Resource
range: http://lodlaundromat.org/.well-known/genid/samples/jena///predicate//92ec2d3e130663ac5e2030d8244a513a/a99c4cd928f1d217346ef7b0d86e91a0#17
range: http://lodlaundromat.org/.well-known/genid/samples/jena///predicate//92ec2d3e130663ac5e2030d8244a513a/a99c4cd928f1d217346ef7b0d86e91a0#5
range: LemonElement
domain: Resource
domain: http://lodlaundromat.org/.well-known/genid/samples/jena///predicate//92ec2d3e130663ac5e2030d8244a513a/a99c4cd928f1d217346ef7b0d86e91a0#18
domain: http://lodlaundromat.org/.well-known/genid/samples/jena///predicate//92ec2d3e130663ac5e2030d8244a513a/a99c4cd928f1d217346ef7b0d86e91a0#17
domain: http://lodlaundromat.org/.well-known/genid/samples/jena///predicate//92ec2d3e130663ac5e2030d8244a513a/a99c4cd928f1d217346ef7b0d86e91a0#5
domain: LemonElement

Method of Instruction
subclass of: Resource
Has Version: MethodOfInstruction-001
issued: 2008-01-14
type: Class
comment: A process that is used to engender knowledge, attitudes, and skills.
relation: MethodOfInstruction-001
Relation: MethodOfInstruction-001
date: 2008-01-14

Object of property
range: Thing
domain: Thing
domain: Lexical sense
type: ObjectProperty
sub property of: Semantic argument
label: Complemento de la propiedad @es
label: Object van predikaat @nl
range: Argument
label: Objekt von Prädikat @de
type: Property
comment: Indicates the semantic argument which represents the objects (ranges) of the property referred to by this sense
label: Complément de la propiété @fr
range: Resource
range: http://lodlaundromat.org/.well-known/genid/samples/jena///predicate//92ec2d3e130663ac5e2030d8244a513a/a99c4cd928f1d217346ef7b0d86e91a0#17
range: http://lodlaundromat.org/.well-known/genid/samples/jena///predicate//92ec2d3e130663ac5e2030d8244a513a/a99c4cd928f1d217346ef7b0d86e91a0#5
range: LemonElement
range: Phrase element
domain: Resource
domain: http://lodlaundromat.org/.well-known/genid/samples/jena///predicate//92ec2d3e130663ac5e2030d8244a513a/a99c4cd928f1d217346ef7b0d86e91a0#17
domain: http://lodlaundromat.org/.well-known/genid/samples/jena///predicate//92ec2d3e130663ac5e2030d8244a513a/a99c4cd928f1d217346ef7b0d86e91a0#5
domain: LemonElement
domain: http://lodlaundromat.org/.well-known/genid/samples/jena///predicate//92ec2d3e130663ac5e2030d8244a513a/a99c4cd928f1d217346ef7b0d86e91a0#18

Subject of property
range: Thing
domain: Thing
label: Onderwerp van predikaat @nl
domain: Lexical sense
type: Property
sub property of: Semantic argument
label: Sujet de la propiété @fr
label: Sujeto de la propiedad @es
label: Subjekt von Prädikat @de
comment: Indicates the semantic argument which represents the subjects (domain) of the property referred to by this sense
type: ObjectProperty
range: Argument
range: Resource
range: http://lodlaundromat.org/.well-known/genid/samples/jena///predicate//92ec2d3e130663ac5e2030d8244a513a/a99c4cd928f1d217346ef7b0d86e91a0#17
range: http://lodlaundromat.org/.well-known/genid/samples/jena///predicate//92ec2d3e130663ac5e2030d8244a513a/a99c4cd928f1d217346ef7b0d86e91a0#5
range: LemonElement
range: Phrase element
domain: Resource
domain: http://lodlaundromat.org/.well-known/genid/samples/jena///predicate//92ec2d3e130663ac5e2030d8244a513a/a99c4cd928f1d217346ef7b0d86e91a0#17
domain: http://lodlaundromat.org/.well-known/genid/samples/jena///predicate//92ec2d3e130663ac5e2030d8244a513a/a99c4cd928f1d217346ef7b0d86e91a0#5
domain: LemonElement
domain: http://lodlaundromat.org/.well-known/genid/samples/jena///predicate//92ec2d3e130663ac5e2030d8244a513a/a99c4cd928f1d217346ef7b0d86e91a0#18

Property Value
subclass of: Resource
subclass of: Thing
subclass of: http://lodlaundromat.org/.well-known/genid/samples/jena///predicate//92ec2d3e130663ac5e2030d8244a513a/a99c4cd928f1d217346ef7b0d86e91a0#32
disjoint with: Usage Example
subclass of: LemonElement
type: Class
label: Waarde van het predikaat @nl
label: Valor de la propiedad @es
label: Prädikatswert @de
label: Valeur de la propriété @fr
label: Свойство @ru
disjoint with: Definition
comment: A value that can be used in the range of linguistic property
subclass of: http://lodlaundromat.org/.well-known/genid/samples/jena///predicate//92ec2d3e130663ac5e2030d8244a513a/a99c4cd928f1d217346ef7b0d86e91a0#17
subclass of: http://lodlaundromat.org/.well-known/genid/samples/jena///predicate//92ec2d3e130663ac5e2030d8244a513a/a99c4cd928f1d217346ef7b0d86e91a0#5
disjoint with: Lexical sense
disjoint with: Node
disjoint with: Lexicon
disjoint with: Forma
disjoint with: Argument
disjoint with: Frame
disjoint with: Lexical entry
disjoint with: Component

http://lodlaundromat.org/.well-known/genid/samples/jena///predicate//92ec2d3e130663ac5e2030d8244a513a/a99c4cd928f1d217346ef7b0d86e91a0#17
subclass of: Resource
subclass of: Thing
type: Class
type: Restriction
on property: Canonical form
max cardinality: 1
subclass of: http://lodlaundromat.org/.well-known/genid/samples/jena///predicate//92ec2d3e130663ac5e2030d8244a513a/a99c4cd928f1d217346ef7b0d86e91a0#5
equivalent class: Thing
equivalent class: http://lodlaundromat.org/.well-known/genid/samples/jena///predicate//92ec2d3e130663ac5e2030d8244a513a/a99c4cd928f1d217346ef7b0d86e91a0#5

Definition
subclass of: Thing
subclass of: Resource
comment: A definition of a sememe, that is the a text describing the exact meaning of the lexical entry when its sense is the given ontology reference
label: Definitie @nl
type: Class
disjoint with: Syntactic role marker
label: Définition @fr
subclass of: LemonElement
disjoint with: Usage Example
label: Definición @es
subclass of: http://lodlaundromat.org/.well-known/genid/samples/jena///predicate//92ec2d3e130663ac5e2030d8244a513a/a99c4cd928f1d217346ef7b0d86e91a0#31
label: Определение @ru
subclass of: http://lodlaundromat.org/.well-known/genid/samples/jena///predicate//92ec2d3e130663ac5e2030d8244a513a/a99c4cd928f1d217346ef7b0d86e91a0#35
subclass of: http://lodlaundromat.org/.well-known/genid/samples/jena///predicate//92ec2d3e130663ac5e2030d8244a513a/a99c4cd928f1d217346ef7b0d86e91a0#17
subclass of: http://lodlaundromat.org/.well-known/genid/samples/jena///predicate//92ec2d3e130663ac5e2030d8244a513a/a99c4cd928f1d217346ef7b0d86e91a0#5
disjoint with: Lexical sense
disjoint with: Lexicon
disjoint with: Argument
disjoint with: Frame
disjoint with: Lexical entry
disjoint with: Node
disjoint with: Component
disjoint with: Property Value
disjoint with: Forma

Tree
range: Thing
domain: Thing
type: Property
type: ObjectProperty
label: Baum @de
label: Árbol @es
label: Arbre @fr
label: Boom @nl
range: Resource
range: http://lodlaundromat.org/.well-known/genid/samples/jena///predicate//92ec2d3e130663ac5e2030d8244a513a/a99c4cd928f1d217346ef7b0d86e91a0#17
range: http://lodlaundromat.org/.well-known/genid/samples/jena///predicate//92ec2d3e130663ac5e2030d8244a513a/a99c4cd928f1d217346ef7b0d86e91a0#5
domain: Resource
domain: http://lodlaundromat.org/.well-known/genid/samples/jena///predicate//92ec2d3e130663ac5e2030d8244a513a/a99c4cd928f1d217346ef7b0d86e91a0#17
domain: http://lodlaundromat.org/.well-known/genid/samples/jena///predicate//92ec2d3e130663ac5e2030d8244a513a/a99c4cd928f1d217346ef7b0d86e91a0#5

http://lodlaundromat.org/.well-known/genid/samples/jena///predicate//92ec2d3e130663ac5e2030d8244a513a/a99c4cd928f1d217346ef7b0d86e91a0#1
subclass of: Resource
subclass of: Thing
type: Class
type: Restriction
on property: Rule
min cardinality: 1
subclass of: http://lodlaundromat.org/.well-known/genid/samples/jena///predicate//92ec2d3e130663ac5e2030d8244a513a/a99c4cd928f1d217346ef7b0d86e91a0#17
subclass of: http://lodlaundromat.org/.well-known/genid/samples/jena///predicate//92ec2d3e130663ac5e2030d8244a513a/a99c4cd928f1d217346ef7b0d86e91a0#5

Transform
range: Thing
domain: Thing
type: Property
type: ObjectProperty
label: Transformation @de
label: Transformación @es
label: Transformatie @nl
domain: Morphological pattern
range: Morphological Transform
range: Resource
range: http://lodlaundromat.org/.well-known/genid/samples/jena///predicate//92ec2d3e130663ac5e2030d8244a513a/a99c4cd928f1d217346ef7b0d86e91a0#17
range: http://lodlaundromat.org/.well-known/genid/samples/jena///predicate//92ec2d3e130663ac5e2030d8244a513a/a99c4cd928f1d217346ef7b0d86e91a0#5
range: LemonElement
domain: Resource
domain: HasLanguage
domain: http://lodlaundromat.org/.well-known/genid/samples/jena///predicate//92ec2d3e130663ac5e2030d8244a513a/a99c4cd928f1d217346ef7b0d86e91a0#17
domain: http://lodlaundromat.org/.well-known/genid/samples/jena///predicate//92ec2d3e130663ac5e2030d8244a513a/a99c4cd928f1d217346ef7b0d86e91a0#5
domain: LemonElement

Prototype
subclass of: Resource
subclass of: Thing
type: Class
label: Prototipo @es
label: Prototyp @nl
label: Прототип @ru
subclass of: LemonElement
subclass of: http://lodlaundromat.org/.well-known/genid/samples/jena///predicate//92ec2d3e130663ac5e2030d8244a513a/a99c4cd928f1d217346ef7b0d86e91a0#5
subclass of: http://lodlaundromat.org/.well-known/genid/samples/jena///predicate//92ec2d3e130663ac5e2030d8244a513a/a99c4cd928f1d217346ef7b0d86e91a0#17

Morphological Transform
subclass of: Resource
subclass of: Thing
type: Class
label: Morphologische Transformation @de
label: Transformación morfológica @es
label: Transformation morphologique @fr
label: Morphologisch transformatie @nl
label: Морфологическое преобразование @ru
subclass of: LemonElement
subclass of: http://lodlaundromat.org/.well-known/genid/samples/jena///predicate//92ec2d3e130663ac5e2030d8244a513a/a99c4cd928f1d217346ef7b0d86e91a0#17
subclass of: http://lodlaundromat.org/.well-known/genid/samples/jena///predicate//92ec2d3e130663ac5e2030d8244a513a/a99c4cd928f1d217346ef7b0d86e91a0#5

Condition
subclass of: Thing
subclass of: Resource
label: Bedingung @de
type: Class
label: Voorwaarde @nl
label: Условие @ru
subclass of: LemonElement
label: Condición @es
comment: Indicates a logical condition that is used indicate when a particular term has the given meaning
subclass of: http://lodlaundromat.org/.well-known/genid/samples/jena///predicate//92ec2d3e130663ac5e2030d8244a513a/a99c4cd928f1d217346ef7b0d86e91a0#17
subclass of: http://lodlaundromat.org/.well-known/genid/samples/jena///predicate//92ec2d3e130663ac5e2030d8244a513a/a99c4cd928f1d217346ef7b0d86e91a0#5

Constituent
range: Thing
domain: Thing
type: ObjectProperty
range: Constituent
domain: Node
sub property of: topObjectProperty
label: Constituyente @es
label: Constitutif @fr
type: Property
label: Konstituent @de
range: Resource
range: http://lodlaundromat.org/.well-known/genid/samples/jena///predicate//92ec2d3e130663ac5e2030d8244a513a/a99c4cd928f1d217346ef7b0d86e91a0#17
range: http://lodlaundromat.org/.well-known/genid/samples/jena///predicate//92ec2d3e130663ac5e2030d8244a513a/a99c4cd928f1d217346ef7b0d86e91a0#5
range: LemonElement
domain: http://lodlaundromat.org/.well-known/genid/samples/jena///predicate//92ec2d3e130663ac5e2030d8244a513a/a99c4cd928f1d217346ef7b0d86e91a0#25
domain: Resource
domain: http://lodlaundromat.org/.well-known/genid/samples/jena///predicate//92ec2d3e130663ac5e2030d8244a513a/a99c4cd928f1d217346ef7b0d86e91a0#17
domain: http://lodlaundromat.org/.well-known/genid/samples/jena///predicate//92ec2d3e130663ac5e2030d8244a513a/a99c4cd928f1d217346ef7b0d86e91a0#5
domain: LemonElement

Rights Statement
subclass of: Resource
Has Version: RightsStatement-001
issued: 2008-01-14
type: Class
comment: A statement about the intellectual property rights (IPR) held in or over a Resource, a legal document giving official permission to do something with a resource, or a statement about access rights.
relation: RightsStatement-001
Relation: RightsStatement-001
date: 2008-01-14

Argument
subclass of: Resource
subclass of: Thing
disjoint with: Lexical entry
disjoint with: Property Value
subclass of: LemonElement
type: Class
comment: A slot representing a gap that must be filled in realising a lexical entry in a given projection
disjoint with: Forma
disjoint with: Frame
label: Аргумент @ru
label: Actant @fr
label: Argumento @es
disjoint with: Node
disjoint with: Syntactic role marker
disjoint with: Lexicon
disjoint with: Definition
disjoint with: Component
subclass of: Phrase element
disjoint with: Lexical sense
disjoint with: Usage Example
subclass of: http://lodlaundromat.org/.well-known/genid/samples/jena///predicate//92ec2d3e130663ac5e2030d8244a513a/a99c4cd928f1d217346ef7b0d86e91a0#5
subclass of: http://lodlaundromat.org/.well-known/genid/samples/jena///predicate//92ec2d3e130663ac5e2030d8244a513a/a99c4cd928f1d217346ef7b0d86e91a0#17

Linguistic System
subclass of: Resource
description: Examples include written, spoken, sign, and computer languages.
Has Version: LinguisticSystem-001
issued: 2008-01-14
type: Class
comment: A system of signs, symbols, sounds, gestures, or rules used in communication.
relation: LinguisticSystem-001
Relation: LinguisticSystem-001
date: 2008-01-14

Edge
range: Thing
domain: Thing
label: Kante @de
type: Property
comment: Denotes the relation between a node in a multi-word expression structure and an edge
domain: Node
range: Node
type: ObjectProperty
label: Lijn @nl
label: Lien @fr
label: Arista @es
range: http://lodlaundromat.org/.well-known/genid/samples/jena///predicate//92ec2d3e130663ac5e2030d8244a513a/a99c4cd928f1d217346ef7b0d86e91a0#25
range: Resource
range: http://lodlaundromat.org/.well-known/genid/samples/jena///predicate//92ec2d3e130663ac5e2030d8244a513a/a99c4cd928f1d217346ef7b0d86e91a0#17
range: http://lodlaundromat.org/.well-known/genid/samples/jena///predicate//92ec2d3e130663ac5e2030d8244a513a/a99c4cd928f1d217346ef7b0d86e91a0#5
range: LemonElement
domain: http://lodlaundromat.org/.well-known/genid/samples/jena///predicate//92ec2d3e130663ac5e2030d8244a513a/a99c4cd928f1d217346ef7b0d86e91a0#25
domain: Resource
domain: http://lodlaundromat.org/.well-known/genid/samples/jena///predicate//92ec2d3e130663ac5e2030d8244a513a/a99c4cd928f1d217346ef7b0d86e91a0#17
domain: http://lodlaundromat.org/.well-known/genid/samples/jena///predicate//92ec2d3e130663ac5e2030d8244a513a/a99c4cd928f1d217346ef7b0d86e91a0#5
domain: LemonElement

Context
subclass of: Resource
subclass of: Thing
type: Class
label: Контекст @ru
label: Contexte @fr
comment: Indicates the context in which a term is to be used. The context refers not to the immediate syntactic context, but the document and register the document is used in
label: Kontext @de
subclass of: LemonElement
label: Contexto @es
subclass of: http://lodlaundromat.org/.well-known/genid/samples/jena///predicate//92ec2d3e130663ac5e2030d8244a513a/a99c4cd928f1d217346ef7b0d86e91a0#17
subclass of: http://lodlaundromat.org/.well-known/genid/samples/jena///predicate//92ec2d3e130663ac5e2030d8244a513a/a99c4cd928f1d217346ef7b0d86e91a0#5

Sense of
range: Thing
domain: Thing
type: ObjectProperty
label: Acepción de @es
inverse of: Sense
comment: Indicate that a sense is realised by the given lexical entry
type: Property
label: Sinn von @de
label: Signfication de @fr
label: Zin van @nl
domain: Lexical sense
range: Lexical entry
range: http://lodlaundromat.org/.well-known/genid/samples/jena///predicate//92ec2d3e130663ac5e2030d8244a513a/a99c4cd928f1d217346ef7b0d86e91a0#32
range: Resource
range: HasLanguage
range: http://lodlaundromat.org/.well-known/genid/samples/jena///predicate//92ec2d3e130663ac5e2030d8244a513a/a99c4cd928f1d217346ef7b0d86e91a0#16
range: http://lodlaundromat.org/.well-known/genid/samples/jena///predicate//92ec2d3e130663ac5e2030d8244a513a/a99c4cd928f1d217346ef7b0d86e91a0#17
range: HasPattern
range: http://lodlaundromat.org/.well-known/genid/samples/jena///predicate//92ec2d3e130663ac5e2030d8244a513a/a99c4cd928f1d217346ef7b0d86e91a0#5
range: http://lodlaundromat.org/.well-known/genid/samples/jena///predicate//92ec2d3e130663ac5e2030d8244a513a/a99c4cd928f1d217346ef7b0d86e91a0#2
range: LemonElement
domain: Resource
domain: http://lodlaundromat.org/.well-known/genid/samples/jena///predicate//92ec2d3e130663ac5e2030d8244a513a/a99c4cd928f1d217346ef7b0d86e91a0#18
domain: http://lodlaundromat.org/.well-known/genid/samples/jena///predicate//92ec2d3e130663ac5e2030d8244a513a/a99c4cd928f1d217346ef7b0d86e91a0#17
domain: http://lodlaundromat.org/.well-known/genid/samples/jena///predicate//92ec2d3e130663ac5e2030d8244a513a/a99c4cd928f1d217346ef7b0d86e91a0#5
domain: LemonElement

Forma
subclass of: Resource
subclass of: Thing
disjoint with: Node
disjoint with: Usage Example
subclass of: LemonElement
type: Class
label: Форма @ru
comment: A given written or spoken realisation of a lexical entry
disjoint with: Lexicon
subclass of: http://lodlaundromat.org/.well-known/genid/samples/jena///predicate//92ec2d3e130663ac5e2030d8244a513a/a99c4cd928f1d217346ef7b0d86e91a0#15
disjoint with: Lexical entry
label: Vorm @nl
label: Forme @fr
disjoint with: Lexical sense
disjoint with: Frame
disjoint with: Syntactic role marker
label: Form
disjoint with: Definition
disjoint with: Property Value
subclass of: http://lodlaundromat.org/.well-known/genid/samples/jena///predicate//92ec2d3e130663ac5e2030d8244a513a/a99c4cd928f1d217346ef7b0d86e91a0#17
subclass of: http://lodlaundromat.org/.well-known/genid/samples/jena///predicate//92ec2d3e130663ac5e2030d8244a513a/a99c4cd928f1d217346ef7b0d86e91a0#5
disjoint with: Component
disjoint with: Argument

Agent Class
subclass of: Resource
description: Examples of Agent Class include groups seen as classes, such as students, women, charities, lecturers.
Has Version: AgentClass-003
issued: 2008-01-14
Date Modified: 2012-06-14
type: Class
comment: A group of agents.
subclass of: Class
relation: AgentClass-003
Relation: AgentClass-003
date: 2012-06-14
date: 2008-01-14

Policy
subclass of: Resource
Has Version: Policy-001
issued: 2008-01-14
type: Class
comment: A plan or course of action by an authority, intended to influence and determine decisions, actions, and other matters.
relation: Policy-001
Relation: Policy-001
date: 2008-01-14

http://lodlaundromat.org/.well-known/genid/samples/jena///predicate//92ec2d3e130663ac5e2030d8244a513a/a99c4cd928f1d217346ef7b0d86e91a0#20
type: Class
subclass of: Resource
subclass of: http://lodlaundromat.org/.well-known/genid/samples/jena///predicate//92ec2d3e130663ac5e2030d8244a513a/a99c4cd928f1d217346ef7b0d86e91a0#18
subclass of: Thing
type: Restriction
on property: Subsense
min cardinality: 1
subclass of: http://lodlaundromat.org/.well-known/genid/samples/jena///predicate//92ec2d3e130663ac5e2030d8244a513a/a99c4cd928f1d217346ef7b0d86e91a0#5
subclass of: http://lodlaundromat.org/.well-known/genid/samples/jena///predicate//92ec2d3e130663ac5e2030d8244a513a/a99c4cd928f1d217346ef7b0d86e91a0#17

Method of Accrual
subclass of: Resource
Has Version: MethodOfAccrual-001
issued: 2008-01-14
type: Class
comment: A method by which resources are added to a collection.
relation: MethodOfAccrual-001
Relation: MethodOfAccrual-001
date: 2008-01-14

Provenance Statement
subclass of: Resource
Has Version: ProvenanceStatement-001
issued: 2008-01-14
type: Class
comment: A statement of any changes in ownership and custody of a resource since its creation that are significant for its authenticity, integrity, and interpretation.
relation: ProvenanceStatement-001
Relation: ProvenanceStatement-001
date: 2008-01-14

Example
range: Thing
domain: Thing
type: Property
type: ObjectProperty
label: Beispiel @de
label: Ejemplo @es
label: Exemple @fr
label: Voorbeeld @nl
domain: Lexical sense
range: Usage Example
range: Resource
range: http://lodlaundromat.org/.well-known/genid/samples/jena///predicate//92ec2d3e130663ac5e2030d8244a513a/a99c4cd928f1d217346ef7b0d86e91a0#17
range: http://lodlaundromat.org/.well-known/genid/samples/jena///predicate//92ec2d3e130663ac5e2030d8244a513a/a99c4cd928f1d217346ef7b0d86e91a0#31
range: http://lodlaundromat.org/.well-known/genid/samples/jena///predicate//92ec2d3e130663ac5e2030d8244a513a/a99c4cd928f1d217346ef7b0d86e91a0#5
range: http://lodlaundromat.org/.well-known/genid/samples/jena///predicate//92ec2d3e130663ac5e2030d8244a513a/a99c4cd928f1d217346ef7b0d86e91a0#35
range: LemonElement
domain: Resource
domain: http://lodlaundromat.org/.well-known/genid/samples/jena///predicate//92ec2d3e130663ac5e2030d8244a513a/a99c4cd928f1d217346ef7b0d86e91a0#18
domain: http://lodlaundromat.org/.well-known/genid/samples/jena///predicate//92ec2d3e130663ac5e2030d8244a513a/a99c4cd928f1d217346ef7b0d86e91a0#17
domain: http://lodlaundromat.org/.well-known/genid/samples/jena///predicate//92ec2d3e130663ac5e2030d8244a513a/a99c4cd928f1d217346ef7b0d86e91a0#5
domain: LemonElement

Condition
range: Thing
domain: Thing
comment: Indicates an evaluable test, the is necessary for this sense to apply
domain: Lexical sense
label: Voorwaarde @nl
label: Condición @es
label: Bedingung @de
range: Lexical Condition
type: ObjectProperty
type: Property
range: Resource
range: http://lodlaundromat.org/.well-known/genid/samples/jena///predicate//92ec2d3e130663ac5e2030d8244a513a/a99c4cd928f1d217346ef7b0d86e91a0#17
range: http://lodlaundromat.org/.well-known/genid/samples/jena///predicate//92ec2d3e130663ac5e2030d8244a513a/a99c4cd928f1d217346ef7b0d86e91a0#5
range: LemonElement
domain: Resource
domain: http://lodlaundromat.org/.well-known/genid/samples/jena///predicate//92ec2d3e130663ac5e2030d8244a513a/a99c4cd928f1d217346ef7b0d86e91a0#18
domain: http://lodlaundromat.org/.well-known/genid/samples/jena///predicate//92ec2d3e130663ac5e2030d8244a513a/a99c4cd928f1d217346ef7b0d86e91a0#17
domain: http://lodlaundromat.org/.well-known/genid/samples/jena///predicate//92ec2d3e130663ac5e2030d8244a513a/a99c4cd928f1d217346ef7b0d86e91a0#5
domain: LemonElement

Extrinsic argument
range: Thing
domain: Thing
type: Property
type: ObjectProperty
label: Äußerliche Argument @de
label: Argumento extrínseco @es
label: Actant extrinsèque @fr
label: Extrinsiek argument @nl
comment: A raisable semantic argument is not in fact the semantic argument of the current frame-sense but instead is "raised" into a frame-sense used for an argument. For example the phrase "John seemed to be happy", is interpreted as "it seemed that X" where X is "John is happy", hence the subject of "seem" is a raisable argument.
sub property of: Semantic argument
range: Argument
range: Resource
range: http://lodlaundromat.org/.well-known/genid/samples/jena///predicate//92ec2d3e130663ac5e2030d8244a513a/a99c4cd928f1d217346ef7b0d86e91a0#17
range: http://lodlaundromat.org/.well-known/genid/samples/jena///predicate//92ec2d3e130663ac5e2030d8244a513a/a99c4cd928f1d217346ef7b0d86e91a0#5
range: LemonElement
range: Phrase element
domain: Lexical sense
domain: Resource
domain: http://lodlaundromat.org/.well-known/genid/samples/jena///predicate//92ec2d3e130663ac5e2030d8244a513a/a99c4cd928f1d217346ef7b0d86e91a0#17
domain: http://lodlaundromat.org/.well-known/genid/samples/jena///predicate//92ec2d3e130663ac5e2030d8244a513a/a99c4cd928f1d217346ef7b0d86e91a0#5
domain: LemonElement
domain: http://lodlaundromat.org/.well-known/genid/samples/jena///predicate//92ec2d3e130663ac5e2030d8244a513a/a99c4cd928f1d217346ef7b0d86e91a0#18

Period of Time
subclass of: Resource
Has Version: PeriodOfTime-001
issued: 2008-01-14
type: Class
comment: An interval of time that is named or defined by its start and end dates.
subclass of: Location, Period, or Jurisdiction
relation: PeriodOfTime-001
Relation: PeriodOfTime-001
date: 2008-01-14

Standard
subclass of: Resource
Has Version: Standard-001
issued: 2008-01-14
type: Class
comment: A basis for comparison; a reference point against which other things can be evaluated.
relation: Standard-001
Relation: Standard-001
date: 2008-01-14

Lexical Topic
subclass of: Resource
subclass of: Thing
type: Class
label: Lexikonthema @de
label: Tema léxica @es
label: Thème lexicale @fr
label: Lexikaal Thema @nl
subclass of: LemonElement
comment: Indicates the topic of a lexicon or a lexical entry
subclass of: http://lodlaundromat.org/.well-known/genid/samples/jena///predicate//92ec2d3e130663ac5e2030d8244a513a/a99c4cd928f1d217346ef7b0d86e91a0#5
subclass of: http://lodlaundromat.org/.well-known/genid/samples/jena///predicate//92ec2d3e130663ac5e2030d8244a513a/a99c4cd928f1d217346ef7b0d86e91a0#17

Leaf
range: Thing
domain: Thing
comment: Denotes the component referred to by the lex (pre-terminal) of the phrase structure
label: Blatt @de
range: Phrase element
label: Feuille @fr
domain: Node
type: Property
label: Blad @nl
label: Hoja @es
type: ObjectProperty
range: Resource
range: http://lodlaundromat.org/.well-known/genid/samples/jena///predicate//92ec2d3e130663ac5e2030d8244a513a/a99c4cd928f1d217346ef7b0d86e91a0#17
range: http://lodlaundromat.org/.well-known/genid/samples/jena///predicate//92ec2d3e130663ac5e2030d8244a513a/a99c4cd928f1d217346ef7b0d86e91a0#5
range: LemonElement
domain: http://lodlaundromat.org/.well-known/genid/samples/jena///predicate//92ec2d3e130663ac5e2030d8244a513a/a99c4cd928f1d217346ef7b0d86e91a0#25
domain: Resource
domain: http://lodlaundromat.org/.well-known/genid/samples/jena///predicate//92ec2d3e130663ac5e2030d8244a513a/a99c4cd928f1d217346ef7b0d86e91a0#17
domain: http://lodlaundromat.org/.well-known/genid/samples/jena///predicate//92ec2d3e130663ac5e2030d8244a513a/a99c4cd928f1d217346ef7b0d86e91a0#5
domain: LemonElement

Word
subclass of: Resource
subclass of: Thing
label: Mot @fr
type: Class
subclass of: Lexical entry
label: Palabra @es
label: Wort @de
label: Woord @nl
comment: A word is a single unit of writing or speech. In languages written in Latin, Cyrillic, Greek, Arabic scripts etc. these are assumed to be separated by white-space characters. For Chinese, Japanese, Korean this should correspond to some agreed segmentation scheme.
label: Слово @ru
subclass of: http://lodlaundromat.org/.well-known/genid/samples/jena///predicate//92ec2d3e130663ac5e2030d8244a513a/a99c4cd928f1d217346ef7b0d86e91a0#17
subclass of: http://lodlaundromat.org/.well-known/genid/samples/jena///predicate//92ec2d3e130663ac5e2030d8244a513a/a99c4cd928f1d217346ef7b0d86e91a0#16
subclass of: LemonElement
subclass of: HasPattern
subclass of: HasLanguage
subclass of: http://lodlaundromat.org/.well-known/genid/samples/jena///predicate//92ec2d3e130663ac5e2030d8244a513a/a99c4cd928f1d217346ef7b0d86e91a0#32
subclass of: http://lodlaundromat.org/.well-known/genid/samples/jena///predicate//92ec2d3e130663ac5e2030d8244a513a/a99c4cd928f1d217346ef7b0d86e91a0#2
subclass of: http://lodlaundromat.org/.well-known/genid/samples/jena///predicate//92ec2d3e130663ac5e2030d8244a513a/a99c4cd928f1d217346ef7b0d86e91a0#5

http://lodlaundromat.org/.well-known/genid/samples/jena///predicate//92ec2d3e130663ac5e2030d8244a513a/a99c4cd928f1d217346ef7b0d86e91a0#15
subclass of: Resource
subclass of: Thing
type: Class
type: Restriction
on property: Representation
min cardinality: 1
subclass of: http://lodlaundromat.org/.well-known/genid/samples/jena///predicate//92ec2d3e130663ac5e2030d8244a513a/a99c4cd928f1d217346ef7b0d86e91a0#17
subclass of: http://lodlaundromat.org/.well-known/genid/samples/jena///predicate//92ec2d3e130663ac5e2030d8244a513a/a99c4cd928f1d217346ef7b0d86e91a0#5

Location
subclass of: Resource
Has Version: Location-001
issued: 2008-01-14
type: Class
comment: A spatial region or named place.
subclass of: Location, Period, or Jurisdiction
relation: Location-001
Relation: Location-001
date: 2008-01-14

Other form
type: InverseFunctionalProperty
range: Thing
domain: Thing
label: Autre forme @fr
domain: Lexical entry
type: Property
label: Otra forma @es
range: Forma
label: Andere Form @de
comment: A non-preferred ("non-dictionary") representation of a lexical entry. This should be variant that is either a morphological variant, an abbreviation, short form or acronym
sub property of: Lexical form
label: Andere vorm @nl
type: ObjectProperty
range: Resource
range: http://lodlaundromat.org/.well-known/genid/samples/jena///predicate//92ec2d3e130663ac5e2030d8244a513a/a99c4cd928f1d217346ef7b0d86e91a0#17
range: http://lodlaundromat.org/.well-known/genid/samples/jena///predicate//92ec2d3e130663ac5e2030d8244a513a/a99c4cd928f1d217346ef7b0d86e91a0#5
range: LemonElement
range: http://lodlaundromat.org/.well-known/genid/samples/jena///predicate//92ec2d3e130663ac5e2030d8244a513a/a99c4cd928f1d217346ef7b0d86e91a0#15
domain: Resource
domain: http://lodlaundromat.org/.well-known/genid/samples/jena///predicate//92ec2d3e130663ac5e2030d8244a513a/a99c4cd928f1d217346ef7b0d86e91a0#17
domain: http://lodlaundromat.org/.well-known/genid/samples/jena///predicate//92ec2d3e130663ac5e2030d8244a513a/a99c4cd928f1d217346ef7b0d86e91a0#5
domain: http://lodlaundromat.org/.well-known/genid/samples/jena///predicate//92ec2d3e130663ac5e2030d8244a513a/a99c4cd928f1d217346ef7b0d86e91a0#2
domain: http://lodlaundromat.org/.well-known/genid/samples/jena///predicate//92ec2d3e130663ac5e2030d8244a513a/a99c4cd928f1d217346ef7b0d86e91a0#32
domain: http://lodlaundromat.org/.well-known/genid/samples/jena///predicate//92ec2d3e130663ac5e2030d8244a513a/a99c4cd928f1d217346ef7b0d86e91a0#16
domain: HasPattern
domain: HasLanguage
domain: LemonElement

Bibliographic Resource
subclass of: Resource
Has Version: BibliographicResource-001
issued: 2008-01-14
type: Class
comment: A book, article, or other documentary resource.
relation: BibliographicResource-001
Relation: BibliographicResource-001
date: 2008-01-14

http://lodlaundromat.org/.well-known/genid/samples/jena///predicate//92ec2d3e130663ac5e2030d8244a513a/a99c4cd928f1d217346ef7b0d86e91a0#23
type: Class
subclass of: Resource
subclass of: Thing
type: Restriction
on property: Entry
min cardinality: 1
subclass of: http://lodlaundromat.org/.well-known/genid/samples/jena///predicate//92ec2d3e130663ac5e2030d8244a513a/a99c4cd928f1d217346ef7b0d86e91a0#17
subclass of: http://lodlaundromat.org/.well-known/genid/samples/jena///predicate//92ec2d3e130663ac5e2030d8244a513a/a99c4cd928f1d217346ef7b0d86e91a0#5

Definition
range: Thing
domain: Thing
type: Property
range: Definition
comment: Indicates a natural language definition. Note there is a pseudo-node to allow for further description of the definition (e.g., source, creation date etc.). The value property should be used to indicate the string value of the definition.
domain: Lexical sense
type: ObjectProperty
label: Definitie @nl
label: Definición @es
label: Définition @fr
range: Resource
range: http://lodlaundromat.org/.well-known/genid/samples/jena///predicate//92ec2d3e130663ac5e2030d8244a513a/a99c4cd928f1d217346ef7b0d86e91a0#17
range: http://lodlaundromat.org/.well-known/genid/samples/jena///predicate//92ec2d3e130663ac5e2030d8244a513a/a99c4cd928f1d217346ef7b0d86e91a0#31
range: http://lodlaundromat.org/.well-known/genid/samples/jena///predicate//92ec2d3e130663ac5e2030d8244a513a/a99c4cd928f1d217346ef7b0d86e91a0#5
range: http://lodlaundromat.org/.well-known/genid/samples/jena///predicate//92ec2d3e130663ac5e2030d8244a513a/a99c4cd928f1d217346ef7b0d86e91a0#35
range: LemonElement
domain: Resource
domain: http://lodlaundromat.org/.well-known/genid/samples/jena///predicate//92ec2d3e130663ac5e2030d8244a513a/a99c4cd928f1d217346ef7b0d86e91a0#18
domain: http://lodlaundromat.org/.well-known/genid/samples/jena///predicate//92ec2d3e130663ac5e2030d8244a513a/a99c4cd928f1d217346ef7b0d86e91a0#17
domain: http://lodlaundromat.org/.well-known/genid/samples/jena///predicate//92ec2d3e130663ac5e2030d8244a513a/a99c4cd928f1d217346ef7b0d86e91a0#5
domain: LemonElement

Syntactic role marker
subclass of: Thing
subclass of: Resource
type: Class
label: Маркер синтаксической роли @ru
label: Syntactische Rolle-Marker @de
subclass of: LemonElement
label: Marqueur du rôle syntaxique @fr
label: Marcador de la función sintáctica @es
subclass of: http://lodlaundromat.org/.well-known/genid/samples/jena///predicate//92ec2d3e130663ac5e2030d8244a513a/a99c4cd928f1d217346ef7b0d86e91a0#32
comment: The indicator of a given syntactic argument, normally a preposition or other particle marker or a linguistic property such as case
label: Syntactisch rol merker @nl
disjoint with: Usage Example
subclass of: http://lodlaundromat.org/.well-known/genid/samples/jena///predicate//92ec2d3e130663ac5e2030d8244a513a/a99c4cd928f1d217346ef7b0d86e91a0#17
subclass of: http://lodlaundromat.org/.well-known/genid/samples/jena///predicate//92ec2d3e130663ac5e2030d8244a513a/a99c4cd928f1d217346ef7b0d86e91a0#5
disjoint with: Argument
disjoint with: Definition
disjoint with: Forma
disjoint with: Node
disjoint with: Frame
disjoint with: Lexicon
disjoint with: Component
disjoint with: Lexical sense

Physical Medium
subclass of: Resource
description: Examples include paper, canvas, or DVD.
Has Version: PhysicalMedium-001
issued: 2008-01-14
type: Class
comment: A physical material or carrier.
subclass of: Media Type
relation: PhysicalMedium-001
Relation: PhysicalMedium-001
date: 2008-01-14

Elément
range: Thing
domain: Thing
type: Property
comment: Denotes the lexical entry represented by the component
label: Elemento @es
type: ObjectProperty
label: Element
range: Lexical entry
domain: Component
type: FunctionalProperty
range: http://lodlaundromat.org/.well-known/genid/samples/jena///predicate//92ec2d3e130663ac5e2030d8244a513a/a99c4cd928f1d217346ef7b0d86e91a0#32
range: Resource
range: HasLanguage
range: http://lodlaundromat.org/.well-known/genid/samples/jena///predicate//92ec2d3e130663ac5e2030d8244a513a/a99c4cd928f1d217346ef7b0d86e91a0#16
range: http://lodlaundromat.org/.well-known/genid/samples/jena///predicate//92ec2d3e130663ac5e2030d8244a513a/a99c4cd928f1d217346ef7b0d86e91a0#17
range: HasPattern
range: http://lodlaundromat.org/.well-known/genid/samples/jena///predicate//92ec2d3e130663ac5e2030d8244a513a/a99c4cd928f1d217346ef7b0d86e91a0#5
range: http://lodlaundromat.org/.well-known/genid/samples/jena///predicate//92ec2d3e130663ac5e2030d8244a513a/a99c4cd928f1d217346ef7b0d86e91a0#2
range: LemonElement
domain: Resource
domain: Phrase element
domain: http://lodlaundromat.org/.well-known/genid/samples/jena///predicate//92ec2d3e130663ac5e2030d8244a513a/a99c4cd928f1d217346ef7b0d86e91a0#17
domain: http://lodlaundromat.org/.well-known/genid/samples/jena///predicate//92ec2d3e130663ac5e2030d8244a513a/a99c4cd928f1d217346ef7b0d86e91a0#5
domain: LemonElement

Phrase root
range: Thing
domain: Thing
domain: Lexical entry
label: Raíz del sintagma @es
label: Phrasewurzel @de
type: ObjectProperty
type: Property
label: Base de la syntagme @fr
range: Node
label: Zinsdeel wortel @nl
comment: Indicates the head node of a phrase structure or dependency parse graph
range: http://lodlaundromat.org/.well-known/genid/samples/jena///predicate//92ec2d3e130663ac5e2030d8244a513a/a99c4cd928f1d217346ef7b0d86e91a0#25
range: Resource
range: http://lodlaundromat.org/.well-known/genid/samples/jena///predicate//92ec2d3e130663ac5e2030d8244a513a/a99c4cd928f1d217346ef7b0d86e91a0#17
range: http://lodlaundromat.org/.well-known/genid/samples/jena///predicate//92ec2d3e130663ac5e2030d8244a513a/a99c4cd928f1d217346ef7b0d86e91a0#5
range: LemonElement
domain: http://lodlaundromat.org/.well-known/genid/samples/jena///predicate//92ec2d3e130663ac5e2030d8244a513a/a99c4cd928f1d217346ef7b0d86e91a0#32
domain: Resource
domain: HasLanguage
domain: http://lodlaundromat.org/.well-known/genid/samples/jena///predicate//92ec2d3e130663ac5e2030d8244a513a/a99c4cd928f1d217346ef7b0d86e91a0#16
domain: http://lodlaundromat.org/.well-known/genid/samples/jena///predicate//92ec2d3e130663ac5e2030d8244a513a/a99c4cd928f1d217346ef7b0d86e91a0#17
domain: HasPattern
domain: http://lodlaundromat.org/.well-known/genid/samples/jena///predicate//92ec2d3e130663ac5e2030d8244a513a/a99c4cd928f1d217346ef7b0d86e91a0#5
domain: http://lodlaundromat.org/.well-known/genid/samples/jena///predicate//92ec2d3e130663ac5e2030d8244a513a/a99c4cd928f1d217346ef7b0d86e91a0#2
domain: LemonElement

Form variant
range: Thing
domain: Thing
type: Property
type: ObjectProperty
label: Form-Variante @de
label: Variante de la forma @es
label: Variante de la forme @fr
label: Vorm variant @nl
domain: Forma
range: Forma
range: http://lodlaundromat.org/.well-known/genid/samples/jena///predicate//92ec2d3e130663ac5e2030d8244a513a/a99c4cd928f1d217346ef7b0d86e91a0#15
range: Resource
range: http://lodlaundromat.org/.well-known/genid/samples/jena///predicate//92ec2d3e130663ac5e2030d8244a513a/a99c4cd928f1d217346ef7b0d86e91a0#17
range: http://lodlaundromat.org/.well-known/genid/samples/jena///predicate//92ec2d3e130663ac5e2030d8244a513a/a99c4cd928f1d217346ef7b0d86e91a0#5
range: LemonElement
domain: http://lodlaundromat.org/.well-known/genid/samples/jena///predicate//92ec2d3e130663ac5e2030d8244a513a/a99c4cd928f1d217346ef7b0d86e91a0#15
domain: Resource
domain: http://lodlaundromat.org/.well-known/genid/samples/jena///predicate//92ec2d3e130663ac5e2030d8244a513a/a99c4cd928f1d217346ef7b0d86e91a0#17
domain: http://lodlaundromat.org/.well-known/genid/samples/jena///predicate//92ec2d3e130663ac5e2030d8244a513a/a99c4cd928f1d217346ef7b0d86e91a0#5
domain: LemonElement

Lexical sense
subclass of: Resource
subclass of: Thing
disjoint with: Lexicon
disjoint with: Definition
disjoint with: Property Value
disjoint with: Syntactic role marker
label: Lexikaal zin @nl
label: Lexikonsinn @de
subclass of: LemonElement
label: Acepción léxica @es
type: Class
subclass of: http://lodlaundromat.org/.well-known/genid/samples/jena///predicate//92ec2d3e130663ac5e2030d8244a513a/a99c4cd928f1d217346ef7b0d86e91a0#18
label: Signification lexicale @fr
disjoint with: Usage Example
comment: Represents the intersection in meaning between the lexical entry and the ontology entity. This is used as the ontology entity and lexical entry may not be in one-to-one correspondence as such the existence of a sense between them states meerly that there are some cases when this lexical entry refer to the ontology entity and vica versa. Mapping elements can be used to further specify this relation
disjoint with: Node
subclass of: http://lodlaundromat.org/.well-known/genid/samples/jena///predicate//92ec2d3e130663ac5e2030d8244a513a/a99c4cd928f1d217346ef7b0d86e91a0#17
subclass of: http://lodlaundromat.org/.well-known/genid/samples/jena///predicate//92ec2d3e130663ac5e2030d8244a513a/a99c4cd928f1d217346ef7b0d86e91a0#5
disjoint with: Forma
disjoint with: Argument
disjoint with: Component
disjoint with: Lexical entry
disjoint with: Frame

Frame
subclass of: Thing
subclass of: Resource
label: Marco @es
disjoint with: Definition
disjoint with: Node
type: Class
disjoint with: Lexical sense
disjoint with: Usage Example
label: Rahmen @de
label: Cadre @fr
label: Raam @nl
disjoint with: Lexical entry
disjoint with: Property Value
subclass of: LemonElement
label: Рамка @ru
disjoint with: Lexicon
comment: A stereotypical example of the usage of a given lexical entry. The most common example of projections are subcategorization frames which describe the slots taken by the arguments of a verb.
disjoint with: Syntactic role marker
subclass of: http://lodlaundromat.org/.well-known/genid/samples/jena///predicate//92ec2d3e130663ac5e2030d8244a513a/a99c4cd928f1d217346ef7b0d86e91a0#5
subclass of: http://lodlaundromat.org/.well-known/genid/samples/jena///predicate//92ec2d3e130663ac5e2030d8244a513a/a99c4cd928f1d217346ef7b0d86e91a0#17
disjoint with: Forma
disjoint with: Argument
disjoint with: Component

Lexical Context
subclass of: Thing
subclass of: Resource
label: Lexikaal Context @nl
comment: Indicates the pragmatic or discourse context in which a sense applies
label: Contexto léxico @es
label: Contexte lexical @fr
label: Lexikonkontext @de
label: Лексический контекст @ru
type: Class
subclass of: LemonElement
subclass of: http://lodlaundromat.org/.well-known/genid/samples/jena///predicate//92ec2d3e130663ac5e2030d8244a513a/a99c4cd928f1d217346ef7b0d86e91a0#17
subclass of: http://lodlaundromat.org/.well-known/genid/samples/jena///predicate//92ec2d3e130663ac5e2030d8244a513a/a99c4cd928f1d217346ef7b0d86e91a0#5

Reference of
type: InverseFunctionalProperty
range: Thing
domain: Thing
range: Lexical sense
label: Referencia de @es
inverse of: Reference
type: Property
label: Referenz von @de
label: Référence de @fr
label: Referentie van @nl
type: ObjectProperty
comment: Indicate that a reference has a given sense
range: Resource
range: http://lodlaundromat.org/.well-known/genid/samples/jena///predicate//92ec2d3e130663ac5e2030d8244a513a/a99c4cd928f1d217346ef7b0d86e91a0#18
range: http://lodlaundromat.org/.well-known/genid/samples/jena///predicate//92ec2d3e130663ac5e2030d8244a513a/a99c4cd928f1d217346ef7b0d86e91a0#17
range: http://lodlaundromat.org/.well-known/genid/samples/jena///predicate//92ec2d3e130663ac5e2030d8244a513a/a99c4cd928f1d217346ef7b0d86e91a0#5
range: LemonElement
domain: Resource
domain: http://lodlaundromat.org/.well-known/genid/samples/jena///predicate//92ec2d3e130663ac5e2030d8244a513a/a99c4cd928f1d217346ef7b0d86e91a0#17
domain: http://lodlaundromat.org/.well-known/genid/samples/jena///predicate//92ec2d3e130663ac5e2030d8244a513a/a99c4cd928f1d217346ef7b0d86e91a0#5

http://lodlaundromat.org/.well-known/genid/samples/jena///predicate//92ec2d3e130663ac5e2030d8244a513a/a99c4cd928f1d217346ef7b0d86e91a0#31
subclass of: Resource
subclass of: Thing
type: Class
type: Restriction
on property: Value
min cardinality: 1
subclass of: http://lodlaundromat.org/.well-known/genid/samples/jena///predicate//92ec2d3e130663ac5e2030d8244a513a/a99c4cd928f1d217346ef7b0d86e91a0#35
subclass of: http://lodlaundromat.org/.well-known/genid/samples/jena///predicate//92ec2d3e130663ac5e2030d8244a513a/a99c4cd928f1d217346ef7b0d86e91a0#17
subclass of: http://lodlaundromat.org/.well-known/genid/samples/jena///predicate//92ec2d3e130663ac5e2030d8244a513a/a99c4cd928f1d217346ef7b0d86e91a0#5
equivalent class: http://lodlaundromat.org/.well-known/genid/samples/jena///predicate//92ec2d3e130663ac5e2030d8244a513a/a99c4cd928f1d217346ef7b0d86e91a0#35

Media Type or Extent
subclass of: Resource
Has Version: MediaTypeOrExtent-001
issued: 2008-01-14
type: Class
comment: A media type or extent.
relation: MediaTypeOrExtent-001
Relation: MediaTypeOrExtent-001
date: 2008-01-14

Morphological pattern
subclass of: Thing
subclass of: Resource
label: Морфологический шаблон @ru
subclass of: LemonElement
label: Patrón morfológico @es
type: Class
label: Morphologisch Patroon @nl
subclass of: HasLanguage
label: Morphologische Muster @de
label: Patron morphologique @fr
subclass of: http://lodlaundromat.org/.well-known/genid/samples/jena///predicate//92ec2d3e130663ac5e2030d8244a513a/a99c4cd928f1d217346ef7b0d86e91a0#17
subclass of: http://lodlaundromat.org/.well-known/genid/samples/jena///predicate//92ec2d3e130663ac5e2030d8244a513a/a99c4cd928f1d217346ef7b0d86e91a0#5

Lexical entry
subclass of: Resource
subclass of: http://lodlaundromat.org/.well-known/genid/samples/jena///predicate//92ec2d3e130663ac5e2030d8244a513a/a99c4cd928f1d217346ef7b0d86e91a0#2
subclass of: Thing
subclass of: http://lodlaundromat.org/.well-known/genid/samples/jena///predicate//92ec2d3e130663ac5e2030d8244a513a/a99c4cd928f1d217346ef7b0d86e91a0#32
label: Entrée lexicale @fr
disjoint with: Property Value
subclass of: http://lodlaundromat.org/.well-known/genid/samples/jena///predicate//92ec2d3e130663ac5e2030d8244a513a/a99c4cd928f1d217346ef7b0d86e91a0#16
disjoint with: Usage Example
label: Лексическая единица @ru
subclass of: HasPattern
label: Lexikoneintrag @de
subclass of: HasLanguage
type: Class
disjoint with: Definition
disjoint with: Node
subclass of: http://lodlaundromat.org/.well-known/genid/samples/jena///predicate//92ec2d3e130663ac5e2030d8244a513a/a99c4cd928f1d217346ef7b0d86e91a0#17
disjoint with: Lexicon
disjoint with: Lexical sense
label: Entrada léxica @es
comment: An entry in the lexicon. This may be any morpheme, word, compound, phrase or clause that is included in the lexicon
label: Lexikaal item @nl
subclass of: LemonElement
subclass of: http://lodlaundromat.org/.well-known/genid/samples/jena///predicate//92ec2d3e130663ac5e2030d8244a513a/a99c4cd928f1d217346ef7b0d86e91a0#5
disjoint with: Argument
disjoint with: Forma
disjoint with: Frame
disjoint with: Component

Source
sub property of: relation
description: The described resource may be derived from the related resource in whole or in part. Recommended best practice is to identify the related resource by means of a string conforming to a formal identification system.
note: This term is intended to be used with non-literal values as defined in the DCMI Abstract Model (http://dublincore.org/documents/abstract-model/). As of December 2007, the DCMI Usage Board is seeking a way to express this intention with a formal range declaration.
comment: A related resource from which the described resource is derived.
type: Property
sub property of: source
sub property of: Relation
issued: 2008-01-14
Date Modified: 2008-01-14
Has Version: sourceT-001
relation: sourceT-001
Relation: sourceT-001
date: 2008-01-14

Hidden reference of
type: InverseFunctionalProperty
range: Thing
domain: Thing
label: Verborgen referentie van @nl
label: Référence cachée de @fr
label: Referencia oculta de @es
sub property of: Reference of
range: Lexical sense
type: ObjectProperty
label: Verborgene Referenz von @de
comment: The sense of a non-admissible lexicalization for a ontology entity. This is used to denote incorrect or deprecated language that may be useful for information extraction but not generation
type: Property
range: Resource
range: http://lodlaundromat.org/.well-known/genid/samples/jena///predicate//92ec2d3e130663ac5e2030d8244a513a/a99c4cd928f1d217346ef7b0d86e91a0#17
range: http://lodlaundromat.org/.well-known/genid/samples/jena///predicate//92ec2d3e130663ac5e2030d8244a513a/a99c4cd928f1d217346ef7b0d86e91a0#5
range: LemonElement
range: http://lodlaundromat.org/.well-known/genid/samples/jena///predicate//92ec2d3e130663ac5e2030d8244a513a/a99c4cd928f1d217346ef7b0d86e91a0#18
domain: Resource
domain: http://lodlaundromat.org/.well-known/genid/samples/jena///predicate//92ec2d3e130663ac5e2030d8244a513a/a99c4cd928f1d217346ef7b0d86e91a0#17
domain: http://lodlaundromat.org/.well-known/genid/samples/jena///predicate//92ec2d3e130663ac5e2030d8244a513a/a99c4cd928f1d217346ef7b0d86e91a0#5

Lexical property
range: Thing
domain: Thing
range: Property Value
comment: Denotes a lexical property of a lexical entry, form, component or MWE node. For the lexical entry this is assumed to be static properties e.g., part of speech and gender and for the others this is assumed to be specific properties e.g., case, number
label: Lexikalische Prädikat @de
label: Propiété lexicale @fr
label: Propiedad léxica @es
type: ObjectProperty
domain: LemonElement
type: Property
label: Lexikaal predikaat @nl
range: http://lodlaundromat.org/.well-known/genid/samples/jena///predicate//92ec2d3e130663ac5e2030d8244a513a/a99c4cd928f1d217346ef7b0d86e91a0#32
range: Resource
range: http://lodlaundromat.org/.well-known/genid/samples/jena///predicate//92ec2d3e130663ac5e2030d8244a513a/a99c4cd928f1d217346ef7b0d86e91a0#17
range: http://lodlaundromat.org/.well-known/genid/samples/jena///predicate//92ec2d3e130663ac5e2030d8244a513a/a99c4cd928f1d217346ef7b0d86e91a0#5
range: LemonElement
domain: Resource
domain: http://lodlaundromat.org/.well-known/genid/samples/jena///predicate//92ec2d3e130663ac5e2030d8244a513a/a99c4cd928f1d217346ef7b0d86e91a0#17
domain: http://lodlaundromat.org/.well-known/genid/samples/jena///predicate//92ec2d3e130663ac5e2030d8244a513a/a99c4cd928f1d217346ef7b0d86e91a0#5

Subsense
range: Thing
domain: Thing
label: Deel van de zin @nl
label: Parte del acepción @es
type: Property
type: ObjectProperty
label: Teil des Sinnes @de
comment: Indicates that the relation between a compound sense and its atomic subsenses
label: Signification composante @fr
domain: Lexical sense
range: Lexical sense
range: Resource
range: http://lodlaundromat.org/.well-known/genid/samples/jena///predicate//92ec2d3e130663ac5e2030d8244a513a/a99c4cd928f1d217346ef7b0d86e91a0#18
range: http://lodlaundromat.org/.well-known/genid/samples/jena///predicate//92ec2d3e130663ac5e2030d8244a513a/a99c4cd928f1d217346ef7b0d86e91a0#17
range: http://lodlaundromat.org/.well-known/genid/samples/jena///predicate//92ec2d3e130663ac5e2030d8244a513a/a99c4cd928f1d217346ef7b0d86e91a0#5
range: LemonElement
domain: Resource
domain: http://lodlaundromat.org/.well-known/genid/samples/jena///predicate//92ec2d3e130663ac5e2030d8244a513a/a99c4cd928f1d217346ef7b0d86e91a0#18
domain: http://lodlaundromat.org/.well-known/genid/samples/jena///predicate//92ec2d3e130663ac5e2030d8244a513a/a99c4cd928f1d217346ef7b0d86e91a0#17
domain: http://lodlaundromat.org/.well-known/genid/samples/jena///predicate//92ec2d3e130663ac5e2030d8244a513a/a99c4cd928f1d217346ef7b0d86e91a0#5
domain: LemonElement

Generates
range: Thing
domain: Thing
label: Genereert @nl
label: Genera @es
domain: Morphological Transform
range: Prototype
type: Property
subclass of: http://lodlaundromat.org/.well-known/genid/samples/jena///predicate//92ec2d3e130663ac5e2030d8244a513a/a99c4cd928f1d217346ef7b0d86e91a0#1
label: Порождает @ru
type: ObjectProperty
label: Erzeugt @de
label: Génère @fr
range: Resource
range: http://lodlaundromat.org/.well-known/genid/samples/jena///predicate//92ec2d3e130663ac5e2030d8244a513a/a99c4cd928f1d217346ef7b0d86e91a0#17
range: http://lodlaundromat.org/.well-known/genid/samples/jena///predicate//92ec2d3e130663ac5e2030d8244a513a/a99c4cd928f1d217346ef7b0d86e91a0#5
range: LemonElement
domain: Resource
domain: http://lodlaundromat.org/.well-known/genid/samples/jena///predicate//92ec2d3e130663ac5e2030d8244a513a/a99c4cd928f1d217346ef7b0d86e91a0#17
domain: http://lodlaundromat.org/.well-known/genid/samples/jena///predicate//92ec2d3e130663ac5e2030d8244a513a/a99c4cd928f1d217346ef7b0d86e91a0#5
domain: LemonElement
type: Class

Preferred reference of
type: InverseFunctionalProperty
range: Thing
domain: Thing
sub property of: Reference of
type: ObjectProperty
label: Bevorzugte Referenz von @de
comment: The sense of the preferred lexicalization of a given ontology entity
type: Property
label: Voorkeursreferentie van @nl
label: Référence préféré de @fr
range: Lexical sense
label: Referencia preferida de @es
range: Resource
range: http://lodlaundromat.org/.well-known/genid/samples/jena///predicate//92ec2d3e130663ac5e2030d8244a513a/a99c4cd928f1d217346ef7b0d86e91a0#17
range: http://lodlaundromat.org/.well-known/genid/samples/jena///predicate//92ec2d3e130663ac5e2030d8244a513a/a99c4cd928f1d217346ef7b0d86e91a0#5
range: LemonElement
range: http://lodlaundromat.org/.well-known/genid/samples/jena///predicate//92ec2d3e130663ac5e2030d8244a513a/a99c4cd928f1d217346ef7b0d86e91a0#18
domain: Resource
domain: http://lodlaundromat.org/.well-known/genid/samples/jena///predicate//92ec2d3e130663ac5e2030d8244a513a/a99c4cd928f1d217346ef7b0d86e91a0#17
domain: http://lodlaundromat.org/.well-known/genid/samples/jena///predicate//92ec2d3e130663ac5e2030d8244a513a/a99c4cd928f1d217346ef7b0d86e91a0#5

Broader
range: Thing
domain: Thing
range: Lexical sense
domain: Lexical sense
sub property of: Sense relation
inverse of: Narrower
label: Plus large @fr
label: Más amplio @es
label: Breiter @de
comment: Denotes that one sense is broader than another. From a lexical point of view this means replacing one lexical entry with another generalizes the meaning of the phrase. From an ontological point of view this property makes not strong assertions. From a mapping point of view if the broader sense applies the narrower sense must also
type: Property
type: ObjectProperty
label: Breder @nl
range: Resource
range: http://lodlaundromat.org/.well-known/genid/samples/jena///predicate//92ec2d3e130663ac5e2030d8244a513a/a99c4cd928f1d217346ef7b0d86e91a0#17
range: http://lodlaundromat.org/.well-known/genid/samples/jena///predicate//92ec2d3e130663ac5e2030d8244a513a/a99c4cd928f1d217346ef7b0d86e91a0#5
range: LemonElement
range: http://lodlaundromat.org/.well-known/genid/samples/jena///predicate//92ec2d3e130663ac5e2030d8244a513a/a99c4cd928f1d217346ef7b0d86e91a0#18
domain: Resource
domain: http://lodlaundromat.org/.well-known/genid/samples/jena///predicate//92ec2d3e130663ac5e2030d8244a513a/a99c4cd928f1d217346ef7b0d86e91a0#17
domain: http://lodlaundromat.org/.well-known/genid/samples/jena///predicate//92ec2d3e130663ac5e2030d8244a513a/a99c4cd928f1d217346ef7b0d86e91a0#5
domain: LemonElement
domain: http://lodlaundromat.org/.well-known/genid/samples/jena///predicate//92ec2d3e130663ac5e2030d8244a513a/a99c4cd928f1d217346ef7b0d86e91a0#18

Reference
inverse of: Reference of
range: Thing
domain: Thing
type: Property
label: Referentie @nl
type: ObjectProperty
label: Référence @fr
label: Referenz @de
comment: A reference to an external resource
type: FunctionalProperty
domain: Lexical sense
label: Referencia @es
range: Resource
range: http://lodlaundromat.org/.well-known/genid/samples/jena///predicate//92ec2d3e130663ac5e2030d8244a513a/a99c4cd928f1d217346ef7b0d86e91a0#17
range: http://lodlaundromat.org/.well-known/genid/samples/jena///predicate//92ec2d3e130663ac5e2030d8244a513a/a99c4cd928f1d217346ef7b0d86e91a0#5
domain: Resource
domain: http://lodlaundromat.org/.well-known/genid/samples/jena///predicate//92ec2d3e130663ac5e2030d8244a513a/a99c4cd928f1d217346ef7b0d86e91a0#18
domain: http://lodlaundromat.org/.well-known/genid/samples/jena///predicate//92ec2d3e130663ac5e2030d8244a513a/a99c4cd928f1d217346ef7b0d86e91a0#17
domain: http://lodlaundromat.org/.well-known/genid/samples/jena///predicate//92ec2d3e130663ac5e2030d8244a513a/a99c4cd928f1d217346ef7b0d86e91a0#5
domain: LemonElement

Node
subclass of: Thing
subclass of: Resource
subclass of: http://lodlaundromat.org/.well-known/genid/samples/jena///predicate//92ec2d3e130663ac5e2030d8244a513a/a99c4cd928f1d217346ef7b0d86e91a0#25
comment: A node in a phrase structure or dependency parse graph
label: Punt @nl
disjoint with: Syntactic role marker
label: Knoten @de
subclass of: LemonElement
label: Vértice @es
label: Узел @ru
disjoint with: Usage Example
type: Class
label: Nœud @fr
disjoint with: Property Value
disjoint with: Definition
subclass of: http://lodlaundromat.org/.well-known/genid/samples/jena///predicate//92ec2d3e130663ac5e2030d8244a513a/a99c4cd928f1d217346ef7b0d86e91a0#5
subclass of: http://lodlaundromat.org/.well-known/genid/samples/jena///predicate//92ec2d3e130663ac5e2030d8244a513a/a99c4cd928f1d217346ef7b0d86e91a0#17
disjoint with: Lexicon
disjoint with: Lexical entry
disjoint with: Component
disjoint with: Argument
disjoint with: Frame
disjoint with: Forma
disjoint with: Lexical sense

Narrower
inverse of: Broader
range: Thing
domain: Thing
label: Más estrecho @es
type: ObjectProperty
type: Property
domain: Lexical sense
sub property of: Sense relation
comment: Denotes that one sense is narrower than another. From a lexical point of view this means replacing one lexical entry with another specializes the meaning of the phrase. From an ontological point of view this property makes not strong assertions. From a mapping point of view if the broader sense applies the narrower sense must also
label: Plus restreint @fr
label: Enger @de
range: Lexical sense
range: Resource
range: http://lodlaundromat.org/.well-known/genid/samples/jena///predicate//92ec2d3e130663ac5e2030d8244a513a/a99c4cd928f1d217346ef7b0d86e91a0#17
range: http://lodlaundromat.org/.well-known/genid/samples/jena///predicate//92ec2d3e130663ac5e2030d8244a513a/a99c4cd928f1d217346ef7b0d86e91a0#5
range: LemonElement
range: http://lodlaundromat.org/.well-known/genid/samples/jena///predicate//92ec2d3e130663ac5e2030d8244a513a/a99c4cd928f1d217346ef7b0d86e91a0#18
domain: Resource
domain: http://lodlaundromat.org/.well-known/genid/samples/jena///predicate//92ec2d3e130663ac5e2030d8244a513a/a99c4cd928f1d217346ef7b0d86e91a0#17
domain: http://lodlaundromat.org/.well-known/genid/samples/jena///predicate//92ec2d3e130663ac5e2030d8244a513a/a99c4cd928f1d217346ef7b0d86e91a0#5
domain: LemonElement
domain: http://lodlaundromat.org/.well-known/genid/samples/jena///predicate//92ec2d3e130663ac5e2030d8244a513a/a99c4cd928f1d217346ef7b0d86e91a0#18

Equivalent
range: Thing
domain: Thing
label: Equivalente @es
type: Property
range: Lexical sense
sub property of: Sense relation
type: TransitiveProperty
type: ObjectProperty
label: Äquivalent @de
comment: Indicates that two senses are equivalent. From a lexical point of view , this indicates that the lexical entries can be substituted for each other with no change in meaning. From an ontological point of view it means that the two references are not disjoint. From a mapping point of view it means if one mapping apply the other must necessarily apply
type: SymmetricProperty
domain: Lexical sense
range: Resource
range: http://lodlaundromat.org/.well-known/genid/samples/jena///predicate//92ec2d3e130663ac5e2030d8244a513a/a99c4cd928f1d217346ef7b0d86e91a0#17
range: http://lodlaundromat.org/.well-known/genid/samples/jena///predicate//92ec2d3e130663ac5e2030d8244a513a/a99c4cd928f1d217346ef7b0d86e91a0#5
range: LemonElement
range: http://lodlaundromat.org/.well-known/genid/samples/jena///predicate//92ec2d3e130663ac5e2030d8244a513a/a99c4cd928f1d217346ef7b0d86e91a0#18
domain: Resource
domain: http://lodlaundromat.org/.well-known/genid/samples/jena///predicate//92ec2d3e130663ac5e2030d8244a513a/a99c4cd928f1d217346ef7b0d86e91a0#17
domain: http://lodlaundromat.org/.well-known/genid/samples/jena///predicate//92ec2d3e130663ac5e2030d8244a513a/a99c4cd928f1d217346ef7b0d86e91a0#5
domain: LemonElement
domain: http://lodlaundromat.org/.well-known/genid/samples/jena///predicate//92ec2d3e130663ac5e2030d8244a513a/a99c4cd928f1d217346ef7b0d86e91a0#18

Jurisdiction
subclass of: Resource
Has Version: Jurisdiction-001
issued: 2008-01-14
type: Class
comment: The extent or range of judicial, law enforcement, or other authority.
subclass of: Location, Period, or Jurisdiction
relation: Jurisdiction-001
Relation: Jurisdiction-001
date: 2008-01-14

License Document
subclass of: Resource
Has Version: LicenseDocument-001
issued: 2008-01-14
type: Class
comment: A legal document giving official permission to do something with a Resource.
subclass of: Rights Statement
relation: LicenseDocument-001
Relation: LicenseDocument-001
date: 2008-01-14

Property range
range: Thing
domain: Thing
label: Prädikatszielmenge @de
type: ObjectProperty
domain: Lexical sense
comment: Indicates a restrictions on the range of the property. That is, this sense only applies if the property the sense refers to has a object in the class referred to by this property
type: Property
label: Bereik van het predikaat @nl
sub property of: Condition
label: Rango de la propiedad @es
label: Image de la propiété @fr
range: Lexical Condition
range: Resource
range: http://lodlaundromat.org/.well-known/genid/samples/jena///predicate//92ec2d3e130663ac5e2030d8244a513a/a99c4cd928f1d217346ef7b0d86e91a0#17
range: http://lodlaundromat.org/.well-known/genid/samples/jena///predicate//92ec2d3e130663ac5e2030d8244a513a/a99c4cd928f1d217346ef7b0d86e91a0#5
range: LemonElement
domain: Resource
domain: http://lodlaundromat.org/.well-known/genid/samples/jena///predicate//92ec2d3e130663ac5e2030d8244a513a/a99c4cd928f1d217346ef7b0d86e91a0#17
domain: http://lodlaundromat.org/.well-known/genid/samples/jena///predicate//92ec2d3e130663ac5e2030d8244a513a/a99c4cd928f1d217346ef7b0d86e91a0#5
domain: LemonElement
domain: http://lodlaundromat.org/.well-known/genid/samples/jena///predicate//92ec2d3e130663ac5e2030d8244a513a/a99c4cd928f1d217346ef7b0d86e91a0#18

Merker
range: Thing
domain: Thing
domain: Argument
type: Property
label: Marcador @es
label: Marker
comment: Denotes the marker of a semantic argument. This should generally either be a semantic property i.e., case or another lexical entry e.g., a preposition or particle
type: ObjectProperty
label: маркер @ru
label: Marqueur @fr
range: Syntactic role marker
range: http://lodlaundromat.org/.well-known/genid/samples/jena///predicate//92ec2d3e130663ac5e2030d8244a513a/a99c4cd928f1d217346ef7b0d86e91a0#32
range: Resource
range: http://lodlaundromat.org/.well-known/genid/samples/jena///predicate//92ec2d3e130663ac5e2030d8244a513a/a99c4cd928f1d217346ef7b0d86e91a0#17
range: http://lodlaundromat.org/.well-known/genid/samples/jena///predicate//92ec2d3e130663ac5e2030d8244a513a/a99c4cd928f1d217346ef7b0d86e91a0#5
range: LemonElement
domain: Resource
domain: Phrase element
domain: http://lodlaundromat.org/.well-known/genid/samples/jena///predicate//92ec2d3e130663ac5e2030d8244a513a/a99c4cd928f1d217346ef7b0d86e91a0#17
domain: http://lodlaundromat.org/.well-known/genid/samples/jena///predicate//92ec2d3e130663ac5e2030d8244a513a/a99c4cd928f1d217346ef7b0d86e91a0#5
domain: LemonElement

Part of word
subclass of: Thing
subclass of: Resource
label: Deel van een woord @nl
label: Часть слова @ru
comment: An affix is a morpheme that is attached to a word stem to form a new word. Use this for lexical entries with only abstract forms
type: Class
label: Partie du mot @fr
label: Parte de la palabra @es
label: Wortteil @de
subclass of: Lexical entry
subclass of: http://lodlaundromat.org/.well-known/genid/samples/jena///predicate//92ec2d3e130663ac5e2030d8244a513a/a99c4cd928f1d217346ef7b0d86e91a0#16
subclass of: http://lodlaundromat.org/.well-known/genid/samples/jena///predicate//92ec2d3e130663ac5e2030d8244a513a/a99c4cd928f1d217346ef7b0d86e91a0#17
subclass of: http://lodlaundromat.org/.well-known/genid/samples/jena///predicate//92ec2d3e130663ac5e2030d8244a513a/a99c4cd928f1d217346ef7b0d86e91a0#32
subclass of: LemonElement
subclass of: HasPattern
subclass of: HasLanguage
subclass of: http://lodlaundromat.org/.well-known/genid/samples/jena///predicate//92ec2d3e130663ac5e2030d8244a513a/a99c4cd928f1d217346ef7b0d86e91a0#2
subclass of: http://lodlaundromat.org/.well-known/genid/samples/jena///predicate//92ec2d3e130663ac5e2030d8244a513a/a99c4cd928f1d217346ef7b0d86e91a0#5

Incompatible
range: Thing
domain: Thing
label: Onverenigbaar @nl
label: Inkompatibel @de
type: Property
sub property of: Sense relation
range: Lexical sense
comment: Says that the two senses are disjoint. From a lexical point of view, this means substituting the lexical entries must change the meaning of the phrase. From an ontological point of view, this property is implied if both references are also disjoint, but does not imply disjointness, but non-equivalence of the references. For the mapping point of view there is not instance when both mappings are valid.
type: SymmetricProperty
domain: Lexical sense
type: ObjectProperty
range: Resource
range: http://lodlaundromat.org/.well-known/genid/samples/jena///predicate//92ec2d3e130663ac5e2030d8244a513a/a99c4cd928f1d217346ef7b0d86e91a0#17
range: http://lodlaundromat.org/.well-known/genid/samples/jena///predicate//92ec2d3e130663ac5e2030d8244a513a/a99c4cd928f1d217346ef7b0d86e91a0#5
range: LemonElement
range: http://lodlaundromat.org/.well-known/genid/samples/jena///predicate//92ec2d3e130663ac5e2030d8244a513a/a99c4cd928f1d217346ef7b0d86e91a0#18
domain: Resource
domain: http://lodlaundromat.org/.well-known/genid/samples/jena///predicate//92ec2d3e130663ac5e2030d8244a513a/a99c4cd928f1d217346ef7b0d86e91a0#17
domain: http://lodlaundromat.org/.well-known/genid/samples/jena///predicate//92ec2d3e130663ac5e2030d8244a513a/a99c4cd928f1d217346ef7b0d86e91a0#5
domain: LemonElement
domain: http://lodlaundromat.org/.well-known/genid/samples/jena///predicate//92ec2d3e130663ac5e2030d8244a513a/a99c4cd928f1d217346ef7b0d86e91a0#18

Decomposition
range: Thing
domain: Thing
label: Dekompositum @de
range: ComponentList
label: Décomposition @fr
label: Descomposición @es
type: ObjectProperty
label: Decompositie @nl
type: Property
comment: Denotes a component of a lexical entry
domain: Lexical entry
range: Resource
range: List
range: http://lodlaundromat.org/.well-known/genid/samples/jena///predicate//92ec2d3e130663ac5e2030d8244a513a/a99c4cd928f1d217346ef7b0d86e91a0#6
range: http://lodlaundromat.org/.well-known/genid/samples/jena///predicate//92ec2d3e130663ac5e2030d8244a513a/a99c4cd928f1d217346ef7b0d86e91a0#17
range: http://lodlaundromat.org/.well-known/genid/samples/jena///predicate//92ec2d3e130663ac5e2030d8244a513a/a99c4cd928f1d217346ef7b0d86e91a0#13
range: http://lodlaundromat.org/.well-known/genid/samples/jena///predicate//92ec2d3e130663ac5e2030d8244a513a/a99c4cd928f1d217346ef7b0d86e91a0#8
range: http://lodlaundromat.org/.well-known/genid/samples/jena///predicate//92ec2d3e130663ac5e2030d8244a513a/a99c4cd928f1d217346ef7b0d86e91a0#14
range: http://lodlaundromat.org/.well-known/genid/samples/jena///predicate//92ec2d3e130663ac5e2030d8244a513a/a99c4cd928f1d217346ef7b0d86e91a0#5
range: http://lodlaundromat.org/.well-known/genid/samples/jena///predicate//92ec2d3e130663ac5e2030d8244a513a/a99c4cd928f1d217346ef7b0d86e91a0#7
domain: http://lodlaundromat.org/.well-known/genid/samples/jena///predicate//92ec2d3e130663ac5e2030d8244a513a/a99c4cd928f1d217346ef7b0d86e91a0#32
domain: Resource
domain: HasLanguage
domain: http://lodlaundromat.org/.well-known/genid/samples/jena///predicate//92ec2d3e130663ac5e2030d8244a513a/a99c4cd928f1d217346ef7b0d86e91a0#16
domain: http://lodlaundromat.org/.well-known/genid/samples/jena///predicate//92ec2d3e130663ac5e2030d8244a513a/a99c4cd928f1d217346ef7b0d86e91a0#17
domain: HasPattern
domain: http://lodlaundromat.org/.well-known/genid/samples/jena///predicate//92ec2d3e130663ac5e2030d8244a513a/a99c4cd928f1d217346ef7b0d86e91a0#5
domain: http://lodlaundromat.org/.well-known/genid/samples/jena///predicate//92ec2d3e130663ac5e2030d8244a513a/a99c4cd928f1d217346ef7b0d86e91a0#2
domain: LemonElement

http://lodlaundromat.org/.well-known/genid/samples/jena///predicate//92ec2d3e130663ac5e2030d8244a513a/a99c4cd928f1d217346ef7b0d86e91a0#13
subclass of: Thing
subclass of: Resource
type: Class
type: Restriction
on property: first
cardinality: 1
subclass of: http://lodlaundromat.org/.well-known/genid/samples/jena///predicate//92ec2d3e130663ac5e2030d8244a513a/a99c4cd928f1d217346ef7b0d86e91a0#17
subclass of: http://lodlaundromat.org/.well-known/genid/samples/jena///predicate//92ec2d3e130663ac5e2030d8244a513a/a99c4cd928f1d217346ef7b0d86e91a0#5

Sintagma
subclass of: Thing
subclass of: Resource
subclass of: http://lodlaundromat.org/.well-known/genid/samples/jena///predicate//92ec2d3e130663ac5e2030d8244a513a/a99c4cd928f1d217346ef7b0d86e91a0#30
label: Фраза @ru
label: Phrase
label: Zinsdeel @nl
subclass of: Lexical entry
type: Class
comment: A phrase in lemon is defined in the looser sense of a sequence of words, it does not have to a fully grammatical phrase
label: Syntagme @fr
subclass of: http://lodlaundromat.org/.well-known/genid/samples/jena///predicate//92ec2d3e130663ac5e2030d8244a513a/a99c4cd928f1d217346ef7b0d86e91a0#17
subclass of: http://lodlaundromat.org/.well-known/genid/samples/jena///predicate//92ec2d3e130663ac5e2030d8244a513a/a99c4cd928f1d217346ef7b0d86e91a0#16
subclass of: LemonElement
subclass of: http://lodlaundromat.org/.well-known/genid/samples/jena///predicate//92ec2d3e130663ac5e2030d8244a513a/a99c4cd928f1d217346ef7b0d86e91a0#32
subclass of: HasLanguage
subclass of: HasPattern
subclass of: http://lodlaundromat.org/.well-known/genid/samples/jena///predicate//92ec2d3e130663ac5e2030d8244a513a/a99c4cd928f1d217346ef7b0d86e91a0#2
subclass of: http://lodlaundromat.org/.well-known/genid/samples/jena///predicate//92ec2d3e130663ac5e2030d8244a513a/a99c4cd928f1d217346ef7b0d86e91a0#5

Abstract form
type: InverseFunctionalProperty
range: Thing
domain: Thing
comment: A representation of a lexical entry that should not be considered canonical. This is primarily from a linguistic view for non-realisable forms such as stems but may also include misspellings and other unusual forms
label: Forma abstracta @es
type: Property
label: Forme abstraite @fr
range: Forma
sub property of: Lexical form
domain: Lexical entry
type: ObjectProperty
label: Abstracte vorm @nl
label: Abstrakte Form @de
range: Resource
range: http://lodlaundromat.org/.well-known/genid/samples/jena///predicate//92ec2d3e130663ac5e2030d8244a513a/a99c4cd928f1d217346ef7b0d86e91a0#17
range: http://lodlaundromat.org/.well-known/genid/samples/jena///predicate//92ec2d3e130663ac5e2030d8244a513a/a99c4cd928f1d217346ef7b0d86e91a0#5
range: LemonElement
range: http://lodlaundromat.org/.well-known/genid/samples/jena///predicate//92ec2d3e130663ac5e2030d8244a513a/a99c4cd928f1d217346ef7b0d86e91a0#15
domain: Resource
domain: http://lodlaundromat.org/.well-known/genid/samples/jena///predicate//92ec2d3e130663ac5e2030d8244a513a/a99c4cd928f1d217346ef7b0d86e91a0#17
domain: http://lodlaundromat.org/.well-known/genid/samples/jena///predicate//92ec2d3e130663ac5e2030d8244a513a/a99c4cd928f1d217346ef7b0d86e91a0#5
domain: http://lodlaundromat.org/.well-known/genid/samples/jena///predicate//92ec2d3e130663ac5e2030d8244a513a/a99c4cd928f1d217346ef7b0d86e91a0#2
domain: http://lodlaundromat.org/.well-known/genid/samples/jena///predicate//92ec2d3e130663ac5e2030d8244a513a/a99c4cd928f1d217346ef7b0d86e91a0#32
domain: http://lodlaundromat.org/.well-known/genid/samples/jena///predicate//92ec2d3e130663ac5e2030d8244a513a/a99c4cd928f1d217346ef7b0d86e91a0#16
domain: HasPattern
domain: HasLanguage
domain: LemonElement

Agent
subclass of: Resource
description: Examples of Agent include person, organization, and software agent.
Has Version: Agent-001
issued: 2008-01-14
type: Agent Class
type: Class
comment: A resource that acts or has the power to act.
relation: Agent-001
Relation: Agent-001
date: 2008-01-14

Constituent
subclass of: Thing
subclass of: Resource
label: Constituyente @es
type: Class
subclass of: LemonElement
label: Составляющая @ru
comment: The class of constituents, that is types applied to nodes in a phrase structure graph
label: Konstituent @de
subclass of: http://lodlaundromat.org/.well-known/genid/samples/jena///predicate//92ec2d3e130663ac5e2030d8244a513a/a99c4cd928f1d217346ef7b0d86e91a0#5
subclass of: http://lodlaundromat.org/.well-known/genid/samples/jena///predicate//92ec2d3e130663ac5e2030d8244a513a/a99c4cd928f1d217346ef7b0d86e91a0#17

Syntactic behavior
range: Thing
domain: Thing
label: Syntactisch optreden @nl
type: Property
label: Funcionamiento sintáctico @es
type: ObjectProperty
domain: Lexical entry
range: Frame
comment: Indicates a syntactic behavior of a lexical entry
label: Syntactische Verhalten @de
label: Conduite syntaxique @fr
range: Resource
range: http://lodlaundromat.org/.well-known/genid/samples/jena///predicate//92ec2d3e130663ac5e2030d8244a513a/a99c4cd928f1d217346ef7b0d86e91a0#17
range: http://lodlaundromat.org/.well-known/genid/samples/jena///predicate//92ec2d3e130663ac5e2030d8244a513a/a99c4cd928f1d217346ef7b0d86e91a0#5
range: LemonElement
domain: http://lodlaundromat.org/.well-known/genid/samples/jena///predicate//92ec2d3e130663ac5e2030d8244a513a/a99c4cd928f1d217346ef7b0d86e91a0#32
domain: Resource
domain: HasLanguage
domain: http://lodlaundromat.org/.well-known/genid/samples/jena///predicate//92ec2d3e130663ac5e2030d8244a513a/a99c4cd928f1d217346ef7b0d86e91a0#16
domain: http://lodlaundromat.org/.well-known/genid/samples/jena///predicate//92ec2d3e130663ac5e2030d8244a513a/a99c4cd928f1d217346ef7b0d86e91a0#17
domain: HasPattern
domain: http://lodlaundromat.org/.well-known/genid/samples/jena///predicate//92ec2d3e130663ac5e2030d8244a513a/a99c4cd928f1d217346ef7b0d86e91a0#5
domain: http://lodlaundromat.org/.well-known/genid/samples/jena///predicate//92ec2d3e130663ac5e2030d8244a513a/a99c4cd928f1d217346ef7b0d86e91a0#2
domain: LemonElement

File Format
subclass of: Resource
description: Examples include the formats defined by the list of Internet Media Types.
Has Version: FileFormat-001
issued: 2008-01-14
type: Class
comment: A digital resource format.
subclass of: Media Type
relation: FileFormat-001
Relation: FileFormat-001
date: 2008-01-14

Usage Example
subclass of: Resource
subclass of: Thing
label: Voorbeeld van het gebruik @nl
label: Пример использования @ru
label: Exemple d'utilisation @fr
comment: An example of the usage of a lexical entry when refering to the ontology entity given by the sememe's reference. This should in effect be an example of the form used in context. E.g., "this is a *usage example*"
label: Ejemplo de uso @es
type: Class
subclass of: LemonElement
subclass of: http://lodlaundromat.org/.well-known/genid/samples/jena///predicate//92ec2d3e130663ac5e2030d8244a513a/a99c4cd928f1d217346ef7b0d86e91a0#35
label: Anwendungsbeispiel @de
subclass of: http://lodlaundromat.org/.well-known/genid/samples/jena///predicate//92ec2d3e130663ac5e2030d8244a513a/a99c4cd928f1d217346ef7b0d86e91a0#31
subclass of: http://lodlaundromat.org/.well-known/genid/samples/jena///predicate//92ec2d3e130663ac5e2030d8244a513a/a99c4cd928f1d217346ef7b0d86e91a0#17
subclass of: http://lodlaundromat.org/.well-known/genid/samples/jena///predicate//92ec2d3e130663ac5e2030d8244a513a/a99c4cd928f1d217346ef7b0d86e91a0#5
disjoint with: Argument
disjoint with: Definition
disjoint with: Node
disjoint with: Lexical entry
disjoint with: Lexicon
disjoint with: Syntactic role marker
disjoint with: Component
disjoint with: Forma
disjoint with: Lexical sense
disjoint with: Frame
disjoint with: Property Value

Size or Duration
subclass of: Resource
description: Examples include a number of pages, a specification of length, width, and breadth, or a period in hours, minutes, and seconds.
Has Version: SizeOrDuration-001
issued: 2008-01-14
type: Class
comment: A dimension or extent, or a time taken to play or execute.
subclass of: Media Type or Extent
relation: SizeOrDuration-001
Relation: SizeOrDuration-001
date: 2008-01-14

http://lodlaundromat.org/.well-known/genid/samples/jena///predicate//92ec2d3e130663ac5e2030d8244a513a/a99c4cd928f1d217346ef7b0d86e91a0#5
subclass of: Resource
subclass of: Thing
type: Class
type: Restriction
on property: Elément
max cardinality: 1
subclass of: http://lodlaundromat.org/.well-known/genid/samples/jena///predicate//92ec2d3e130663ac5e2030d8244a513a/a99c4cd928f1d217346ef7b0d86e91a0#17
equivalent class: Thing
equivalent class: http://lodlaundromat.org/.well-known/genid/samples/jena///predicate//92ec2d3e130663ac5e2030d8244a513a/a99c4cd928f1d217346ef7b0d86e91a0#17

http://lodlaundromat.org/.well-known/genid/samples/jena///predicate//92ec2d3e130663ac5e2030d8244a513a/a99c4cd928f1d217346ef7b0d86e91a0#29
subclass of: http://lodlaundromat.org/.well-known/genid/samples/jena///predicate//92ec2d3e130663ac5e2030d8244a513a/a99c4cd928f1d217346ef7b0d86e91a0#25
type: Class
subclass of: Thing
subclass of: Resource
type: Restriction
on property: Leaf
min cardinality: 1
subclass of: http://lodlaundromat.org/.well-known/genid/samples/jena///predicate//92ec2d3e130663ac5e2030d8244a513a/a99c4cd928f1d217346ef7b0d86e91a0#17
subclass of: http://lodlaundromat.org/.well-known/genid/samples/jena///predicate//92ec2d3e130663ac5e2030d8244a513a/a99c4cd928f1d217346ef7b0d86e91a0#5

HasLanguage
subclass of: Resource
subclass of: Thing
type: Class
subclass of: LemonElement
comment: Structural element for all elements that can be tagged with a language
subclass of: http://lodlaundromat.org/.well-known/genid/samples/jena///predicate//92ec2d3e130663ac5e2030d8244a513a/a99c4cd928f1d217346ef7b0d86e91a0#5
subclass of: http://lodlaundromat.org/.well-known/genid/samples/jena///predicate//92ec2d3e130663ac5e2030d8244a513a/a99c4cd928f1d217346ef7b0d86e91a0#17

Creator
sub property of: maker
sub property of: contributor
Date Modified: 2010-10-11
comment: An entity primarily responsible for making the resource.
Has Version: creatorT-002
equivalent property: maker
issued: 2008-01-14
sub property of: Contributor
sub property of: creator
type: Property
description: Examples of a Creator include a person, an organization, or a service.
range: Agent
relation: creatorT-002
Relation: creatorT-002
date: 2010-10-11
date: 2008-01-14
range: Resource

http://lodlaundromat.org/.well-known/genid/samples/jena///predicate//92ec2d3e130663ac5e2030d8244a513a/a99c4cd928f1d217346ef7b0d86e91a0#16
type: Class
subclass of: Resource
subclass of: Thing
type: Restriction
on property: Lexical form
min cardinality: 1
subclass of: http://lodlaundromat.org/.well-known/genid/samples/jena///predicate//92ec2d3e130663ac5e2030d8244a513a/a99c4cd928f1d217346ef7b0d86e91a0#5
subclass of: http://lodlaundromat.org/.well-known/genid/samples/jena///predicate//92ec2d3e130663ac5e2030d8244a513a/a99c4cd928f1d217346ef7b0d86e91a0#17

http://lodlaundromat.org/.well-known/genid/samples/jena///predicate//92ec2d3e130663ac5e2030d8244a513a/a99c4cd928f1d217346ef7b0d86e91a0#24
type: Class
subclass of: Resource
subclass of: Thing
type: Restriction
on property: Language
cardinality: 1
subclass of: http://lodlaundromat.org/.well-known/genid/samples/jena///predicate//92ec2d3e130663ac5e2030d8244a513a/a99c4cd928f1d217346ef7b0d86e91a0#5
subclass of: http://lodlaundromat.org/.well-known/genid/samples/jena///predicate//92ec2d3e130663ac5e2030d8244a513a/a99c4cd928f1d217346ef7b0d86e91a0#17

Topic
range: Thing
domain: Thing
type: ObjectProperty
type: Property
label: Tema @es
domain: http://lodlaundromat.org/.well-known/genid/samples/jena///predicate//92ec2d3e130663ac5e2030d8244a513a/a99c4cd928f1d217346ef7b0d86e91a0#2
range: Lexical Topic
label: Thème @fr
label: Thema @de
comment: Indicates the topic of the overrall lexicon, this is property is sometimes called "subject field". Note that in addition to the topic of a lexicon each lexical entry may belong to a given domain, this can be modelled as equal or not equal to the topic of the associated lexicon
range: Resource
range: http://lodlaundromat.org/.well-known/genid/samples/jena///predicate//92ec2d3e130663ac5e2030d8244a513a/a99c4cd928f1d217346ef7b0d86e91a0#17
range: http://lodlaundromat.org/.well-known/genid/samples/jena///predicate//92ec2d3e130663ac5e2030d8244a513a/a99c4cd928f1d217346ef7b0d86e91a0#5
range: LemonElement
domain: Resource
domain: http://lodlaundromat.org/.well-known/genid/samples/jena///predicate//92ec2d3e130663ac5e2030d8244a513a/a99c4cd928f1d217346ef7b0d86e91a0#17
domain: http://lodlaundromat.org/.well-known/genid/samples/jena///predicate//92ec2d3e130663ac5e2030d8244a513a/a99c4cd928f1d217346ef7b0d86e91a0#5

Canonical form
type: InverseFunctionalProperty
range: Thing
domain: Thing
sub property of: Lexical form
type: Property
range: Forma
label: Kanonische Form @de
type: FunctionalProperty
label: Canonieke vorm @nl
label: Forma canónica @es
type: ObjectProperty
comment: The canonical ("dictionary") form of the lexical entry. This can be used to indicate the "lemma" form of a lexical entry
label: Forme canonique @fr
domain: Lexical entry
range: Resource
range: http://lodlaundromat.org/.well-known/genid/samples/jena///predicate//92ec2d3e130663ac5e2030d8244a513a/a99c4cd928f1d217346ef7b0d86e91a0#17
range: http://lodlaundromat.org/.well-known/genid/samples/jena///predicate//92ec2d3e130663ac5e2030d8244a513a/a99c4cd928f1d217346ef7b0d86e91a0#5
range: LemonElement
range: http://lodlaundromat.org/.well-known/genid/samples/jena///predicate//92ec2d3e130663ac5e2030d8244a513a/a99c4cd928f1d217346ef7b0d86e91a0#15
domain: Resource
domain: http://lodlaundromat.org/.well-known/genid/samples/jena///predicate//92ec2d3e130663ac5e2030d8244a513a/a99c4cd928f1d217346ef7b0d86e91a0#17
domain: http://lodlaundromat.org/.well-known/genid/samples/jena///predicate//92ec2d3e130663ac5e2030d8244a513a/a99c4cd928f1d217346ef7b0d86e91a0#5
domain: http://lodlaundromat.org/.well-known/genid/samples/jena///predicate//92ec2d3e130663ac5e2030d8244a513a/a99c4cd928f1d217346ef7b0d86e91a0#2
domain: http://lodlaundromat.org/.well-known/genid/samples/jena///predicate//92ec2d3e130663ac5e2030d8244a513a/a99c4cd928f1d217346ef7b0d86e91a0#32
domain: http://lodlaundromat.org/.well-known/genid/samples/jena///predicate//92ec2d3e130663ac5e2030d8244a513a/a99c4cd928f1d217346ef7b0d86e91a0#16
domain: HasPattern
domain: HasLanguage
domain: LemonElement

Lexical variant
range: Thing
domain: Thing
label: Variante lexicale @fr
label: Lexikalische Variante @de
range: Lexical entry
type: ObjectProperty
comment: Indicates a non-semantic relationship between two lexical entries. E.g., a term is derived from another term, such as "lexical" and "lexicalize"
label: Variante léxica @es
label: Lexikaal variant @nl
type: Property
domain: Lexical entry
range: http://lodlaundromat.org/.well-known/genid/samples/jena///predicate//92ec2d3e130663ac5e2030d8244a513a/a99c4cd928f1d217346ef7b0d86e91a0#32
range: Resource
range: HasLanguage
range: http://lodlaundromat.org/.well-known/genid/samples/jena///predicate//92ec2d3e130663ac5e2030d8244a513a/a99c4cd928f1d217346ef7b0d86e91a0#16
range: http://lodlaundromat.org/.well-known/genid/samples/jena///predicate//92ec2d3e130663ac5e2030d8244a513a/a99c4cd928f1d217346ef7b0d86e91a0#17
range: HasPattern
range: http://lodlaundromat.org/.well-known/genid/samples/jena///predicate//92ec2d3e130663ac5e2030d8244a513a/a99c4cd928f1d217346ef7b0d86e91a0#5
range: http://lodlaundromat.org/.well-known/genid/samples/jena///predicate//92ec2d3e130663ac5e2030d8244a513a/a99c4cd928f1d217346ef7b0d86e91a0#2
range: LemonElement
domain: http://lodlaundromat.org/.well-known/genid/samples/jena///predicate//92ec2d3e130663ac5e2030d8244a513a/a99c4cd928f1d217346ef7b0d86e91a0#32
domain: Resource
domain: HasLanguage
domain: http://lodlaundromat.org/.well-known/genid/samples/jena///predicate//92ec2d3e130663ac5e2030d8244a513a/a99c4cd928f1d217346ef7b0d86e91a0#16
domain: http://lodlaundromat.org/.well-known/genid/samples/jena///predicate//92ec2d3e130663ac5e2030d8244a513a/a99c4cd928f1d217346ef7b0d86e91a0#17
domain: HasPattern
domain: http://lodlaundromat.org/.well-known/genid/samples/jena///predicate//92ec2d3e130663ac5e2030d8244a513a/a99c4cd928f1d217346ef7b0d86e91a0#5
domain: http://lodlaundromat.org/.well-known/genid/samples/jena///predicate//92ec2d3e130663ac5e2030d8244a513a/a99c4cd928f1d217346ef7b0d86e91a0#2
domain: LemonElement

Syntactic argument
range: Thing
domain: Thing
type: Property
label: Argumento sintáctico @es
type: ObjectProperty
range: Argument
domain: Frame
label: Actant syntaxique @fr
comment: Indicates a slot in a syntactic frame
label: Syntactische Argument @de
label: Syntactisch argument @nl
range: Resource
range: Phrase element
range: http://lodlaundromat.org/.well-known/genid/samples/jena///predicate//92ec2d3e130663ac5e2030d8244a513a/a99c4cd928f1d217346ef7b0d86e91a0#17
range: http://lodlaundromat.org/.well-known/genid/samples/jena///predicate//92ec2d3e130663ac5e2030d8244a513a/a99c4cd928f1d217346ef7b0d86e91a0#5
range: LemonElement
domain: Resource
domain: http://lodlaundromat.org/.well-known/genid/samples/jena///predicate//92ec2d3e130663ac5e2030d8244a513a/a99c4cd928f1d217346ef7b0d86e91a0#17
domain: http://lodlaundromat.org/.well-known/genid/samples/jena///predicate//92ec2d3e130663ac5e2030d8244a513a/a99c4cd928f1d217346ef7b0d86e91a0#5
domain: LemonElement

Lexical form
range: Thing
domain: Thing
label: Lexikalische Form @de
label: Lexikaal vorm @nl
domain: Lexical entry
type: ObjectProperty
type: Property
range: Forma
label: Forma léxica @es
label: Forme lexicale @fr
type: InverseFunctionalProperty
comment: Denotes a written representation of a lexical entry
range: http://lodlaundromat.org/.well-known/genid/samples/jena///predicate//92ec2d3e130663ac5e2030d8244a513a/a99c4cd928f1d217346ef7b0d86e91a0#15
range: Resource
range: http://lodlaundromat.org/.well-known/genid/samples/jena///predicate//92ec2d3e130663ac5e2030d8244a513a/a99c4cd928f1d217346ef7b0d86e91a0#17
range: http://lodlaundromat.org/.well-known/genid/samples/jena///predicate//92ec2d3e130663ac5e2030d8244a513a/a99c4cd928f1d217346ef7b0d86e91a0#5
range: LemonElement
domain: http://lodlaundromat.org/.well-known/genid/samples/jena///predicate//92ec2d3e130663ac5e2030d8244a513a/a99c4cd928f1d217346ef7b0d86e91a0#32
domain: Resource
domain: HasLanguage
domain: http://lodlaundromat.org/.well-known/genid/samples/jena///predicate//92ec2d3e130663ac5e2030d8244a513a/a99c4cd928f1d217346ef7b0d86e91a0#16
domain: http://lodlaundromat.org/.well-known/genid/samples/jena///predicate//92ec2d3e130663ac5e2030d8244a513a/a99c4cd928f1d217346ef7b0d86e91a0#17
domain: HasPattern
domain: http://lodlaundromat.org/.well-known/genid/samples/jena///predicate//92ec2d3e130663ac5e2030d8244a513a/a99c4cd928f1d217346ef7b0d86e91a0#5
domain: http://lodlaundromat.org/.well-known/genid/samples/jena///predicate//92ec2d3e130663ac5e2030d8244a513a/a99c4cd928f1d217346ef7b0d86e91a0#2
domain: LemonElement

Property domain
range: Thing
domain: Thing
comment: Indicates a restrictions on the domain of the property. That is, this sense only applies if the property the sense refers to has a subject in the class referred to by this property
label: Prädikatsbereich @de
label: Domein van het predikaat @nl
label: Dominio de la propiedad @es
type: ObjectProperty
label: Ensemble de la propiété @fr
type: Property
domain: Lexical sense
sub property of: Condition
range: Lexical Condition
range: Resource
range: http://lodlaundromat.org/.well-known/genid/samples/jena///predicate//92ec2d3e130663ac5e2030d8244a513a/a99c4cd928f1d217346ef7b0d86e91a0#17
range: http://lodlaundromat.org/.well-known/genid/samples/jena///predicate//92ec2d3e130663ac5e2030d8244a513a/a99c4cd928f1d217346ef7b0d86e91a0#5
range: LemonElement
domain: Resource
domain: http://lodlaundromat.org/.well-known/genid/samples/jena///predicate//92ec2d3e130663ac5e2030d8244a513a/a99c4cd928f1d217346ef7b0d86e91a0#17
domain: http://lodlaundromat.org/.well-known/genid/samples/jena///predicate//92ec2d3e130663ac5e2030d8244a513a/a99c4cd928f1d217346ef7b0d86e91a0#5
domain: LemonElement
domain: http://lodlaundromat.org/.well-known/genid/samples/jena///predicate//92ec2d3e130663ac5e2030d8244a513a/a99c4cd928f1d217346ef7b0d86e91a0#18

Pattern
range: Thing
domain: Thing
label: Muster @de
range: Morphological pattern
label: Patroon @nl
label: Patron @fr
domain: HasPattern
type: ObjectProperty
label: Шаблон @ru
type: Property
label: Patrón @es
range: Resource
range: HasLanguage
range: http://lodlaundromat.org/.well-known/genid/samples/jena///predicate//92ec2d3e130663ac5e2030d8244a513a/a99c4cd928f1d217346ef7b0d86e91a0#17
range: http://lodlaundromat.org/.well-known/genid/samples/jena///predicate//92ec2d3e130663ac5e2030d8244a513a/a99c4cd928f1d217346ef7b0d86e91a0#5
range: LemonElement
domain: Resource
domain: http://lodlaundromat.org/.well-known/genid/samples/jena///predicate//92ec2d3e130663ac5e2030d8244a513a/a99c4cd928f1d217346ef7b0d86e91a0#17
domain: http://lodlaundromat.org/.well-known/genid/samples/jena///predicate//92ec2d3e130663ac5e2030d8244a513a/a99c4cd928f1d217346ef7b0d86e91a0#5
domain: LemonElement

Component
subclass of: Thing
subclass of: Resource
label: Компонента @ru
subclass of: http://lodlaundromat.org/.well-known/genid/samples/jena///predicate//92ec2d3e130663ac5e2030d8244a513a/a99c4cd928f1d217346ef7b0d86e91a0#5
disjoint with: Syntactic role marker
disjoint with: Lexicon
type: Class
disjoint with: Lexical sense
disjoint with: Property Value
disjoint with: Forma
disjoint with: Definition
label: Composant @fr
disjoint with: Usage Example
label: Bestanddeel @nl
subclass of: LemonElement
label: Komponente @de
disjoint with: Frame
disjoint with: Lexical entry
subclass of: Phrase element
comment: A constituent element of a lexical entry. This may be a word in a multi-word lexical element or a constituent of a compound word
label: Componente @es
disjoint with: Node
subclass of: http://lodlaundromat.org/.well-known/genid/samples/jena///predicate//92ec2d3e130663ac5e2030d8244a513a/a99c4cd928f1d217346ef7b0d86e91a0#17
disjoint with: Argument

Media Type
subclass of: Resource
Has Version: MediaType-001
issued: 2008-01-14
type: Class
comment: A file format or physical medium.
subclass of: Media Type or Extent
relation: MediaType-001
Relation: MediaType-001
date: 2008-01-14

Sense
inverse of: Sense of
range: Thing
domain: Thing
label: Zin @nl
range: Lexical sense
comment: Indicates the sense of a lexical entry
domain: Lexical entry
type: Property
label: Signification @fr
label: Acepción @es
type: ObjectProperty
label: Sinn @de
range: Resource
range: http://lodlaundromat.org/.well-known/genid/samples/jena///predicate//92ec2d3e130663ac5e2030d8244a513a/a99c4cd928f1d217346ef7b0d86e91a0#18
range: http://lodlaundromat.org/.well-known/genid/samples/jena///predicate//92ec2d3e130663ac5e2030d8244a513a/a99c4cd928f1d217346ef7b0d86e91a0#17
range: http://lodlaundromat.org/.well-known/genid/samples/jena///predicate//92ec2d3e130663ac5e2030d8244a513a/a99c4cd928f1d217346ef7b0d86e91a0#5
range: LemonElement
domain: http://lodlaundromat.org/.well-known/genid/samples/jena///predicate//92ec2d3e130663ac5e2030d8244a513a/a99c4cd928f1d217346ef7b0d86e91a0#32
domain: Resource
domain: HasLanguage
domain: http://lodlaundromat.org/.well-known/genid/samples/jena///predicate//92ec2d3e130663ac5e2030d8244a513a/a99c4cd928f1d217346ef7b0d86e91a0#16
domain: http://lodlaundromat.org/.well-known/genid/samples/jena///predicate//92ec2d3e130663ac5e2030d8244a513a/a99c4cd928f1d217346ef7b0d86e91a0#17
domain: HasPattern
domain: http://lodlaundromat.org/.well-known/genid/samples/jena///predicate//92ec2d3e130663ac5e2030d8244a513a/a99c4cd928f1d217346ef7b0d86e91a0#5
domain: http://lodlaundromat.org/.well-known/genid/samples/jena///predicate//92ec2d3e130663ac5e2030d8244a513a/a99c4cd928f1d217346ef7b0d86e91a0#2
domain: LemonElement

Phrase element
subclass of: Resource
subclass of: Thing
type: Class
label: Phrase-Element @de
label: Elemento del sintagma @es
label: Elément du syntagme @fr
label: Zinselement @nl
subclass of: LemonElement
comment: A terminal node in a phrase structure graph, i.e., a realisable, lexical element.
subclass of: http://lodlaundromat.org/.well-known/genid/samples/jena///predicate//92ec2d3e130663ac5e2030d8244a513a/a99c4cd928f1d217346ef7b0d86e91a0#5
subclass of: http://lodlaundromat.org/.well-known/genid/samples/jena///predicate//92ec2d3e130663ac5e2030d8244a513a/a99c4cd928f1d217346ef7b0d86e91a0#17

Entry
range: Thing
domain: Thing
domain: Lexicon
type: ObjectProperty
range: Lexical entry
comment: Indicates an entry in a lexicon
type: Property
label: Eintrag @de
label: Entrada @es
label: Entrée @fr
label: Item @nl
range: http://lodlaundromat.org/.well-known/genid/samples/jena///predicate//92ec2d3e130663ac5e2030d8244a513a/a99c4cd928f1d217346ef7b0d86e91a0#32
range: Resource
range: HasLanguage
range: http://lodlaundromat.org/.well-known/genid/samples/jena///predicate//92ec2d3e130663ac5e2030d8244a513a/a99c4cd928f1d217346ef7b0d86e91a0#16
range: http://lodlaundromat.org/.well-known/genid/samples/jena///predicate//92ec2d3e130663ac5e2030d8244a513a/a99c4cd928f1d217346ef7b0d86e91a0#17
range: HasPattern
range: http://lodlaundromat.org/.well-known/genid/samples/jena///predicate//92ec2d3e130663ac5e2030d8244a513a/a99c4cd928f1d217346ef7b0d86e91a0#5
range: http://lodlaundromat.org/.well-known/genid/samples/jena///predicate//92ec2d3e130663ac5e2030d8244a513a/a99c4cd928f1d217346ef7b0d86e91a0#2
range: LemonElement
domain: Resource
domain: HasLanguage
domain: http://lodlaundromat.org/.well-known/genid/samples/jena///predicate//92ec2d3e130663ac5e2030d8244a513a/a99c4cd928f1d217346ef7b0d86e91a0#17
domain: http://lodlaundromat.org/.well-known/genid/samples/jena///predicate//92ec2d3e130663ac5e2030d8244a513a/a99c4cd928f1d217346ef7b0d86e91a0#2
domain: HasPattern
domain: http://lodlaundromat.org/.well-known/genid/samples/jena///predicate//92ec2d3e130663ac5e2030d8244a513a/a99c4cd928f1d217346ef7b0d86e91a0#24
domain: http://lodlaundromat.org/.well-known/genid/samples/jena///predicate//92ec2d3e130663ac5e2030d8244a513a/a99c4cd928f1d217346ef7b0d86e91a0#23
domain: http://lodlaundromat.org/.well-known/genid/samples/jena///predicate//92ec2d3e130663ac5e2030d8244a513a/a99c4cd928f1d217346ef7b0d86e91a0#5
domain: LemonElement

http://lodlaundromat.org/.well-known/genid/samples/jena///predicate//92ec2d3e130663ac5e2030d8244a513a/a99c4cd928f1d217346ef7b0d86e91a0#27
subclass of: Thing
type: Class
subclass of: Resource
subclass of: http://lodlaundromat.org/.well-known/genid/samples/jena///predicate//92ec2d3e130663ac5e2030d8244a513a/a99c4cd928f1d217346ef7b0d86e91a0#25
type: Restriction
on property: Edge
min cardinality: 1
subclass of: http://lodlaundromat.org/.well-known/genid/samples/jena///predicate//92ec2d3e130663ac5e2030d8244a513a/a99c4cd928f1d217346ef7b0d86e91a0#5
subclass of: http://lodlaundromat.org/.well-known/genid/samples/jena///predicate//92ec2d3e130663ac5e2030d8244a513a/a99c4cd928f1d217346ef7b0d86e91a0#17

Semantic argument
range: Thing
domain: Thing
label: Semantisch argument @nl
label: Actant sémantique @fr
domain: Lexical sense
type: Property
label: Semantische Argument @de
range: Argument
type: ObjectProperty
label: Argumento semántico @es
comment: Denotes a semantic argument slot of a semantic unit
range: Resource
range: Phrase element
range: http://lodlaundromat.org/.well-known/genid/samples/jena///predicate//92ec2d3e130663ac5e2030d8244a513a/a99c4cd928f1d217346ef7b0d86e91a0#17
range: http://lodlaundromat.org/.well-known/genid/samples/jena///predicate//92ec2d3e130663ac5e2030d8244a513a/a99c4cd928f1d217346ef7b0d86e91a0#5
range: LemonElement
domain: Resource
domain: http://lodlaundromat.org/.well-known/genid/samples/jena///predicate//92ec2d3e130663ac5e2030d8244a513a/a99c4cd928f1d217346ef7b0d86e91a0#18
domain: http://lodlaundromat.org/.well-known/genid/samples/jena///predicate//92ec2d3e130663ac5e2030d8244a513a/a99c4cd928f1d217346ef7b0d86e91a0#17
domain: http://lodlaundromat.org/.well-known/genid/samples/jena///predicate//92ec2d3e130663ac5e2030d8244a513a/a99c4cd928f1d217346ef7b0d86e91a0#5
domain: LemonElement

Lexical Condition
subclass of: Resource
subclass of: Thing
type: Class
label: Лексическое условие @ru
label: Lexikonbedingung @de
label: Lexikaal Voorwaarde @nl
label: Condición léxica @es
label: Condition lexicale @fr
subclass of: LemonElement
comment: An evaluable condition on when a sense applies.
subclass of: http://lodlaundromat.org/.well-known/genid/samples/jena///predicate//92ec2d3e130663ac5e2030d8244a513a/a99c4cd928f1d217346ef7b0d86e91a0#5
subclass of: http://lodlaundromat.org/.well-known/genid/samples/jena///predicate//92ec2d3e130663ac5e2030d8244a513a/a99c4cd928f1d217346ef7b0d86e91a0#17

Alternative reference of
type: InverseFunctionalProperty
range: Thing
domain: Thing
label: Alternatieve referentie van @nl
type: ObjectProperty
comment: The sense of a non-preferred but admissible lexicalization of a given ontology entity
type: Property
sub property of: Reference of
label: Référence alternative de @fr
label: Alternative Referenz von @de
label: Referencia alternativa de @es
range: Lexical sense
range: Resource
range: http://lodlaundromat.org/.well-known/genid/samples/jena///predicate//92ec2d3e130663ac5e2030d8244a513a/a99c4cd928f1d217346ef7b0d86e91a0#17
range: http://lodlaundromat.org/.well-known/genid/samples/jena///predicate//92ec2d3e130663ac5e2030d8244a513a/a99c4cd928f1d217346ef7b0d86e91a0#5
range: LemonElement
range: http://lodlaundromat.org/.well-known/genid/samples/jena///predicate//92ec2d3e130663ac5e2030d8244a513a/a99c4cd928f1d217346ef7b0d86e91a0#18
domain: Resource
domain: http://lodlaundromat.org/.well-known/genid/samples/jena///predicate//92ec2d3e130663ac5e2030d8244a513a/a99c4cd928f1d217346ef7b0d86e91a0#17
domain: http://lodlaundromat.org/.well-known/genid/samples/jena///predicate//92ec2d3e130663ac5e2030d8244a513a/a99c4cd928f1d217346ef7b0d86e91a0#5

ComponentList
subclass of: Resource
subclass of: http://lodlaundromat.org/.well-known/genid/samples/jena///predicate//92ec2d3e130663ac5e2030d8244a513a/a99c4cd928f1d217346ef7b0d86e91a0#8
subclass of: Thing
type: Class
subclass of: List
subclass of: http://lodlaundromat.org/.well-known/genid/samples/jena///predicate//92ec2d3e130663ac5e2030d8244a513a/a99c4cd928f1d217346ef7b0d86e91a0#6
subclass of: http://lodlaundromat.org/.well-known/genid/samples/jena///predicate//92ec2d3e130663ac5e2030d8244a513a/a99c4cd928f1d217346ef7b0d86e91a0#7
subclass of: http://lodlaundromat.org/.well-known/genid/samples/jena///predicate//92ec2d3e130663ac5e2030d8244a513a/a99c4cd928f1d217346ef7b0d86e91a0#13
subclass of: http://lodlaundromat.org/.well-known/genid/samples/jena///predicate//92ec2d3e130663ac5e2030d8244a513a/a99c4cd928f1d217346ef7b0d86e91a0#14
comment: A node within a list of components. This should generally be a blank node,see rdf:List
subclass of: http://lodlaundromat.org/.well-known/genid/samples/jena///predicate//92ec2d3e130663ac5e2030d8244a513a/a99c4cd928f1d217346ef7b0d86e91a0#17
subclass of: http://lodlaundromat.org/.well-known/genid/samples/jena///predicate//92ec2d3e130663ac5e2030d8244a513a/a99c4cd928f1d217346ef7b0d86e91a0#5

Lexicon
subclass of: Thing
subclass of: Resource
subclass of: http://lodlaundromat.org/.well-known/genid/samples/jena///predicate//92ec2d3e130663ac5e2030d8244a513a/a99c4cd928f1d217346ef7b0d86e91a0#2
label: Lexikon @de
subclass of: HasLanguage
label: Лексикон @ru
label: Lexique @fr
disjoint with: Syntactic role marker
label: Lexicón @es
comment: The lexicon object. This object is specific to the given language and/or domain it describes
disjoint with: Property Value
type: Class
disjoint with: Usage Example
subclass of: http://lodlaundromat.org/.well-known/genid/samples/jena///predicate//92ec2d3e130663ac5e2030d8244a513a/a99c4cd928f1d217346ef7b0d86e91a0#24
subclass of: LemonElement
disjoint with: Definition
subclass of: http://lodlaundromat.org/.well-known/genid/samples/jena///predicate//92ec2d3e130663ac5e2030d8244a513a/a99c4cd928f1d217346ef7b0d86e91a0#23
disjoint with: Node
subclass of: HasPattern
subclass of: http://lodlaundromat.org/.well-known/genid/samples/jena///predicate//92ec2d3e130663ac5e2030d8244a513a/a99c4cd928f1d217346ef7b0d86e91a0#17
subclass of: http://lodlaundromat.org/.well-known/genid/samples/jena///predicate//92ec2d3e130663ac5e2030d8244a513a/a99c4cd928f1d217346ef7b0d86e91a0#5
disjoint with: Forma
disjoint with: Frame
disjoint with: Lexical sense
disjoint with: Component
disjoint with: Lexical entry
disjoint with: Argument

http://lodlaundromat.org/.well-known/genid/samples/jena///predicate//92ec2d3e130663ac5e2030d8244a513a/a99c4cd928f1d217346ef7b0d86e91a0#35
subclass of: Resource
subclass of: Thing
type: Class
type: Restriction
on property: Value
min cardinality: 1
subclass of: http://lodlaundromat.org/.well-known/genid/samples/jena///predicate//92ec2d3e130663ac5e2030d8244a513a/a99c4cd928f1d217346ef7b0d86e91a0#31
subclass of: http://lodlaundromat.org/.well-known/genid/samples/jena///predicate//92ec2d3e130663ac5e2030d8244a513a/a99c4cd928f1d217346ef7b0d86e91a0#17
subclass of: http://lodlaundromat.org/.well-known/genid/samples/jena///predicate//92ec2d3e130663ac5e2030d8244a513a/a99c4cd928f1d217346ef7b0d86e91a0#5
equivalent class: http://lodlaundromat.org/.well-known/genid/samples/jena///predicate//92ec2d3e130663ac5e2030d8244a513a/a99c4cd928f1d217346ef7b0d86e91a0#31

Location, Period, or Jurisdiction
subclass of: Resource
Has Version: LocationPeriodOrJurisdiction-001
issued: 2008-01-14
type: Class
comment: A location, period of time, or jurisdiction.
relation: LocationPeriodOrJurisdiction-001
Relation: LocationPeriodOrJurisdiction-001
date: 2008-01-14

Physical Resource
subclass of: Resource
Has Version: PhysicalResource-001
issued: 2008-01-14
type: Class
comment: A material thing.
relation: PhysicalResource-001
Relation: PhysicalResource-001
date: 2008-01-14

Instance of
range: Thing
domain: Thing
comment: Denotes that the single argument of a class predicate is represented in the lexicon by the given semantic argument. That is Class(?x) or ?x rdf:type Class
type: Property
sub property of: Semantic argument
label: Instancia de @es
type: ObjectProperty
label: Instantie van @nl
range: Argument
domain: Lexical sense
label: Instance de @fr
label: Instanz von @de
range: Resource
range: http://lodlaundromat.org/.well-known/genid/samples/jena///predicate//92ec2d3e130663ac5e2030d8244a513a/a99c4cd928f1d217346ef7b0d86e91a0#17
range: http://lodlaundromat.org/.well-known/genid/samples/jena///predicate//92ec2d3e130663ac5e2030d8244a513a/a99c4cd928f1d217346ef7b0d86e91a0#5
range: LemonElement
range: Phrase element
domain: Resource
domain: http://lodlaundromat.org/.well-known/genid/samples/jena///predicate//92ec2d3e130663ac5e2030d8244a513a/a99c4cd928f1d217346ef7b0d86e91a0#17
domain: http://lodlaundromat.org/.well-known/genid/samples/jena///predicate//92ec2d3e130663ac5e2030d8244a513a/a99c4cd928f1d217346ef7b0d86e91a0#5
domain: LemonElement
domain: http://lodlaundromat.org/.well-known/genid/samples/jena///predicate//92ec2d3e130663ac5e2030d8244a513a/a99c4cd928f1d217346ef7b0d86e91a0#18

http://lodlaundromat.org/.well-known/genid/samples/jena///predicate//92ec2d3e130663ac5e2030d8244a513a/a99c4cd928f1d217346ef7b0d86e91a0#22
type: Class
subclass of: http://lodlaundromat.org/.well-known/genid/samples/jena///predicate//92ec2d3e130663ac5e2030d8244a513a/a99c4cd928f1d217346ef7b0d86e91a0#18
subclass of: Resource
subclass of: Thing
type: Restriction
on property: Reference
cardinality: 1
subclass of: http://lodlaundromat.org/.well-known/genid/samples/jena///predicate//92ec2d3e130663ac5e2030d8244a513a/a99c4cd928f1d217346ef7b0d86e91a0#5
subclass of: http://lodlaundromat.org/.well-known/genid/samples/jena///predicate//92ec2d3e130663ac5e2030d8244a513a/a99c4cd928f1d217346ef7b0d86e91a0#17

Frequency
subclass of: Resource
Has Version: Frequency-001
issued: 2008-01-14
type: Class
comment: A rate at which something recurs.
relation: Frequency-001
Relation: Frequency-001
date: 2008-01-14

http://lodlaundromat.org/.well-known/genid/samples/jena///predicate//92ec2d3e130663ac5e2030d8244a513a/a99c4cd928f1d217346ef7b0d86e91a0#6
subclass of: Thing
subclass of: Resource
type: Class
type: Restriction
on property: rest
cardinality: 1
subclass of: http://lodlaundromat.org/.well-known/genid/samples/jena///predicate//92ec2d3e130663ac5e2030d8244a513a/a99c4cd928f1d217346ef7b0d86e91a0#17
subclass of: http://lodlaundromat.org/.well-known/genid/samples/jena///predicate//92ec2d3e130663ac5e2030d8244a513a/a99c4cd928f1d217346ef7b0d86e91a0#5

http://lodlaundromat.org/.well-known/genid/samples/jena///predicate//92ec2d3e130663ac5e2030d8244a513a/a99c4cd928f1d217346ef7b0d86e91a0#30
subclass of: Thing
subclass of: Resource
type: Class
type: Restriction
on property: Decomposition
min cardinality: 1
subclass of: http://lodlaundromat.org/.well-known/genid/samples/jena///predicate//92ec2d3e130663ac5e2030d8244a513a/a99c4cd928f1d217346ef7b0d86e91a0#17
subclass of: http://lodlaundromat.org/.well-known/genid/samples/jena///predicate//92ec2d3e130663ac5e2030d8244a513a/a99c4cd928f1d217346ef7b0d86e91a0#5

Instructional Method
description: Instructional Method will typically include ways of presenting instructional materials or conducting instructional activities, patterns of learner-to-learner and learner-to-instructor interactions, and mechanisms by which group and individual levels of learning are measured. Instructional methods include all aspects of the instruction and learning processes from planning and implementation through evaluation and feedback.
Has Version: instructionalMethod-002
issued: 2005-06-13
Date Modified: 2008-01-14
type: Property
comment: A process, used to engender knowledge, attitudes and skills, that the described resource is designed to support.
range: Method of Instruction
relation: instructionalMethod-002
Relation: instructionalMethod-002
date: 2008-01-14
date: 2005-06-13
range: Resource

Date Accepted
Date Modified: 2008-01-14
range: Literal
sub property of: date
comment: Date of acceptance of the resource.
type: Property
description: Examples of resources to which a Date Accepted may be relevant are a thesis (accepted by a university department) or an article (accepted by a journal).
Has Version: dateAccepted-002
sub property of: Date
issued: 2002-07-13
relation: dateAccepted-002
Relation: dateAccepted-002
date: 2008-01-14
date: 2002-07-13
range: Resource

Access Rights
range: Rights Statement
type: Property
issued: 2003-02-15
comment: Information about who can access the resource or an indication of its security status.
description: Access Rights may include information regarding access or restrictions based on privacy, security, or other policies.
sub property of: rights
sub property of: Rights
Date Modified: 2008-01-14
Has Version: accessRights-002
relation: accessRights-002
Relation: accessRights-002
date: 2008-01-14
date: 2003-02-15
range: Resource

UDC
Has Version: UDC-003
issued: 2000-07-11
Date Modified: 2008-01-14
type: VocabularyEncodingScheme
comment: The set of conceptual resources specified by the Universal Decimal Classification.
relation: UDC-003
Relation: UDC-003
date: 2008-01-14
date: 2000-07-11

LCC
Has Version: LCC-003
issued: 2000-07-11
Date Modified: 2008-01-14
type: VocabularyEncodingScheme
comment: The set of conceptual resources specified by the Library of Congress Classification.
relation: LCC-003
Relation: LCC-003
date: 2008-01-14
date: 2000-07-11

Bibliographic Citation
Has Version: bibliographicCitation-002
description: Recommended practice is to include sufficient bibliographic detail to identify the resource as unambiguously as possible.
range: Literal
domain: Bibliographic Resource
comment: A bibliographic reference for the resource.
type: Property
sub property of: identifier
issued: 2003-02-15
Date Modified: 2008-01-14
sub property of: Identifier
relation: bibliographicCitation-002
Relation: bibliographicCitation-002
date: 2008-01-14
date: 2003-02-15
range: Resource
domain: Resource

ISO 3166
Has Version: ISO3166-004
issued: 2000-07-11
Date Modified: 2008-01-14
type: Datatype
comment: The set of codes listed in ISO 3166-1 for the representation of names of countries.
relation: ISO3166-004
Relation: ISO3166-004
date: 2008-01-14
date: 2000-07-11
type: Class

W3C-DTF
Has Version: W3CDTF-003
issued: 2000-07-11
Date Modified: 2008-01-14
type: Datatype
comment: The set of dates and times constructed according to the W3C Date and Time Formats Specification.
relation: W3CDTF-003
Relation: W3CDTF-003
date: 2008-01-14
date: 2000-07-11
type: Class

Audience
Has Version: audience-003
issued: 2001-05-21
Date Modified: 2008-01-14
type: Property
comment: A class of entity for whom the resource is intended or useful.
range: Agent Class
relation: audience-003
Relation: audience-003
date: 2008-01-14
date: 2001-05-21
range: Resource
range: Class

Rights Holder
Has Version: rightsHolder-002
issued: 2004-06-14
Date Modified: 2008-01-14
type: Property
comment: A person or organization owning or managing rights over the resource.
range: Agent
relation: rightsHolder-002
Relation: rightsHolder-002
date: 2008-01-14
date: 2004-06-14
range: Resource

License
comment: A legal document giving official permission to do something with the resource.
type: Property
range: License Document
sub property of: rights
issued: 2004-06-14
Date Modified: 2008-01-14
Has Version: license-002
sub property of: Rights
relation: license-002
Relation: license-002
date: 2008-01-14
date: 2004-06-14
range: Rights Statement
range: Resource

Mediator
type: Property
range: Agent Class
issued: 2001-05-21
Has Version: mediator-003
Date Modified: 2008-01-14
comment: An entity that mediates access to the resource and for whom the resource is intended or useful.
description: In an educational context, a mediator might be a parent, teacher, teaching assistant, or care-giver.
sub property of: Audience
relation: mediator-003
Relation: mediator-003
date: 2008-01-14
date: 2001-05-21
range: Resource
range: Class

Representation
type: DatatypeProperty
label: Voorstelling @nl
domain: Forma
range: string
type: Property
label: Darstellung @de
label: Representación @es
comment: A realisation of a given form
label: Représentation @fr
range: Resource
domain: http://lodlaundromat.org/.well-known/genid/samples/jena///predicate//92ec2d3e130663ac5e2030d8244a513a/a99c4cd928f1d217346ef7b0d86e91a0#15
domain: Resource
domain: Thing
domain: http://lodlaundromat.org/.well-known/genid/samples/jena///predicate//92ec2d3e130663ac5e2030d8244a513a/a99c4cd928f1d217346ef7b0d86e91a0#17
domain: http://lodlaundromat.org/.well-known/genid/samples/jena///predicate//92ec2d3e130663ac5e2030d8244a513a/a99c4cd928f1d217346ef7b0d86e91a0#5
domain: LemonElement

Has Version
Has Version: hasVersion-003
sub property of: relation
comment: A related resource that is a version, edition, or adaptation of the described resource.
Date Modified: 2008-01-14
note: This term is intended to be used with non-literal values as defined in the DCMI Abstract Model (http://dublincore.org/documents/abstract-model/). As of December 2007, the DCMI Usage Board is seeking a way to express this intention with a formal range declaration.
issued: 2000-07-11
type: Property
sub property of: Relation
relation: hasVersion-003
Relation: hasVersion-003
date: 2008-01-14
date: 2000-07-11

NLM
Has Version: NLM-002
issued: 2005-06-13
Date Modified: 2008-01-14
type: VocabularyEncodingScheme
comment: The set of conceptual resources specified by the National Library of Medicine Classification.
relation: NLM-002
Relation: NLM-002
date: 2008-01-14
date: 2005-06-13

Date Valid
type: Property
range: Literal
issued: 2000-07-11
sub property of: date
comment: Date (often a range) of validity of a resource.
Date Modified: 2008-01-14
sub property of: Date
Has Version: valid-003
relation: valid-003
Relation: valid-003
date: 2008-01-14
date: 2000-07-11
range: Resource

Requires
Has Version: requires-003
type: Property
comment: A related resource that is required by the described resource to support its function, delivery, or coherence.
issued: 2000-07-11
sub property of: relation
note: This term is intended to be used with non-literal values as defined in the DCMI Abstract Model (http://dublincore.org/documents/abstract-model/). As of December 2007, the DCMI Usage Board is seeking a way to express this intention with a formal range declaration.
Date Modified: 2008-01-14
sub property of: Relation
relation: requires-003
Relation: requires-003
date: 2008-01-14
date: 2000-07-11

Optional
type: DatatypeProperty
label: Optionele @nl
comment: Denotes that the syntactic argument is optional (may be omitted)
label: Optionnel @fr
domain: Argument
type: Property
range: boolean
label: Opcional @es
range: Resource
domain: Resource
domain: Phrase element
domain: Thing
domain: http://lodlaundromat.org/.well-known/genid/samples/jena///predicate//92ec2d3e130663ac5e2030d8244a513a/a99c4cd928f1d217346ef7b0d86e91a0#17
domain: http://lodlaundromat.org/.well-known/genid/samples/jena///predicate//92ec2d3e130663ac5e2030d8244a513a/a99c4cd928f1d217346ef7b0d86e91a0#5
domain: LemonElement

Replaces
Has Version: replaces-003
note: This term is intended to be used with non-literal values as defined in the DCMI Abstract Model (http://dublincore.org/documents/abstract-model/). As of December 2007, the DCMI Usage Board is seeking a way to express this intention with a formal range declaration.
Date Modified: 2008-01-14
comment: A related resource that is supplanted, displaced, or superseded by the described resource.
sub property of: relation
sub property of: Relation
type: Property
issued: 2000-07-11
relation: replaces-003
Relation: replaces-003
date: 2008-01-14
date: 2000-07-11

MeSH
Has Version: MESH-003
issued: 2000-07-11
Date Modified: 2008-01-14
type: VocabularyEncodingScheme
comment: The set of labeled concepts specified by the Medical Subject Headings.
relation: MESH-003
Relation: MESH-003
date: 2008-01-14
date: 2000-07-11

Is Version Of
note: This term is intended to be used with non-literal values as defined in the DCMI Abstract Model (http://dublincore.org/documents/abstract-model/). As of December 2007, the DCMI Usage Board is seeking a way to express this intention with a formal range declaration.
Has Version: isVersionOf-003
sub property of: Relation
type: Property
sub property of: relation
comment: A related resource of which the described resource is a version, edition, or adaptation.
issued: 2000-07-11
description: Changes in version imply substantive changes in content rather than differences in format.
Date Modified: 2008-01-14
relation: isVersionOf-003
Relation: isVersionOf-003
date: 2008-01-14
date: 2000-07-11

Audience Education Level
Has Version: educationLevel-002
issued: 2002-07-13
Date Modified: 2008-01-14
type: Property
comment: A class of entity, defined in terms of progression through an educational or training context, for which the described resource is intended.
range: Agent Class
sub property of: Audience
relation: educationLevel-002
Relation: educationLevel-002
date: 2008-01-14
date: 2002-07-13
range: Resource
range: Class

Coverage
issued: 2008-01-14
comment: The spatial or temporal topic of the resource, the spatial applicability of the resource, or the jurisdiction under which the resource is relevant.
Has Version: coverageT-001
Date Modified: 2008-01-14
sub property of: coverage
type: Property
range: Location, Period, or Jurisdiction
description: Spatial topic and spatial applicability may be a named place or a location specified by its geographic coordinates. Temporal topic may be a named period, date, or date range. A jurisdiction may be a named administrative entity or a geographic place to which the resource applies. Recommended best practice is to use a controlled vocabulary such as the Thesaurus of Geographic Names [TGN]. Where appropriate, named places or time periods can be used in preference to numeric identifiers such as sets of coordinates or date ranges.
relation: coverageT-001
Relation: coverageT-001
date: 2008-01-14
range: Resource

DCMI Point
Has Version: Point-003
issued: 2000-07-11
Date Modified: 2008-01-14
type: Datatype
comment: The set of points in space defined by their geographic coordinates according to the DCMI Point Encoding Scheme.
relation: Point-003
Relation: Point-003
date: 2008-01-14
date: 2000-07-11
type: Class

Identifier
sub property of: identifier
range: Literal
Has Version: identifierT-001
description: Recommended best practice is to identify the resource by means of a string conforming to a formal identification system.
issued: 2008-01-14
type: Property
comment: An unambiguous reference to the resource within a given context.
Date Modified: 2008-01-14
relation: identifierT-001
Relation: identifierT-001
date: 2008-01-14
range: Resource

Date Created
sub property of: date
range: Literal
Date Modified: 2008-01-14
comment: Date of creation of the resource.
type: Property
Has Version: created-003
issued: 2000-07-11
sub property of: Date
relation: created-003
Relation: created-003
date: 2008-01-14
date: 2000-07-11
range: Resource

Provenance
description: The statement may include a description of any changes successive custodians made to the resource.
Has Version: provenance-002
issued: 2004-09-20
Date Modified: 2008-01-14
type: Property
comment: A statement of any changes in ownership and custody of the resource since its creation that are significant for its authenticity, integrity, and interpretation.
range: Provenance Statement
relation: provenance-002
Relation: provenance-002
date: 2008-01-14
date: 2004-09-20
range: Resource

DCMI Metadata Terms - other
Date Modified: 2012-06-14
publisher: DCMI
date: 2012-06-14

Format
Has Version: formatT-001
type: Property
description: Examples of dimensions include size and duration. Recommended best practice is to use a controlled vocabulary such as the list of Internet Media Types [MIME].
Date Modified: 2008-01-14
comment: The file format, physical medium, or dimensions of the resource.
issued: 2008-01-14
sub property of: format
range: Media Type or Extent
relation: formatT-001
Relation: formatT-001
date: 2008-01-14
range: Resource

Spatial Coverage
type: Property
range: Location
comment: Spatial characteristics of the resource.
issued: 2000-07-11
Date Modified: 2008-01-14
Has Version: spatial-003
sub property of: Coverage
sub property of: coverage
relation: spatial-003
Relation: spatial-003
date: 2008-01-14
date: 2000-07-11
range: Location, Period, or Jurisdiction
range: Resource

ISO 639-2
Has Version: ISO639-2-003
issued: 2000-07-11
Date Modified: 2008-01-14
type: Datatype
comment: The three-letter alphabetic codes listed in ISO639-2 for the representation of names of languages.
relation: ISO639-2-003
Relation: ISO639-2-003
date: 2008-01-14
date: 2000-07-11
type: Class

lemon
type: Ontology
comment: Lemon: The lexicon model for ontologies is designed to allow for descriptions of lexical information regarding ontological elements and other RDF resources. Lemon covers mapping of lexical decomposition, phrase structure, syntax, variation, morphology, and lexicon-ontology mapping.

Is Format Of
Has Version: isFormatOf-003
Date Modified: 2008-01-14
issued: 2000-07-11
sub property of: relation
type: Property
note: This term is intended to be used with non-literal values as defined in the DCMI Abstract Model (http://dublincore.org/documents/abstract-model/). As of December 2007, the DCMI Usage Board is seeking a way to express this intention with a formal range declaration.
sub property of: Relation
comment: A related resource that is substantially the same as the described resource, but in another format.
relation: isFormatOf-003
Relation: isFormatOf-003
date: 2008-01-14
date: 2000-07-11

Alternative Title
sub property of: Title
sub property of: title
type: Property
Date Modified: 2010-10-11
range: Literal
issued: 2000-07-11
description: The distinction between titles and alternative titles is application-specific.
Has Version: alternative-003
comment: An alternative name for the resource.
relation: alternative-003
Relation: alternative-003
date: 2010-10-11
date: 2000-07-11
range: Resource

Language
Date Modified: 2008-01-14
type: Property
Has Version: languageT-001
sub property of: language
description: Recommended best practice is to use a controlled vocabulary such as RFC 4646 [RFC4646].
issued: 2008-01-14
comment: A language of the resource.
range: Linguistic System
relation: languageT-001
Relation: languageT-001
date: 2008-01-14
range: Resource

Date
issued: 2008-01-14
comment: A point or period of time associated with an event in the lifecycle of the resource.
description: Date may be used to express temporal information at any level of granularity. Recommended best practice is to use an encoding scheme, such as the W3CDTF profile of ISO 8601 [W3CDTF].
Has Version: dateT-001
Date Modified: 2008-01-14
type: Property
range: Literal
sub property of: date
relation: dateT-001
Relation: dateT-001
date: 2008-01-14
range: Resource

untended
type: Forma
type: Thing
type: http://lodlaundromat.org/.well-known/genid/samples/jena///predicate//92ec2d3e130663ac5e2030d8244a513a/a99c4cd928f1d217346ef7b0d86e91a0#15
type: LemonElement
Representation: untended @eng
type: http://lodlaundromat.org/.well-known/genid/samples/jena///predicate//92ec2d3e130663ac5e2030d8244a513a/a99c4cd928f1d217346ef7b0d86e91a0#5
type: http://lodlaundromat.org/.well-known/genid/samples/jena///predicate//92ec2d3e130663ac5e2030d8244a513a/a99c4cd928f1d217346ef7b0d86e91a0#17
different from: WN Sense 0
different from: WN LexicalEntry 0

Temporal Coverage
sub property of: Coverage
Has Version: temporal-003
type: Property
issued: 2000-07-11
Date Modified: 2008-01-14
range: Period of Time
comment: Temporal characteristics of the resource.
sub property of: coverage
relation: temporal-003
Relation: temporal-003
date: 2008-01-14
date: 2000-07-11
range: Location, Period, or Jurisdiction
range: Resource

Abstract
Has Version: abstract-003
issued: 2000-07-11
Date Modified: 2008-01-14
type: Property
comment: A summary of the resource.
sub property of: description
sub property of: Description
relation: abstract-003
Relation: abstract-003
date: 2008-01-14
date: 2000-07-11

Is Part Of
issued: 2000-07-11
type: Property
sub property of: relation
sub property of: Relation
Date Modified: 2008-01-14
note: This term is intended to be used with non-literal values as defined in the DCMI Abstract Model (http://dublincore.org/documents/abstract-model/). As of December 2007, the DCMI Usage Board is seeking a way to express this intention with a formal range declaration.
Has Version: isPartOf-003
comment: A related resource in which the described resource is physically or logically included.
relation: isPartOf-003
Relation: isPartOf-003
date: 2008-01-14
date: 2000-07-11

RFC 5646
description: RFC 5646 obsoletes RFC 4646.
Has Version: RFC5646-001
issued: 2010-10-11
type: Datatype
comment: The set of tags constructed according to RFC 5646 for the identification of languages.
relation: RFC5646-001
Relation: RFC5646-001
date: 2010-10-11
type: Class

Rule
type: Property
type: DatatypeProperty
label: Regel @de
label: Regla @es
label: Règle @fr
domain: Morphological Transform
range: string
range: Resource
domain: Resource
domain: Thing
domain: http://lodlaundromat.org/.well-known/genid/samples/jena///predicate//92ec2d3e130663ac5e2030d8244a513a/a99c4cd928f1d217346ef7b0d86e91a0#17
domain: http://lodlaundromat.org/.well-known/genid/samples/jena///predicate//92ec2d3e130663ac5e2030d8244a513a/a99c4cd928f1d217346ef7b0d86e91a0#5
domain: LemonElement

RFC 1766
Has Version: RFC1766-003
issued: 2000-07-11
Date Modified: 2008-01-14
type: Datatype
comment: The set of tags, constructed according to RFC 1766, for the identification of languages.
relation: RFC1766-003
Relation: RFC1766-003
date: 2008-01-14
date: 2000-07-11
type: Class

Date Submitted
sub property of: date
type: Property
range: Literal
comment: Date of submission of the resource.
sub property of: Date
Date Modified: 2008-01-14
issued: 2002-07-13
description: Examples of resources to which a Date Submitted may be relevant are a thesis (submitted to a university department) or an article (submitted to a journal).
Has Version: dateSubmitted-002
relation: dateSubmitted-002
Relation: dateSubmitted-002
date: 2008-01-14
date: 2002-07-13
range: Resource

LCSH
Has Version: LCSH-003
issued: 2000-07-11
Date Modified: 2008-01-14
type: VocabularyEncodingScheme
comment: The set of labeled concepts specified by the Library of Congress Subject Headings.
relation: LCSH-003
Relation: LCSH-003
date: 2008-01-14
date: 2000-07-11

IMT
Has Version: IMT-004
issued: 2000-07-11
Date Modified: 2008-01-14
type: VocabularyEncodingScheme
comment: The set of media types specified by the Internet Assigned Numbers Authority.
relation: IMT-004
Relation: IMT-004
date: 2008-01-14
date: 2000-07-11

Relation
note: This term is intended to be used with non-literal values as defined in the DCMI Abstract Model (http://dublincore.org/documents/abstract-model/). As of December 2007, the DCMI Usage Board is seeking a way to express this intention with a formal range declaration.
comment: A related resource.
description: Recommended best practice is to identify the related resource by means of a string conforming to a formal identification system.
Has Version: relationT-001
type: Property
sub property of: relation
issued: 2008-01-14
Date Modified: 2008-01-14
relation: relationT-001
Relation: relationT-001
date: 2008-01-14

Title
Has Version: titleT-002
issued: 2008-01-14
Date Modified: 2010-10-11
type: Property
comment: A name given to the resource.
range: Literal
sub property of: title
relation: titleT-002
Relation: titleT-002
date: 2010-10-11
date: 2008-01-14
range: Resource

DCMI Box
Has Version: Box-003
issued: 2000-07-11
Date Modified: 2008-01-14
type: Datatype
comment: The set of regions in space defined by their geographic coordinates according to the DCMI Box Encoding Scheme.
relation: Box-003
Relation: Box-003
date: 2008-01-14
date: 2000-07-11
type: Class

Medium
range: Physical Medium
comment: The material or physical carrier of the resource.
domain: Physical Resource
issued: 2000-07-11
type: Property
Has Version: medium-003
sub property of: Format
Date Modified: 2008-01-14
sub property of: format
relation: medium-003
Relation: medium-003
date: 2008-01-14
date: 2000-07-11
range: Media Type or Extent
range: Resource
range: Media Type
domain: Resource

Subject
Has Version: subjectT-002
Date Modified: 2012-06-14
description: Typically, the subject will be represented using keywords, key phrases, or classification codes. Recommended best practice is to use a controlled vocabulary.
issued: 2008-01-14
sub property of: subject
type: Property
note: This term is intended to be used with non-literal values as defined in the DCMI Abstract Model (http://dublincore.org/documents/abstract-model/). As of December 2007, the DCMI Usage Board is seeking a way to express this intention with a formal range declaration.
comment: The topic of the resource.
relation: subjectT-002
Relation: subjectT-002
date: 2012-06-14
date: 2008-01-14

Type
Has Version: typeT-001
sub property of: type
description: Recommended best practice is to use a controlled vocabulary such as the DCMI Type Vocabulary [DCMITYPE]. To describe the file format, physical medium, or dimensions of the resource, use the Format element.
Date Modified: 2008-01-14
range: Class
type: Property
comment: The nature or genre of the resource.
issued: 2008-01-14
relation: typeT-001
Relation: typeT-001
date: 2008-01-14
range: Resource

Date Modified
Date Modified: 2008-01-14
sub property of: Date
type: Property
range: Literal
issued: 2000-07-11
sub property of: date
comment: Date on which the resource was changed.
Has Version: modified-003
relation: modified-003
Relation: modified-003
date: 2008-01-14
date: 2000-07-11
range: Resource

URI
Has Version: URI-003
issued: 2000-07-11
Date Modified: 2008-01-14
type: Datatype
comment: The set of identifiers constructed according to the generic syntax for Uniform Resource Identifiers as specified by the Internet Engineering Task Force.
relation: URI-003
Relation: URI-003
date: 2008-01-14
date: 2000-07-11
type: Class

TGN
Has Version: TGN-003
issued: 2000-07-11
Date Modified: 2008-01-14
type: VocabularyEncodingScheme
comment: The set of places specified by the Getty Thesaurus of Geographic Names.
relation: TGN-003
Relation: TGN-003
date: 2008-01-14
date: 2000-07-11

Conforms To
issued: 2001-05-21
Date Modified: 2008-01-14
range: Standard
sub property of: relation
comment: An established standard to which the described resource conforms.
Has Version: conformsTo-003
sub property of: Relation
type: Property
relation: conformsTo-003
Relation: conformsTo-003
date: 2008-01-14
date: 2001-05-21
range: Resource

Rights
range: Rights Statement
issued: 2008-01-14
description: Typically, rights information includes a statement about various property rights associated with the resource, including intellectual property rights.
comment: Information about rights held in and over the resource.
Date Modified: 2008-01-14
type: Property
Has Version: rightsT-001
sub property of: rights
relation: rightsT-001
Relation: rightsT-001
date: 2008-01-14
range: Resource

RFC 3066
description: RFC 3066 has been obsoleted by RFC 4646.
Has Version: RFC3066-002
issued: 2002-07-13
Date Modified: 2008-01-14
type: Datatype
comment: The set of tags constructed according to RFC 3066 for the identification of languages.
relation: RFC3066-002
Relation: RFC3066-002
date: 2008-01-14
date: 2002-07-13
type: Class

Written representation
range: string
comment: Gives the written representation of a given form
sub property of: Representation
label: Schriftliche Darstellung @de
label: Représentation écrite @fr
label: Schriftelijke voorstelling @nl
type: DatatypeProperty
domain: Forma
type: Property
label: Representación escrita @es
range: Resource
domain: Resource
domain: Thing
domain: LemonElement
domain: http://lodlaundromat.org/.well-known/genid/samples/jena///predicate//92ec2d3e130663ac5e2030d8244a513a/a99c4cd928f1d217346ef7b0d86e91a0#15
domain: http://lodlaundromat.org/.well-known/genid/samples/jena///predicate//92ec2d3e130663ac5e2030d8244a513a/a99c4cd928f1d217346ef7b0d86e91a0#17
domain: http://lodlaundromat.org/.well-known/genid/samples/jena///predicate//92ec2d3e130663ac5e2030d8244a513a/a99c4cd928f1d217346ef7b0d86e91a0#5

Accrual Policy
Has Version: accrualPolicy-003
issued: 2005-06-13
Date Modified: 2010-10-11
type: Property
comment: The policy governing the addition of items to a collection.
domain: Collection
range: Policy
relation: accrualPolicy-003
Relation: accrualPolicy-003
date: 2010-10-11
date: 2005-06-13
range: Resource
domain: Resource

DCMI Period
Has Version: Period-003
issued: 2000-07-11
Date Modified: 2008-01-14
type: Datatype
comment: The set of time intervals defined by their limits according to the DCMI Period Encoding Scheme.
relation: Period-003
Relation: Period-003
date: 2008-01-14
date: 2000-07-11
type: Class

DDC
Has Version: DDC-003
issued: 2000-07-11
Date Modified: 2008-01-14
type: VocabularyEncodingScheme
comment: The set of conceptual resources specified by the Dewey Decimal Classification.
relation: DDC-003
Relation: DDC-003
date: 2008-01-14
date: 2000-07-11

Has Part
type: Property
Date Modified: 2008-01-14
issued: 2000-07-11
comment: A related resource that is included either physically or logically in the described resource.
note: This term is intended to be used with non-literal values as defined in the DCMI Abstract Model (http://dublincore.org/documents/abstract-model/). As of December 2007, the DCMI Usage Board is seeking a way to express this intention with a formal range declaration.
sub property of: relation
Has Version: hasPart-003
sub property of: Relation
relation: hasPart-003
Relation: hasPart-003
date: 2008-01-14
date: 2000-07-11

Language
label: Lengua @es
type: DatatypeProperty
label: Langue @fr
label: Taal @nl
comment: The language of a given lexicon. This should be some ISO-639 string
type: Property
range: string
domain: HasLanguage
label: Sprache @de
range: Resource
domain: Resource
domain: Thing
domain: http://lodlaundromat.org/.well-known/genid/samples/jena///predicate//92ec2d3e130663ac5e2030d8244a513a/a99c4cd928f1d217346ef7b0d86e91a0#17
domain: http://lodlaundromat.org/.well-known/genid/samples/jena///predicate//92ec2d3e130663ac5e2030d8244a513a/a99c4cd928f1d217346ef7b0d86e91a0#5
domain: LemonElement

Accrual Periodicity
Has Version: accrualPeriodicity-003
issued: 2005-06-13
Date Modified: 2010-10-11
type: Property
comment: The frequency with which items are added to a collection.
domain: Collection
range: Frequency
relation: accrualPeriodicity-003
Relation: accrualPeriodicity-003
date: 2010-10-11
date: 2005-06-13
range: Resource
domain: Resource

ISO 639-3
Has Version: ISO639-3-001
issued: 2008-01-14
type: Datatype
comment: The set of three-letter codes listed in ISO 639-3 for the representation of names of languages.
relation: ISO639-3-001
Relation: ISO639-3-001
date: 2008-01-14
type: Class

Is Required By
comment: A related resource that requires the described resource to support its function, delivery, or coherence.
type: Property
Date Modified: 2008-01-14
sub property of: relation
note: This term is intended to be used with non-literal values as defined in the DCMI Abstract Model (http://dublincore.org/documents/abstract-model/). As of December 2007, the DCMI Usage Board is seeking a way to express this intention with a formal range declaration.
Has Version: isRequiredBy-003
issued: 2000-07-11
sub property of: Relation
relation: isRequiredBy-003
Relation: isRequiredBy-003
date: 2008-01-14
date: 2000-07-11

Description
description: Description may include but is not limited to: an abstract, a table of contents, a graphical representation, or a free-text account of the resource.
Has Version: descriptionT-001
issued: 2008-01-14
Date Modified: 2008-01-14
type: Property
comment: An account of the resource.
sub property of: description
relation: descriptionT-001
Relation: descriptionT-001
date: 2008-01-14

Has Format
issued: 2000-07-11
Date Modified: 2008-01-14
type: Property
comment: A related resource that is substantially the same as the pre-existing described resource, but in another format.
Has Version: hasFormat-003
sub property of: Relation
note: This term is intended to be used with non-literal values as defined in the DCMI Abstract Model (http://dublincore.org/documents/abstract-model/). As of December 2007, the DCMI Usage Board is seeking a way to express this intention with a formal range declaration.
sub property of: relation
relation: hasFormat-003
Relation: hasFormat-003
date: 2008-01-14
date: 2000-07-11

Value
type: Property
type: DatatypeProperty
label: Wert @de
label: Valor @es
label: Valeur @fr
label: Waarde @nl
comment: This indicates the value of a pseudo-data node. An example of this is definition where the value would generally be a string but it would not be possible to add further annotations, such as source or creation date.

Date Available
comment: Date (often a range) that the resource became or will become available.
issued: 2000-07-11
Has Version: available-003
sub property of: date
Date Modified: 2008-01-14
type: Property
sub property of: Date
range: Literal
relation: available-003
Relation: available-003
date: 2008-01-14
date: 2000-07-11
range: Resource

RFC 4646
description: RFC 4646 obsoletes RFC 3066.
Has Version: RFC4646-001
issued: 2008-01-14
type: Datatype
comment: The set of tags constructed according to RFC 4646 for the identification of languages.
relation: RFC4646-001
Relation: RFC4646-001
date: 2008-01-14
type: Class

Is Replaced By
type: Property
sub property of: relation
note: This term is intended to be used with non-literal values as defined in the DCMI Abstract Model (http://dublincore.org/documents/abstract-model/). As of December 2007, the DCMI Usage Board is seeking a way to express this intention with a formal range declaration.
Date Modified: 2008-01-14
issued: 2000-07-11
sub property of: Relation
Has Version: isReplacedBy-003
comment: A related resource that supplants, displaces, or supersedes the described resource.
relation: isReplacedBy-003
Relation: isReplacedBy-003
date: 2008-01-14
date: 2000-07-11

Table Of Contents
Has Version: tableOfContents-003
issued: 2000-07-11
Date Modified: 2008-01-14
type: Property
comment: A list of subunits of the resource.
sub property of: description
sub property of: Description
relation: tableOfContents-003
Relation: tableOfContents-003
date: 2008-01-14
date: 2000-07-11

Separador
type: Property
type: DatatypeProperty
label: Afscheider @nl
comment: Indicates the graphical element used to seperate the subnodes of this phrase structure. It is generally recommended that you use a string value with the language tag used to indicate script, (i.e., using ISO-15924 codes, such as "Latn"), as orthographic features may change with script.
domain: Node
label: Separator
range: string
label: Séparateur @fr
range: Resource
domain: http://lodlaundromat.org/.well-known/genid/samples/jena///predicate//92ec2d3e130663ac5e2030d8244a513a/a99c4cd928f1d217346ef7b0d86e91a0#25
domain: Resource
domain: Thing
domain: http://lodlaundromat.org/.well-known/genid/samples/jena///predicate//92ec2d3e130663ac5e2030d8244a513a/a99c4cd928f1d217346ef7b0d86e91a0#17
domain: http://lodlaundromat.org/.well-known/genid/samples/jena///predicate//92ec2d3e130663ac5e2030d8244a513a/a99c4cd928f1d217346ef7b0d86e91a0#5
domain: LemonElement

Publisher
Date Modified: 2010-10-11
issued: 2008-01-14
range: Agent
comment: An entity responsible for making the resource available.
Has Version: publisherT-001
type: Property
description: Examples of a Publisher include a person, an organization, or a service.
sub property of: publisher
relation: publisherT-001
Relation: publisherT-001
date: 2010-10-11
date: 2008-01-14
range: Resource

DCMI Type Vocabulary
Has Version: DCMIType-005
issued: 2000-07-11
Date Modified: 2012-06-14
type: VocabularyEncodingScheme
comment: The set of classes specified by the DCMI Type Vocabulary, used to categorize the nature or genre of the resource.
relation: DCMIType-005
Relation: DCMIType-005
date: 2012-06-14
date: 2000-07-11

Extent
type: Property
comment: The size or duration of the resource.
issued: 2000-07-11
range: Size or Duration
Has Version: extent-003
Date Modified: 2008-01-14
sub property of: format
sub property of: Format
relation: extent-003
Relation: extent-003
date: 2008-01-14
date: 2000-07-11
range: Media Type or Extent
range: Resource

Accrual Method
Has Version: accrualMethod-003
issued: 2005-06-13
Date Modified: 2010-10-11
type: Property
comment: The method by which items are added to a collection.
domain: Collection
range: Method of Accrual
relation: accrualMethod-003
Relation: accrualMethod-003
date: 2010-10-11
date: 2005-06-13
range: Resource
domain: Resource

References
type: Property
note: This term is intended to be used with non-literal values as defined in the DCMI Abstract Model (http://dublincore.org/documents/abstract-model/). As of December 2007, the DCMI Usage Board is seeking a way to express this intention with a formal range declaration.
issued: 2000-07-11
Date Modified: 2008-01-14
sub property of: relation
Has Version: references-003
sub property of: Relation
comment: A related resource that is referenced, cited, or otherwise pointed to by the described resource.
relation: references-003
Relation: references-003
date: 2008-01-14
date: 2000-07-11

Contributor
comment: An entity responsible for making contributions to the resource.
description: Examples of a Contributor include a person, an organization, or a service.
type: Property
Date Modified: 2010-10-11
issued: 2008-01-14
sub property of: contributor
range: Agent
Has Version: contributorT-001
relation: contributorT-001
Relation: contributorT-001
date: 2010-10-11
date: 2008-01-14
range: Resource

Date Copyrighted
range: Literal
type: Property
sub property of: Date
comment: Date of copyright.
sub property of: date
issued: 2002-07-13
Date Modified: 2008-01-14
Has Version: dateCopyrighted-002
relation: dateCopyrighted-002
Relation: dateCopyrighted-002
date: 2008-01-14
date: 2002-07-13
range: Resource

Date Issued
range: Literal
sub property of: Date
comment: Date of formal issuance (e.g., publication) of the resource.
Has Version: issued-003
Date Modified: 2008-01-14
type: Property
issued: 2000-07-11
sub property of: date
relation: issued-003
Relation: issued-003
date: 2008-01-14
date: 2000-07-11
range: Resource

Is Referenced By
Date Modified: 2008-01-14
issued: 2000-07-11
sub property of: relation
note: This term is intended to be used with non-literal values as defined in the DCMI Abstract Model (http://dublincore.org/documents/abstract-model/). As of December 2007, the DCMI Usage Board is seeking a way to express this intention with a formal range declaration.
comment: A related resource that references, cites, or otherwise points to the described resource.
type: Property
sub property of: Relation
Has Version: isReferencedBy-003
relation: isReferencedBy-003
Relation: isReferencedBy-003
date: 2008-01-14
date: 2000-07-11