lemon
type: Ontology
comment: Lemon: The lexicon model for ontologies is designed to allow for descriptions of lexical information regarding ontological elements and other RDF resources. Lemon covers mapping of lexical decomposition, phrase structure, syntax, variation, morphology, and lexicon-ontology mapping.

Abstract form
type: Property
type: ObjectProperty
label: Abstrakte Form @de
label: Forma abstracta @es
label: Forme abstraite @fr
label: Abstracte vorm @nl
comment: A representation of a lexical entry that should not be considered canonical. This is primarily from a linguistic view for non-realisable forms such as stems but may also include misspellings and other unusual forms
range: Form
domain: Lexical entry
sub property of: Lexical form

Alternative reference of
type: Property
type: ObjectProperty
label: Alternative Referenz von @de
label: Referencia alternativa de @es
label: Référence alternative de @fr
label: Alternatieve referentie van @nl
comment: The sense of a non-preferred but admissible lexicalization of a given ontology entity
range: Lexical sense
sub property of: Reference of

Broader
type: Property
type: ObjectProperty
label: Breiter @de
label: Más amplio @es
label: Plus large @fr
label: Breder @nl
comment: Denotes that one sense is broader than another. From a lexical point of view this means replacing one lexical entry with another generalizes the meaning of the phrase. From an ontological point of view this property makes not strong assertions. From a mapping point of view if the broader sense applies the narrower sense must also
domain: Lexical sense
range: Lexical sense
inverse of: Narrower
sub property of: Sense relation

Canonical form
type: Property
type: ObjectProperty
type: FunctionalProperty
label: Kanonische Form @de
label: Forma canónica @es
label: Forme canonique @fr
label: Canonieke vorm @nl
comment: The canonical ("dictionary") form of the lexical entry. This can be used to indicate the "lemma" form of a lexical entry
range: Form
domain: Lexical entry
sub property of: Lexical form

Condition
type: Property
type: ObjectProperty
label: Bedingung @de
label: Condición @es
label: Voorwaarde @nl
comment: Indicates an evaluable test, the is necessary for this sense to apply
range: Lexical Condition
domain: Lexical sense

Constituent
type: Property
type: ObjectProperty
label: Konstituent @de
label: Constituyente @es
label: Constitutif @fr
domain: Node
range: Constituent
sub property of: topObjectProperty

Context
type: Property
type: ObjectProperty
label: Kontext @de
label: Contexto @es
label: Contexte @fr
comment: Denotes the pragmatic or discursive context of a sense mapping or a constraint on the mapping by syntactic or semantic properites
range: Lexical Context
domain: Lexical sense

Decomposition
type: Property
type: ObjectProperty
label: Dekompositum @de
label: Descomposición @es
label: Décomposition @fr
label: Decompositie @nl
comment: Denotes a component of a lexical entry
range: ComponentList
domain: Lexical entry

Definition
type: Property
type: ObjectProperty
label: Definición @es
label: Définition @fr
label: Definitie @nl
comment: Indicates a natural language definition. Note there is a pseudo-node to allow for further description of the definition (e.g., source, creation date etc.). The value property should be used to indicate the string value of the definition.
domain: Lexical sense
range: Definition

Edge
type: Property
type: ObjectProperty
label: Kante @de
label: Arista @es
label: Lien @fr
label: Lijn @nl
comment: Denotes the relation between a node in a multi-word expression structure and an edge
range: Node
domain: Node

Element
type: Property
type: ObjectProperty
type: FunctionalProperty
label: Elemento @es
label: Elément @fr
comment: Denotes the lexical entry represented by the component
domain: Component
range: Lexical entry

Entry
type: Property
type: ObjectProperty
label: Eintrag @de
label: Entrada @es
label: Entrée @fr
label: Item @nl
comment: Indicates an entry in a lexicon
range: Lexical entry
domain: Lexicon

Equivalent
type: Property
type: ObjectProperty
type: SymmetricProperty
type: TransitiveProperty
label: Äquivalent @de
label: Equivalente @es
comment: Indicates that two senses are equivalent. From a lexical point of view , this indicates that the lexical entries can be substituted for each other with no change in meaning. From an ontological point of view it means that the two references are not disjoint. From a mapping point of view it means if one mapping apply the other must necessarily apply
range: Lexical sense
domain: Lexical sense
sub property of: Sense relation

Example
type: Property
type: ObjectProperty
label: Beispiel @de
label: Ejemplo @es
label: Exemple @fr
label: Voorbeeld @nl
domain: Lexical sense
range: Usage Example

Extrinsic argument
type: Property
type: ObjectProperty
label: Äußerliche Argument @de
label: Argumento extrínseco @es
label: Actant extrinsèque @fr
label: Extrinsiek argument @nl
comment: A raisable semantic argument is not in fact the semantic argument of the current frame-sense but instead is "raised" into a frame-sense used for an argument. For example the phrase "John seemed to be happy", is interpreted as "it seemed that X" where X is "John is happy", hence the subject of "seem" is a raisable argument.
sub property of: Semantic argument

Form variant
type: Property
type: ObjectProperty
label: Form-Variante @de
label: Variante de la forma @es
label: Variante de la forme @fr
label: Vorm variant @nl
domain: Form
range: Form

Generates
type: Property
type: ObjectProperty
label: Erzeugt @de
label: Genera @es
label: Génère @fr
label: Genereert @nl
label: Порождает @ru
domain: Morphological Transform
range: Prototype
subclass of: http://lodlaundromat.org/.well-known/genid/samples/jena///predicate//92ec2d3e130663ac5e2030d8244a513a/a99c4cd928f1d217346ef7b0d86e91a0#1

http://lodlaundromat.org/.well-known/genid/samples/jena///predicate//92ec2d3e130663ac5e2030d8244a513a/a99c4cd928f1d217346ef7b0d86e91a0#1
type: Restriction
on property: Rule
min cardinality: 1

Hidden reference of
type: Property
type: ObjectProperty
label: Verborgene Referenz von @de
label: Referencia oculta de @es
label: Référence cachée de @fr
label: Verborgen referentie van @nl
comment: The sense of a non-admissible lexicalization for a ontology entity. This is used to denote incorrect or deprecated language that may be useful for information extraction but not generation
range: Lexical sense
sub property of: Reference of

Incompatible
type: Property
type: ObjectProperty
type: SymmetricProperty
label: Inkompatibel @de
label: Onverenigbaar @nl
comment: Says that the two senses are disjoint. From a lexical point of view, this means substituting the lexical entries must change the meaning of the phrase. From an ontological point of view, this property is implied if both references are also disjoint, but does not imply disjointness, but non-equivalence of the references. For the mapping point of view there is not instance when both mappings are valid.
range: Lexical sense
domain: Lexical sense
sub property of: Sense relation

Instance of
type: Property
type: ObjectProperty
label: Instanz von @de
label: Instancia de @es
label: Instance de @fr
label: Instantie van @nl
comment: Denotes that the single argument of a class predicate is represented in the lexicon by the given semantic argument. That is Class(?x) or ?x rdf:type Class
range: Argument
domain: Lexical sense
sub property of: Semantic argument

Reference of
type: Property
type: ObjectProperty
label: Referenz von @de
label: Referencia de @es
label: Référence de @fr
label: Referentie van @nl
comment: Indicate that a reference has a given sense
range: Lexical sense
inverse of: Reference

Sense of
type: Property
type: ObjectProperty
label: Sinn von @de
label: Acepción de @es
label: Signfication de @fr
label: Zin van @nl
comment: Indicate that a sense is realised by the given lexical entry
range: Lexical entry
domain: Lexical sense
inverse of: Sense

Leaf
type: Property
type: ObjectProperty
label: Blatt @de
label: Hoja @es
label: Feuille @fr
label: Blad @nl
comment: Denotes the component referred to by the lex (pre-terminal) of the phrase structure
domain: Node
range: Phrase element

Lexical form
type: Property
type: ObjectProperty
type: InverseFunctionalProperty
label: Lexikalische Form @de
label: Forma léxica @es
label: Forme lexicale @fr
label: Lexikaal vorm @nl
comment: Denotes a written representation of a lexical entry
range: Form
domain: Lexical entry

Lexical variant
type: Property
type: ObjectProperty
label: Lexikalische Variante @de
label: Variante léxica @es
label: Variante lexicale @fr
label: Lexikaal variant @nl
comment: Indicates a non-semantic relationship between two lexical entries. E.g., a term is derived from another term, such as "lexical" and "lexicalize"
range: Lexical entry
domain: Lexical entry

Marker
type: Property
type: ObjectProperty
label: Marcador @es
label: Marqueur @fr
label: Merker @nl
label: маркер @ru
comment: Denotes the marker of a semantic argument. This should generally either be a semantic property i.e., case or another lexical entry e.g., a preposition or particle
domain: Argument
range: Syntactic role marker

Narrower
type: Property
type: ObjectProperty
label: Enger @de
label: Más estrecho @es
label: Plus restreint @fr
comment: Denotes that one sense is narrower than another. From a lexical point of view this means replacing one lexical entry with another specializes the meaning of the phrase. From an ontological point of view this property makes not strong assertions. From a mapping point of view if the broader sense applies the narrower sense must also
range: Lexical sense
domain: Lexical sense
sub property of: Sense relation

Next transform
type: Property
type: ObjectProperty
label: Folgende Transformation @de
label: Transformación siguiente @es
label: Transformation suivante @fr
label: Volgende transformatie @nl
domain: Morphological Transform
range: Morphological Transform

Object of property
type: Property
type: ObjectProperty
label: Objekt von Prädikat @de
label: Complemento de la propiedad @es
label: Complément de la propiété @fr
label: Object van predikaat @nl
comment: Indicates the semantic argument which represents the objects (ranges) of the property referred to by this sense
range: Argument
domain: Lexical sense
sub property of: Semantic argument

Other form
type: Property
type: ObjectProperty
label: Andere Form @de
label: Otra forma @es
label: Autre forme @fr
label: Andere vorm @nl
comment: A non-preferred ("non-dictionary") representation of a lexical entry. This should be variant that is either a morphological variant, an abbreviation, short form or acronym
range: Form
domain: Lexical entry
sub property of: Lexical form

Pattern
type: Property
type: ObjectProperty
label: Muster @de
label: Patrón @es
label: Patron @fr
label: Patroon @nl
label: Шаблон @ru
domain: HasPattern
range: Morphological pattern

Phrase root
type: Property
type: ObjectProperty
label: Phrasewurzel @de
label: Raíz del sintagma @es
label: Base de la syntagme @fr
label: Zinsdeel wortel @nl
comment: Indicates the head node of a phrase structure or dependency parse graph
domain: Lexical entry
range: Node

Preferred reference of
type: Property
type: ObjectProperty
label: Bevorzugte Referenz von @de
label: Referencia preferida de @es
label: Référence préféré de @fr
label: Voorkeursreferentie van @nl
comment: The sense of the preferred lexicalization of a given ontology entity
range: Lexical sense
sub property of: Reference of

Lexical property
type: Property
type: ObjectProperty
label: Lexikalische Prädikat @de
label: Propiedad léxica @es
label: Propiété lexicale @fr
label: Lexikaal predikaat @nl
comment: Denotes a lexical property of a lexical entry, form, component or MWE node. For the lexical entry this is assumed to be static properties e.g., part of speech and gender and for the others this is assumed to be specific properties e.g., case, number
domain: LemonElement
range: Property Value

Property domain
type: Property
type: ObjectProperty
label: Prädikatsbereich @de
label: Dominio de la propiedad @es
label: Ensemble de la propiété @fr
label: Domein van het predikaat @nl
comment: Indicates a restrictions on the domain of the property. That is, this sense only applies if the property the sense refers to has a subject in the class referred to by this property
domain: Lexical sense
sub property of: Condition

Property range
type: Property
type: ObjectProperty
label: Prädikatszielmenge @de
label: Rango de la propiedad @es
label: Image de la propiété @fr
label: Bereik van het predikaat @nl
comment: Indicates a restrictions on the range of the property. That is, this sense only applies if the property the sense refers to has a object in the class referred to by this property
domain: Lexical sense
sub property of: Condition

Reference
type: Property
type: ObjectProperty
type: FunctionalProperty
label: Referenz @de
label: Referencia @es
label: Référence @fr
label: Referentie @nl
comment: A reference to an external resource
domain: Lexical sense

Semantic argument
type: Property
type: ObjectProperty
label: Semantische Argument @de
label: Argumento semántico @es
label: Actant sémantique @fr
label: Semantisch argument @nl
comment: Denotes a semantic argument slot of a semantic unit
range: Argument
domain: Lexical sense

Sense
type: Property
type: ObjectProperty
label: Sinn @de
label: Acepción @es
label: Signification @fr
label: Zin @nl
comment: Indicates the sense of a lexical entry
domain: Lexical entry
range: Lexical sense

Sense relation
type: Property
type: ObjectProperty
label: Sinn-Relation @de
label: Relación de Acepción @es
label: Relation de Signification @fr
label: Zin relatie @nl
comment: Denotes a relationship between senses
range: Lexical sense
domain: Lexical sense

Subject of property
type: Property
type: ObjectProperty
label: Subjekt von Prädikat @de
label: Sujeto de la propiedad @es
label: Sujet de la propiété @fr
label: Onderwerp van predikaat @nl
comment: Indicates the semantic argument which represents the subjects (domain) of the property referred to by this sense
range: Argument
domain: Lexical sense
sub property of: Semantic argument

Subsense
type: Property
type: ObjectProperty
label: Teil des Sinnes @de
label: Parte del acepción @es
label: Signification composante @fr
label: Deel van de zin @nl
comment: Indicates that the relation between a compound sense and its atomic subsenses
range: Lexical sense
domain: Lexical sense

Syntactic argument
type: Property
type: ObjectProperty
label: Syntactische Argument @de
label: Argumento sintáctico @es
label: Actant syntaxique @fr
label: Syntactisch argument @nl
comment: Indicates a slot in a syntactic frame
range: Argument
domain: Frame

Syntactic behavior
type: Property
type: ObjectProperty
label: Syntactische Verhalten @de
label: Funcionamiento sintáctico @es
label: Conduite syntaxique @fr
label: Syntactisch optreden @nl
comment: Indicates a syntactic behavior of a lexical entry
range: Frame
domain: Lexical entry

Topic
type: Property
type: ObjectProperty
label: Thema @de
label: Tema @es
label: Thème @fr
comment: Indicates the topic of the overrall lexicon, this is property is sometimes called "subject field". Note that in addition to the topic of a lexicon each lexical entry may belong to a given domain, this can be modelled as equal or not equal to the topic of the associated lexicon
range: Lexical Topic
domain: http://lodlaundromat.org/.well-known/genid/samples/jena///predicate//92ec2d3e130663ac5e2030d8244a513a/a99c4cd928f1d217346ef7b0d86e91a0#2

Transform
type: Property
type: ObjectProperty
label: Transformation @de
label: Transformación @es
label: Transformatie @nl
domain: Morphological pattern
range: Morphological Transform

Tree
type: Property
type: ObjectProperty
label: Baum @de
label: Árbol @es
label: Arbre @fr
label: Boom @nl

Language
type: Property
type: DatatypeProperty
label: Sprache @de
label: Lengua @es
label: Langue @fr
label: Taal @nl
comment: The language of a given lexicon. This should be some ISO-639 string
domain: HasLanguage
range: string

Optional
type: Property
type: DatatypeProperty
label: Opcional @es
label: Optionnel @fr
label: Optionele @nl
comment: Denotes that the syntactic argument is optional (may be omitted)
domain: Argument
range: boolean

Representation
type: Property
type: DatatypeProperty
label: Darstellung @de
label: Representación @es
label: Représentation @fr
label: Voorstelling @nl
comment: A realisation of a given form
domain: Form
range: string

Rule
type: Property
type: DatatypeProperty
label: Regel @de
label: Regla @es
label: Règle @fr
domain: Morphological Transform
range: string

Separator
type: Property
type: DatatypeProperty
label: Separador @es
label: Séparateur @fr
label: Afscheider @nl
comment: Indicates the graphical element used to seperate the subnodes of this phrase structure. It is generally recommended that you use a string value with the language tag used to indicate script, (i.e., using ISO-15924 codes, such as "Latn"), as orthographic features may change with script.
domain: Node
range: string

Value
type: Property
type: DatatypeProperty
label: Wert @de
label: Valor @es
label: Valeur @fr
label: Waarde @nl
comment: This indicates the value of a pseudo-data node. An example of this is definition where the value would generally be a string but it would not be possible to add further annotations, such as source or creation date.

Written representation
type: Property
type: DatatypeProperty
label: Schriftliche Darstellung @de
label: Representación escrita @es
label: Représentation écrite @fr
label: Schriftelijke voorstelling @nl
comment: Gives the written representation of a given form
domain: Form
sub property of: Representation
range: string

Argument
type: Class
label: Argumento @es
label: Actant @fr
label: Аргумент @ru
subclass of: LemonElement
subclass of: Phrase element
disjoint with: Component
disjoint with: Form
disjoint with: Frame
disjoint with: Lexical entry
disjoint with: Lexical sense
disjoint with: Lexicon
disjoint with: Node
disjoint with: Property Value
disjoint with: Definition
disjoint with: Syntactic role marker
disjoint with: Usage Example
comment: A slot representing a gap that must be filled in realising a lexical entry in a given projection

Component
type: Class
label: Komponente @de
label: Componente @es
label: Composant @fr
label: Bestanddeel @nl
label: Компонента @ru
subclass of: LemonElement
subclass of: Phrase element
subclass of: http://lodlaundromat.org/.well-known/genid/samples/jena///predicate//92ec2d3e130663ac5e2030d8244a513a/a99c4cd928f1d217346ef7b0d86e91a0#5
disjoint with: Form
disjoint with: Frame
disjoint with: Lexical entry
disjoint with: Lexical sense
disjoint with: Lexicon
disjoint with: Node
disjoint with: Property Value
disjoint with: Definition
disjoint with: Syntactic role marker
disjoint with: Usage Example
comment: A constituent element of a lexical entry. This may be a word in a multi-word lexical element or a constituent of a compound word

http://lodlaundromat.org/.well-known/genid/samples/jena///predicate//92ec2d3e130663ac5e2030d8244a513a/a99c4cd928f1d217346ef7b0d86e91a0#5
type: Restriction
on property: Element
max cardinality: 1

ComponentList
type: Class
subclass of: List
subclass of: http://lodlaundromat.org/.well-known/genid/samples/jena///predicate//92ec2d3e130663ac5e2030d8244a513a/a99c4cd928f1d217346ef7b0d86e91a0#6
subclass of: http://lodlaundromat.org/.well-known/genid/samples/jena///predicate//92ec2d3e130663ac5e2030d8244a513a/a99c4cd928f1d217346ef7b0d86e91a0#7
subclass of: http://lodlaundromat.org/.well-known/genid/samples/jena///predicate//92ec2d3e130663ac5e2030d8244a513a/a99c4cd928f1d217346ef7b0d86e91a0#13
subclass of: http://lodlaundromat.org/.well-known/genid/samples/jena///predicate//92ec2d3e130663ac5e2030d8244a513a/a99c4cd928f1d217346ef7b0d86e91a0#14
comment: A node within a list of components. This should generally be a blank node,see rdf:List

http://lodlaundromat.org/.well-known/genid/samples/jena///predicate//92ec2d3e130663ac5e2030d8244a513a/a99c4cd928f1d217346ef7b0d86e91a0#6
type: Restriction
on property: rest
cardinality: 1

http://lodlaundromat.org/.well-known/genid/samples/jena///predicate//92ec2d3e130663ac5e2030d8244a513a/a99c4cd928f1d217346ef7b0d86e91a0#13
type: Restriction
on property: first
cardinality: 1

Form
type: Class
label: Forma @es
label: Forme @fr
label: Vorm @nl
label: Форма @ru
subclass of: LemonElement
subclass of: http://lodlaundromat.org/.well-known/genid/samples/jena///predicate//92ec2d3e130663ac5e2030d8244a513a/a99c4cd928f1d217346ef7b0d86e91a0#15
disjoint with: Frame
disjoint with: Lexical entry
disjoint with: Lexical sense
disjoint with: Lexicon
disjoint with: Node
disjoint with: Property Value
disjoint with: Definition
disjoint with: Syntactic role marker
disjoint with: Usage Example
comment: A given written or spoken realisation of a lexical entry

http://lodlaundromat.org/.well-known/genid/samples/jena///predicate//92ec2d3e130663ac5e2030d8244a513a/a99c4cd928f1d217346ef7b0d86e91a0#15
type: Restriction
on property: Representation
min cardinality: 1

Frame
type: Class
label: Rahmen @de
label: Marco @es
label: Cadre @fr
label: Raam @nl
label: Рамка @ru
subclass of: LemonElement
disjoint with: Lexical entry
disjoint with: Lexical sense
disjoint with: Lexicon
disjoint with: Node
disjoint with: Property Value
disjoint with: Definition
disjoint with: Syntactic role marker
disjoint with: Usage Example
comment: A stereotypical example of the usage of a given lexical entry. The most common example of projections are subcategorization frames which describe the slots taken by the arguments of a verb.

HasLanguage
type: Class
subclass of: LemonElement
comment: Structural element for all elements that can be tagged with a language

Lexical Condition
type: Class
label: Lexikonbedingung @de
label: Condición léxica @es
label: Condition lexicale @fr
label: Lexikaal Voorwaarde @nl
label: Лексическое условие @ru
subclass of: LemonElement
comment: An evaluable condition on when a sense applies.

Lexical Context
type: Class
label: Lexikonkontext @de
label: Contexto léxico @es
label: Contexte lexical @fr
label: Lexikaal Context @nl
label: Лексический контекст @ru
subclass of: LemonElement
comment: Indicates the pragmatic or discourse context in which a sense applies

Lexical entry
type: Class
label: Lexikoneintrag @de
label: Entrada léxica @es
label: Entrée lexicale @fr
label: Lexikaal item @nl
label: Лексическая единица @ru
subclass of: HasLanguage
subclass of: HasPattern
subclass of: LemonElement
subclass of: http://lodlaundromat.org/.well-known/genid/samples/jena///predicate//92ec2d3e130663ac5e2030d8244a513a/a99c4cd928f1d217346ef7b0d86e91a0#16
subclass of: http://lodlaundromat.org/.well-known/genid/samples/jena///predicate//92ec2d3e130663ac5e2030d8244a513a/a99c4cd928f1d217346ef7b0d86e91a0#17
disjoint with: Lexical sense
disjoint with: Lexicon
disjoint with: Node
disjoint with: Property Value
disjoint with: Definition
disjoint with: Usage Example
comment: An entry in the lexicon. This may be any morpheme, word, compound, phrase or clause that is included in the lexicon

http://lodlaundromat.org/.well-known/genid/samples/jena///predicate//92ec2d3e130663ac5e2030d8244a513a/a99c4cd928f1d217346ef7b0d86e91a0#16
type: Restriction
on property: Lexical form
min cardinality: 1

http://lodlaundromat.org/.well-known/genid/samples/jena///predicate//92ec2d3e130663ac5e2030d8244a513a/a99c4cd928f1d217346ef7b0d86e91a0#17
type: Restriction
on property: Canonical form
max cardinality: 1

Lexical sense
type: Class
label: Lexikonsinn @de
label: Acepción léxica @es
label: Signification lexicale @fr
label: Lexikaal zin @nl
subclass of: LemonElement
subclass of: http://lodlaundromat.org/.well-known/genid/samples/jena///predicate//92ec2d3e130663ac5e2030d8244a513a/a99c4cd928f1d217346ef7b0d86e91a0#18
disjoint with: Lexicon
disjoint with: Node
disjoint with: Property Value
disjoint with: Definition
disjoint with: Syntactic role marker
disjoint with: Usage Example
comment: Represents the intersection in meaning between the lexical entry and the ontology entity. This is used as the ontology entity and lexical entry may not be in one-to-one correspondence as such the existence of a sense between them states meerly that there are some cases when this lexical entry refer to the ontology entity and vica versa. Mapping elements can be used to further specify this relation

http://lodlaundromat.org/.well-known/genid/samples/jena///predicate//92ec2d3e130663ac5e2030d8244a513a/a99c4cd928f1d217346ef7b0d86e91a0#20
type: Restriction
on property: Subsense
min cardinality: 1

http://lodlaundromat.org/.well-known/genid/samples/jena///predicate//92ec2d3e130663ac5e2030d8244a513a/a99c4cd928f1d217346ef7b0d86e91a0#22
type: Restriction
on property: Reference
cardinality: 1

Lexical Topic
type: Class
label: Lexikonthema @de
label: Tema léxica @es
label: Thème lexicale @fr
label: Lexikaal Thema @nl
subclass of: LemonElement
comment: Indicates the topic of a lexicon or a lexical entry

Lexicon
type: Class
label: Lexikon @de
label: Lexicón @es
label: Lexique @fr
label: Лексикон @ru
subclass of: HasLanguage
subclass of: HasPattern
subclass of: LemonElement
subclass of: http://lodlaundromat.org/.well-known/genid/samples/jena///predicate//92ec2d3e130663ac5e2030d8244a513a/a99c4cd928f1d217346ef7b0d86e91a0#23
subclass of: http://lodlaundromat.org/.well-known/genid/samples/jena///predicate//92ec2d3e130663ac5e2030d8244a513a/a99c4cd928f1d217346ef7b0d86e91a0#24
disjoint with: Node
disjoint with: Property Value
disjoint with: Definition
disjoint with: Syntactic role marker
disjoint with: Usage Example
comment: The lexicon object. This object is specific to the given language and/or domain it describes

http://lodlaundromat.org/.well-known/genid/samples/jena///predicate//92ec2d3e130663ac5e2030d8244a513a/a99c4cd928f1d217346ef7b0d86e91a0#23
type: Restriction
on property: Entry
min cardinality: 1

http://lodlaundromat.org/.well-known/genid/samples/jena///predicate//92ec2d3e130663ac5e2030d8244a513a/a99c4cd928f1d217346ef7b0d86e91a0#24
type: Restriction
on property: Language
cardinality: 1

Morphological pattern
type: Class
label: Morphologische Muster @de
label: Patrón morfológico @es
label: Patron morphologique @fr
label: Morphologisch Patroon @nl
label: Морфологический шаблон @ru
subclass of: HasLanguage
subclass of: LemonElement

Morphological Transform
type: Class
label: Morphologische Transformation @de
label: Transformación morfológica @es
label: Transformation morphologique @fr
label: Morphologisch transformatie @nl
label: Морфологическое преобразование @ru
subclass of: LemonElement

Node
type: Class
label: Knoten @de
label: Vértice @es
label: Nœud @fr
label: Punt @nl
label: Узел @ru
subclass of: LemonElement
subclass of: http://lodlaundromat.org/.well-known/genid/samples/jena///predicate//92ec2d3e130663ac5e2030d8244a513a/a99c4cd928f1d217346ef7b0d86e91a0#25
disjoint with: Property Value
disjoint with: Definition
disjoint with: Syntactic role marker
disjoint with: Usage Example
comment: A node in a phrase structure or dependency parse graph

http://lodlaundromat.org/.well-known/genid/samples/jena///predicate//92ec2d3e130663ac5e2030d8244a513a/a99c4cd928f1d217346ef7b0d86e91a0#27
type: Restriction
on property: Edge
min cardinality: 1

http://lodlaundromat.org/.well-known/genid/samples/jena///predicate//92ec2d3e130663ac5e2030d8244a513a/a99c4cd928f1d217346ef7b0d86e91a0#29
type: Restriction
on property: Leaf
min cardinality: 1

Constituent
type: Class
label: Konstituent @de
label: Constituyente @es
label: Составляющая @ru
subclass of: LemonElement
comment: The class of constituents, that is types applied to nodes in a phrase structure graph

Part of word
type: Class
label: Wortteil @de
label: Parte de la palabra @es
label: Partie du mot @fr
label: Deel van een woord @nl
label: Часть слова @ru
subclass of: Lexical entry
comment: An affix is a morpheme that is attached to a word stem to form a new word. Use this for lexical entries with only abstract forms

Phrase
type: Class
label: Sintagma @es
label: Syntagme @fr
label: Zinsdeel @nl
label: Фраза @ru
subclass of: Lexical entry
subclass of: http://lodlaundromat.org/.well-known/genid/samples/jena///predicate//92ec2d3e130663ac5e2030d8244a513a/a99c4cd928f1d217346ef7b0d86e91a0#30
comment: A phrase in lemon is defined in the looser sense of a sequence of words, it does not have to a fully grammatical phrase

http://lodlaundromat.org/.well-known/genid/samples/jena///predicate//92ec2d3e130663ac5e2030d8244a513a/a99c4cd928f1d217346ef7b0d86e91a0#30
type: Restriction
on property: Decomposition
min cardinality: 1

Phrase element
type: Class
label: Phrase-Element @de
label: Elemento del sintagma @es
label: Elément du syntagme @fr
label: Zinselement @nl
subclass of: LemonElement
comment: A terminal node in a phrase structure graph, i.e., a realisable, lexical element.

Property Value
type: Class
label: Prädikatswert @de
label: Valor de la propiedad @es
label: Valeur de la propriété @fr
label: Waarde van het predikaat @nl
label: Свойство @ru
subclass of: LemonElement
disjoint with: Definition
disjoint with: Usage Example
comment: A value that can be used in the range of linguistic property

Prototype
type: Class
label: Prototipo @es
label: Prototyp @nl
label: Прототип @ru
subclass of: LemonElement

Condition
type: Class
label: Bedingung @de
label: Condición @es
label: Voorwaarde @nl
label: Условие @ru
subclass of: LemonElement
comment: Indicates a logical condition that is used indicate when a particular term has the given meaning

Context
type: Class
label: Kontext @de
label: Contexto @es
label: Contexte @fr
label: Контекст @ru
subclass of: LemonElement
comment: Indicates the context in which a term is to be used. The context refers not to the immediate syntactic context, but the document and register the document is used in

Definition
type: Class
label: Definición @es
label: Définition @fr
label: Definitie @nl
label: Определение @ru
subclass of: LemonElement
subclass of: http://lodlaundromat.org/.well-known/genid/samples/jena///predicate//92ec2d3e130663ac5e2030d8244a513a/a99c4cd928f1d217346ef7b0d86e91a0#31
disjoint with: Syntactic role marker
disjoint with: Usage Example
comment: A definition of a sememe, that is the a text describing the exact meaning of the lexical entry when its sense is the given ontology reference

http://lodlaundromat.org/.well-known/genid/samples/jena///predicate//92ec2d3e130663ac5e2030d8244a513a/a99c4cd928f1d217346ef7b0d86e91a0#31
type: Restriction
on property: Value
min cardinality: 1

Syntactic role marker
type: Class
label: Syntactische Rolle-Marker @de
label: Marcador de la función sintáctica @es
label: Marqueur du rôle syntaxique @fr
label: Syntactisch rol merker @nl
label: Маркер синтаксической роли @ru
subclass of: LemonElement
subclass of: http://lodlaundromat.org/.well-known/genid/samples/jena///predicate//92ec2d3e130663ac5e2030d8244a513a/a99c4cd928f1d217346ef7b0d86e91a0#32
disjoint with: Usage Example
comment: The indicator of a given syntactic argument, normally a preposition or other particle marker or a linguistic property such as case

Usage Example
type: Class
label: Anwendungsbeispiel @de
label: Ejemplo de uso @es
label: Exemple d'utilisation @fr
label: Voorbeeld van het gebruik @nl
label: Пример использования @ru
subclass of: LemonElement
subclass of: http://lodlaundromat.org/.well-known/genid/samples/jena///predicate//92ec2d3e130663ac5e2030d8244a513a/a99c4cd928f1d217346ef7b0d86e91a0#35
comment: An example of the usage of a lexical entry when refering to the ontology entity given by the sememe's reference. This should in effect be an example of the form used in context. E.g., "this is a *usage example*"

http://lodlaundromat.org/.well-known/genid/samples/jena///predicate//92ec2d3e130663ac5e2030d8244a513a/a99c4cd928f1d217346ef7b0d86e91a0#35
type: Restriction
on property: Value
min cardinality: 1

Word
type: Class
label: Wort @de
label: Palabra @es
label: Mot @fr
label: Woord @nl
label: Слово @ru
subclass of: Lexical entry
comment: A word is a single unit of writing or speech. In languages written in Latin, Cyrillic, Greek, Arabic scripts etc. these are assumed to be separated by white-space characters. For Chinese, Japanese, Korean this should correspond to some agreed segmentation scheme.