knows
term status: stable
type: Thing
sub property of: topObjectProperty
property disjoint with: Organization
property disjoint with: bottomObjectProperty
type: ObjectProperty
type: Property
comment: A person known by this person (indicating some level of reciprocated interaction between the parties).
domain: Person
range: Person

firstName
term status: testing
type: Thing
sub property of: topDataProperty
property disjoint with: bottomDataProperty
type: DatatypeProperty
type: Property
comment: The first name of a person.
domain: Person
range: Literal

content license
sub property of: topObjectProperty
property disjoint with: bottomObjectProperty
type: ObjectProperty
comment: The contents of a database might be covered by a separate license, e.g. a database containing copyrightable material (e.g. text, images) might have different rights for the dataset and the contents. This property can be used to refer to a license that applies to the content of the dataset. In some cases the same license can be applied to both content and data, but in others a data publisher may choose to use a separate license for content. The value of the property will be the URI of the license that is being applied to the content.

ICQ chat ID
sub property of: nickname
term status: testing
type: Thing
property disjoint with: bottomDataProperty
sub property of: topDataProperty
type: InverseFunctionalProperty
type: DatatypeProperty
domain: Agent
range: Literal
comment: An ICQ chat ID
type: Property

birthday
term status: unstable
type: Thing
sub property of: topDataProperty
property disjoint with: bottomDataProperty
type: FunctionalProperty
type: DatatypeProperty
type: Property
comment: The birthday of this Agent, represented in mm-dd string form, eg. '12-31'.
domain: Agent
range: Literal

focus
term status: testing
type: Thing
sub property of: topObjectProperty
property disjoint with: bottomObjectProperty
type: ObjectProperty
type: Property
comment: The underlying or 'focal' entity associated with some SKOS-described concept.
domain: Concept
range: Thing

Given name
term status: archaic
type: Thing
sub property of: topDataProperty
property disjoint with: bottomDataProperty
type: DatatypeProperty
type: Property
comment: The given name of some person.

attribution text
sub property of: topDataProperty
property disjoint with: bottomDataProperty
type: DatatypeProperty
comment: The text to use in an attribution link. This may be the name of the publisher or a reference to a community or group of contributors

openid
type: ObjectProperty
term status: testing
sub property of: page
property disjoint with: bottomObjectProperty
type: InverseFunctionalProperty
property disjoint with: Organization
sub property of: is primary topic of
sub property of: topObjectProperty
type: Thing
range: Document
type: Property
domain: Agent
comment: An OpenID for an Agent.

account service homepage
term status: testing
type: Thing
sub property of: topObjectProperty
property disjoint with: Organization
property disjoint with: bottomObjectProperty
type: ObjectProperty
type: Property
comment: Indicates a homepage of the service provide for this online account.
domain: Online Account
range: Document

is primary topic of
sub property of: topObjectProperty
property disjoint with: bottomObjectProperty
property disjoint with: Organization
type: Thing
type: ObjectProperty
sub property of: page
type: InverseFunctionalProperty
term status: stable
inverse of: primary topic
comment: A document that this thing is the primary topic of.
domain: Thing
range: Document
type: Property

phone
term status: testing
type: Thing
sub property of: topObjectProperty
property disjoint with: bottomObjectProperty
type: ObjectProperty
type: Property
comment: A phone, specified using fully qualified tel: URI scheme (refs: http://www.w3.org/Addressing/schemes.html#tel).

Given name
term status: testing
type: Thing
sub property of: topDataProperty
property disjoint with: bottomDataProperty
type: DatatypeProperty
type: Property
comment: The given name of some person.

depicts
term status: testing
type: Thing
sub property of: topObjectProperty
property disjoint with: bottomObjectProperty
inverse of: depiction
type: ObjectProperty
type: Property
comment: A thing depicted in this representation.
domain: Image
range: Thing

Project
disjoint with: PersonalProfileDocument
type: Class
term status: testing
disjoint with: Document
subclass of: Thing
disjoint with: Nothing
disjoint with: Image
disjoint with: Person
type: Thing
comment: A project (a collective endeavour of some kind).

account
term status: testing
type: Thing
sub property of: topObjectProperty
property disjoint with: bottomObjectProperty
type: ObjectProperty
type: Property
comment: Indicates an account held by this agent.
domain: Agent
range: Online Account

Skype ID
term status: testing
type: Thing
sub property of: topDataProperty
sub property of: nickname
property disjoint with: bottomDataProperty
type: DatatypeProperty
type: Property
comment: A Skype ID
domain: Agent
range: Literal

Image
type: Class
disjoint with: Organization
subclass of: Thing
type: Thing
disjoint with: Project
subclass of: Document
disjoint with: Nothing
term status: testing
comment: An image.

page
type: ObjectProperty
property disjoint with: bottomObjectProperty
type: Thing
property disjoint with: Organization
term status: testing
inverse of: topic
sub property of: topObjectProperty
type: Property
comment: A page or document about this thing.
domain: Thing
range: Document

Leigh Dodds
made: Open Data Rights Statement Vocabulary
type: SpatialThing
type: Person
type: Thing
type: Agent

copyright statement
sub property of: topObjectProperty
property disjoint with: bottomObjectProperty
type: ObjectProperty
comment: A link to a document that includes a statement about the copyright status of the content of a dataset. The web page might include both a copyright notice for a dataset, and any relevant guidance for re-users.

data license
sub property of: topObjectProperty
property disjoint with: bottomObjectProperty
type: ObjectProperty
comment: This property is used to indicate which license covers reuse of the dataset(s) associated with this rights statement object. Typically this license will refer to a standard open license, e.g. as published by Creative Commons or Open Data Commons. The value of the property will be the URI of the license that is being applied to the data

Online E-commerce Account
term status: unstable
type: Thing
disjoint with: Nothing
subclass of: Thing
subclass of: Online Account
type: Class
comment: An online e-commerce account.

database right statement
sub property of: topObjectProperty
property disjoint with: bottomObjectProperty
type: ObjectProperty
comment: A link to a document that includes a statement about the database rights that apply to this dataset. The web page might include both a statement on the applicable rights and any relevant guidance for re-users.

lastName
term status: testing
type: Thing
sub property of: topDataProperty
property disjoint with: bottomDataProperty
type: DatatypeProperty
type: Property
comment: The last name of a person.
domain: Person
range: Literal

membershipClass
term status: unstable
type: Thing
type: Property
type: AnnotationProperty
comment: Indicates the class of individuals that are a member of a Group

Yahoo chat ID
term status: testing
type: DatatypeProperty
type: Thing
sub property of: topDataProperty
property disjoint with: bottomDataProperty
sub property of: nickname
type: InverseFunctionalProperty
domain: Agent
range: Literal
comment: A Yahoo chat ID
type: Property

homepage
sub property of: topObjectProperty
property disjoint with: Organization
term status: stable
sub property of: page
sub property of: is primary topic of
type: Thing
property disjoint with: bottomObjectProperty
type: ObjectProperty
type: InverseFunctionalProperty
comment: A homepage for some thing.
range: Document
type: Property
domain: Thing

rights
sub property of: topObjectProperty
property disjoint with: bottomObjectProperty
type: ObjectProperty
comment: Associates a rights statement with a dataset. This property is equivalent to the Dublin Core rights property

topic_interest
term status: testing
type: Thing
sub property of: topObjectProperty
property disjoint with: bottomObjectProperty
type: ObjectProperty
type: Property
comment: A thing of interest to this person.
domain: Agent
range: Thing

DNA checksum
term status: archaic
type: Thing
sub property of: topDataProperty
property disjoint with: bottomDataProperty
type: DatatypeProperty
type: Property
comment: A checksum for the DNA of some thing. Joke.
range: Literal

gender
term status: testing
type: Thing
sub property of: topDataProperty
property disjoint with: bottomDataProperty
type: FunctionalProperty
type: DatatypeProperty
type: Property
comment: The gender of this Agent (typically but not necessarily 'male' or 'female').
domain: Agent
range: Literal

sha1sum of a personal mailbox URI name
term status: testing
type: Thing
sub property of: topDataProperty
property disjoint with: bottomDataProperty
type: InverseFunctionalProperty
type: DatatypeProperty
type: Property
comment: The sha1sum of the URI of an Internet mailbox associated with exactly one owner, the first owner of the mailbox.
domain: Agent
range: Literal

logo
term status: testing
type: Thing
sub property of: topObjectProperty
property disjoint with: bottomObjectProperty
type: InverseFunctionalProperty
type: ObjectProperty
type: Property
comment: A logo representing some thing.
domain: Thing
range: Thing

attribution url
sub property of: topObjectProperty
property disjoint with: bottomObjectProperty
type: ObjectProperty
comment: The link which should be used when attributing a data source. The URL could be a reference to the dataset or publisher homepage, but may also be a dedicated attribution page. This is useful when providing onward attribution to upstream sources.

funded by
term status: archaic
type: Thing
sub property of: topObjectProperty
property disjoint with: bottomObjectProperty
type: ObjectProperty
type: Property
comment: An organization funding a project or person.
domain: Thing
range: Thing

image
property disjoint with: Organization
sub property of: depiction
type: ObjectProperty
term status: testing
property disjoint with: bottomObjectProperty
sub property of: topObjectProperty
type: Thing
type: Property
comment: An image that can be used to represent some thing (ie. those depictions which are particularly representative of something, eg. one's photo on a homepage).
domain: Person
range: Image

interest
term status: testing
type: Thing
sub property of: topObjectProperty
property disjoint with: Organization
property disjoint with: bottomObjectProperty
type: ObjectProperty
type: Property
comment: A page about a topic of interest to this person.
domain: Agent
range: Document

familyName
term status: testing
type: Thing
sub property of: topDataProperty
property disjoint with: bottomDataProperty
type: DatatypeProperty
type: Property
comment: The family name of some person.
domain: Person
range: Literal

status
term status: unstable
type: Thing
sub property of: topDataProperty
property disjoint with: bottomDataProperty
type: DatatypeProperty
type: Property
comment: A string expressing what the user is happy for the general public (normally) to know about their current activity.
domain: Agent
range: Literal

MSN chat ID
sub property of: nickname
property disjoint with: bottomDataProperty
type: Thing
sub property of: topDataProperty
type: InverseFunctionalProperty
term status: testing
type: DatatypeProperty
comment: An MSN chat ID
domain: Agent
type: Property
range: Literal

sha1sum (hex)
term status: unstable
type: Thing
sub property of: topDataProperty
property disjoint with: bottomDataProperty
type: DatatypeProperty
type: Property
comment: A sha1sum hash, in hex.
domain: Document

work info homepage
term status: testing
type: Thing
sub property of: topObjectProperty
property disjoint with: Organization
property disjoint with: bottomObjectProperty
type: ObjectProperty
type: Property
comment: A work info homepage of some person; a page about their work for some organization.
domain: Person
range: Document

PersonalProfileDocument
term status: testing
disjoint with: Nothing
disjoint with: Project
type: Thing
subclass of: Thing
type: Class
subclass of: Document
disjoint with: Organization
comment: A personal profile RDF document.

jurisdiction
sub property of: topObjectProperty
property disjoint with: bottomObjectProperty
type: ObjectProperty
comment: A reference to the jurisdiction in which copyright and/or database rights have been asserts. It is recommended that this refer to the URI for a country or region.

current project
term status: testing
type: Thing
sub property of: topObjectProperty
property disjoint with: bottomObjectProperty
type: ObjectProperty
type: Property
comment: A current project this person works on.
domain: Person
range: Thing

personal mailbox
term status: stable
type: Thing
sub property of: topObjectProperty
property disjoint with: bottomObjectProperty
type: InverseFunctionalProperty
type: ObjectProperty
type: Property
comment: A personal mailbox, ie. an Internet mailbox associated with exactly one owner, the first owner of this mailbox. This is a 'static inverse functional property', in that there is (across time and change) at most one individual that ever has any particular value for foaf:mbox.
domain: Agent
range: Thing

schoolHomepage
term status: testing
type: Thing
sub property of: topObjectProperty
property disjoint with: Organization
property disjoint with: bottomObjectProperty
type: ObjectProperty
type: Property
comment: A homepage of a school attended by the person.
domain: Person
range: Document

Open Data Rights Statement Vocabulary
created: 2013-05-31
creator: Leigh Dodds
maker: Leigh Dodds
modified: 2013-07-29
type: Thing
type: Ontology
comment: A vocabulary that supports the publication of Open Data by providing the means to capture machine-readable "rights statements", e.g. the licensing information, copyright notices and attribution requirements that are associated with the publication and re-use of a dataset.

Friend of a Friend (FOAF) vocabulary
description: The Friend of a Friend (FOAF) RDF vocabulary, described using W3C RDF Schema and the Web Ontology Language.
type: Thing
type: Ontology

copyright year
sub property of: topDataProperty
property disjoint with: bottomDataProperty
type: DatatypeProperty
comment: The year from which copyright over the content of the dataset is asserted.

Organization
property disjoint with: depiction
property disjoint with: tipjar
property disjoint with: page
term status: stable
property disjoint with: homepage
property disjoint with: interest
property disjoint with: account service homepage
type: ObjectProperty
disjoint with: Image
subclass of: Agent
disjoint with: Nothing
property disjoint with: workplace homepage
property disjoint with: openid
property disjoint with: image
disjoint with: Person
type: Thing
disjoint with: Document
subclass of: Thing
property disjoint with: Document
property disjoint with: work info homepage
property disjoint with: schoolHomepage
property disjoint with: bottomObjectProperty
disjoint with: PersonalProfileDocument
property disjoint with: is primary topic of
sub property of: topObjectProperty
property disjoint with: weblog
type: Class
property disjoint with: thumbnail
property disjoint with: publications
property disjoint with: knows
comment: An organization.

maker
sub property of: topObjectProperty
equivalent property: creator
sub property of: creator
term status: stable
inverse of: made
property disjoint with: bottomObjectProperty
type: Thing
type: ObjectProperty
comment: An agent that made this thing.
domain: Thing
type: Property
range: Agent

account
term status: archaic
type: Thing
sub property of: topObjectProperty
property disjoint with: bottomObjectProperty
type: ObjectProperty
type: Property
comment: Indicates an account held by this agent.
domain: Agent
range: Online Account

copyright notice
sub property of: topDataProperty
property disjoint with: bottomDataProperty
type: DatatypeProperty
comment: The copyright notice associated with a rights statement. A notice must typically be preserved and displayed when acknowledging the source of some data. This property is expressed as a simple literal value and so is suitable for simple copyright notices. Where a data publisher needs to reference a larger copyright statement and/or related guidance then the copyrightStatement property should be used instead.

jabber ID
term status: testing
type: Thing
sub property of: topDataProperty
property disjoint with: bottomDataProperty
type: InverseFunctionalProperty
type: DatatypeProperty
type: Property
comment: A jabber ID for something.
domain: Agent
range: Literal

past project
term status: testing
type: Thing
sub property of: topObjectProperty
property disjoint with: bottomObjectProperty
type: ObjectProperty
type: Property
comment: A project this person has previously worked on.
domain: Person
range: Thing

Online Chat Account
term status: unstable
type: Thing
disjoint with: Nothing
subclass of: Thing
subclass of: Online Account
type: Class
comment: An online chat account.

guidelines for re-users
sub property of: topObjectProperty
property disjoint with: bottomObjectProperty
type: ObjectProperty
comment: Link to a document that provides guidelines for re-users of data that is covered by a specific rights statement. The guidelines may include more detail on attribution guidelines, a fuller copyright statement, and general guidance on how the data might be re-used

account name
term status: testing
type: Thing
sub property of: topDataProperty
property disjoint with: bottomDataProperty
type: DatatypeProperty
type: Property
comment: Indicates the name (identifier) associated with this online account.
domain: Online Account
range: Literal

database right holder
sub property of: topObjectProperty
property disjoint with: bottomObjectProperty
type: ObjectProperty
comment: A reference to the organization that holds database rights over the dataset

name
term status: testing
type: Thing
sub property of: topDataProperty
property disjoint with: bottomDataProperty
type: DatatypeProperty
type: Property
comment: A name for some thing.
domain: Thing
range: Literal
sub property of: label

Online Account
term status: testing
type: Thing
disjoint with: Nothing
subclass of: Thing
type: Class
comment: An online account.

tipjar
term status: testing
type: ObjectProperty
sub property of: topObjectProperty
property disjoint with: Organization
sub property of: page
property disjoint with: bottomObjectProperty
type: Thing
type: Property
comment: A tipjar document for this agent, describing means for payment and reward.
domain: Agent
range: Document

database right year
sub property of: topDataProperty
property disjoint with: bottomDataProperty
type: DatatypeProperty
comment: The year from which a database right over the dataset is asserted.

age
term status: unstable
type: Thing
sub property of: topDataProperty
property disjoint with: bottomDataProperty
type: FunctionalProperty
type: DatatypeProperty
type: Property
comment: The age in years of some agent.
domain: Agent
range: Literal

primary topic
type: FunctionalProperty
sub property of: topic
term status: stable
type: ObjectProperty
type: Thing
inverse of: is primary topic of
sub property of: topObjectProperty
property disjoint with: bottomObjectProperty
domain: Document
range: Thing
type: Property
comment: The primary topic of some page or document.

myersBriggs
term status: testing
type: Thing
sub property of: topDataProperty
property disjoint with: bottomDataProperty
type: DatatypeProperty
type: Property
comment: A Myers Briggs (MBTI) personality classification.
domain: Person
range: Literal

Agent
type: Class
subclass of: Agent
equivalent class: Agent
subclass of: Thing
disjoint with: Nothing
type: Thing
term status: stable
comment: An agent (eg. person, group, software or physical artifact).

copyright holder
sub property of: topObjectProperty
property disjoint with: bottomObjectProperty
type: ObjectProperty
comment: A reference to the organization that holds copyright over the content of the dataset

Online Gaming Account
term status: unstable
type: Thing
disjoint with: Nothing
subclass of: Thing
subclass of: Online Account
type: Class
comment: An online gaming account.

depiction
term status: testing
inverse of: depicts
sub property of: topObjectProperty
property disjoint with: bottomObjectProperty
type: ObjectProperty
property disjoint with: Organization
type: Thing
type: Property
comment: A depiction of some thing.
domain: Thing
range: Image

compatible with
sub property of: topObjectProperty
property disjoint with: bottomObjectProperty
type: ObjectProperty
comment: This property is used to indicates that one license is compatible with another. A re-use that meets the requirements, permissions and prohibitions of the first license should also meet the requirements, permissions and prohibitions of the second, compatible license. The inverse is not necessarily true: the compatible license might have stricter requirements. This statement can be used as an indicator that a re-user could publish a derivative dataset under the compatible license, e.g. to help drive automated selection and guidance licenses for publishers of derived data. However it is not a substitute for properly reading and understanding the text of either license.

workplace homepage
term status: testing
type: Thing
sub property of: topObjectProperty
property disjoint with: Organization
property disjoint with: bottomObjectProperty
type: ObjectProperty
type: Property
comment: A workplace homepage of some person; the homepage of an organization they work for.
domain: Person
range: Document

weblog
sub property of: page
term status: testing
type: Thing
property disjoint with: bottomObjectProperty
type: InverseFunctionalProperty
property disjoint with: Organization
type: ObjectProperty
sub property of: topObjectProperty
type: Property
range: Document
comment: A weblog of some thing (whether person, group, company etc.).
domain: Agent

title
term status: testing
type: Thing
sub property of: topDataProperty
property disjoint with: bottomDataProperty
type: DatatypeProperty
type: Property
comment: Title (Mr, Mrs, Ms, Dr. etc)

thumbnail
term status: testing
type: Thing
sub property of: topObjectProperty
property disjoint with: Organization
property disjoint with: bottomObjectProperty
type: ObjectProperty
type: Property
comment: A derived thumbnail image.
domain: Image
range: Image

Person
term status: stable
subclass of: SpatialThing
disjoint with: Nothing
subclass of: Agent
disjoint with: Project
subclass of: Person
subclass of: Thing
type: Class
type: Thing
disjoint with: Organization
comment: A person.

License
disjoint with: Nothing
subclass of: Thing
type: Class
comment: A legal document that describes the legal terms for re-use of some information. A licence might be applicable to content, data, or both. This definition of licence used here is deliberately loose, and is intended to also cover waiver documents that indicate that the owner waives all rights over some information, e.g. public domain dedications.

nickname
term status: testing
type: Thing
sub property of: topDataProperty
property disjoint with: bottomDataProperty
type: DatatypeProperty
type: Property
comment: A short informal nickname characterising an agent (includes login identifiers, IRC and other chat nicknames).

Label Property
term status: unstable
type: Thing
disjoint with: Nothing
subclass of: Thing
type: Class
comment: A foaf:LabelProperty is any RDF property with texual values that serve as labels.

made
inverse of: maker
type: ObjectProperty
type: Thing
inverse of: creator
property disjoint with: bottomObjectProperty
sub property of: topObjectProperty
term status: stable
type: Property
comment: Something that was made by this agent.
domain: Agent
range: Thing

based near
term status: testing
type: Thing
sub property of: topObjectProperty
property disjoint with: bottomObjectProperty
type: ObjectProperty
type: Property
comment: A location that something is based near, for some broadly human notion of near.
domain: SpatialThing
range: SpatialThing

Surname
term status: archaic
type: Thing
sub property of: topDataProperty
property disjoint with: bottomDataProperty
type: DatatypeProperty
type: Property
comment: The surname of some person.
domain: Person
range: Literal

plan
term status: testing
type: Thing
sub property of: topDataProperty
property disjoint with: bottomDataProperty
type: DatatypeProperty
type: Property
comment: Aplan comment, in the tradition of finger and '.plan' files.
domain: Person
range: Literal

AIM chat ID
type: DatatypeProperty
property disjoint with: bottomDataProperty
sub property of: topDataProperty
type: InverseFunctionalProperty
term status: testing
type: Thing
sub property of: nickname
type: Property
domain: Agent
comment: An AIM chat ID
range: Literal

Group
type: Thing
subclass of: Agent
disjoint with: Nothing
type: Class
subclass of: Thing
term status: stable
comment: A class of Agents.

Rights Statement
disjoint with: Nothing
subclass of: Thing
type: Class
comment: A description of the rights and terms of re-use for a dataset. A rights statement will include a reference to one or more licences copyright notices, and attribution requirements. Where a Rights Statement refers to several licences the intention is that these should separately apply to the data and content associated with the dataset. An individual Rights Statement may be specific to a dataset or could be applied to a number of datasets published by the same organisation or person, where the rights associated with each dataset are identical.

geekcode
term status: archaic
type: Thing
sub property of: topDataProperty
property disjoint with: bottomDataProperty
type: DatatypeProperty
type: Property
comment: A textual geekcode for this person, see http://www.geekcode.com/geek.html
domain: Person
range: Literal

Document
term status: testing
subclass of: Thing
disjoint with: Nothing
property disjoint with: Organization
sub property of: topObjectProperty
property disjoint with: bottomObjectProperty
type: Class
disjoint with: Project
type: Thing
disjoint with: Organization
type: ObjectProperty
comment: A document.

family_name
term status: archaic
type: Thing
sub property of: topDataProperty
property disjoint with: bottomDataProperty
type: DatatypeProperty
type: Property
comment: The family name of some person.
domain: Person
range: Literal

topic
term status: testing
type: Thing
sub property of: topObjectProperty
property disjoint with: bottomObjectProperty
inverse of: page
type: ObjectProperty
type: Property
comment: A topic of some page or document.
domain: Document
range: Thing

member
term status: stable
type: Thing
sub property of: topObjectProperty
property disjoint with: bottomObjectProperty
type: ObjectProperty
type: Property
comment: Indicates a member of a Group
domain: Group
range: Agent

theme
term status: archaic
type: Thing
sub property of: topObjectProperty
property disjoint with: bottomObjectProperty
type: ObjectProperty
type: Property
comment: A theme.
domain: Thing
range: Thing

publications
term status: testing
type: Thing
sub property of: topObjectProperty
property disjoint with: Organization
property disjoint with: bottomObjectProperty
type: ObjectProperty
type: Property
comment: A link to the publications of this person.
domain: Person
range: Document