tunnels
in scheme: http://www.geonames.org/ontology#R
definition: subterranean passageways for transportation
type: Concept
type: Code
type: Thing

population
sub property of: topDataProperty
property disjoint with: bottomDataProperty
type: DatatypeProperty
domain: Feature

cordillera
in scheme: http://www.geonames.org/ontology#U
definition: an entire mountain system including the subordinate ranges, interior plateaus, and basins
type: Concept
type: Code
type: Thing

quicksand
in scheme: http://www.geonames.org/ontology#L
definition: an area where loose sand with water moving through it may become unstable when heavy objects are placed at the surface, causing them to sink
type: Concept
type: Code
type: Thing

storehouse
in scheme: http://www.geonames.org/ontology#S
definition: a building for storing goods, especially provisions
type: Concept
type: Code
type: Thing

diatomite mine(s)
in scheme: http://www.geonames.org/ontology#S
definition: a place where diatomaceous earth is extracted
type: Concept
type: Code
type: Thing

area
in scheme: http://www.geonames.org/ontology#L
definition: a tract of land without homogeneous character or boundaries
type: Concept
type: Code
type: Thing

upland
in scheme: http://www.geonames.org/ontology#T
definition: an extensive interior region of high land with low to moderate surface relief
type: Concept
type: Code
type: Thing

school
in scheme: http://www.geonames.org/ontology#S
definition: building(s) where instruction in one or more branches of knowledge takes place
type: Concept
type: Code
type: Thing

deep
in scheme: http://www.geonames.org/ontology#U
definition: a localized deep area within the confines of a larger feature, such as a trough, basin or trench
type: Concept
type: Code
type: Thing

lava area
in scheme: http://www.geonames.org/ontology#T
definition: an area of solidified lava
type: Concept
type: Code
type: Thing

Temp Work Office
in scheme: http://www.geonames.org/ontology#S
definition: Temporary Work Offices
type: Concept
type: Code
type: Thing

peaks
in scheme: http://www.geonames.org/ontology#T
definition: pointed elevations atop a mountain, ridge, or other hypsographic features
type: Concept
type: Code
type: Thing

lake channel(s)
in scheme: http://www.geonames.org/ontology#H
definition: that part of a lake having water deep enough for navigation between islands, shoals, etc.
type: Concept
type: Code
type: Thing

alternate name
sub property of: topDataProperty
sub property of: altLabel
property disjoint with: bottomDataProperty
type: DatatypeProperty
comment: An alternate name for a feature
domain: Feature

breakwater
in scheme: http://www.geonames.org/ontology#S
definition: a structure erected to break the force of waves at the entrance to a harbor or port
type: Concept
type: Code
type: Thing

shoal
in scheme: http://www.geonames.org/ontology#U
definition: a surface-navigation hazard composed of unconsolidated material
type: Concept
type: Code
type: Thing

island
in scheme: http://www.geonames.org/ontology#T
definition: a tract of land, smaller than a continent, surrounded by water at high water
type: Concept
type: Code
type: Thing

well
in scheme: http://www.geonames.org/ontology#H
definition: a cylindrical hole, pit, or tunnel drilled or dug down to a depth from which water, oil, or gas can be pumped or brought to the surface
type: Concept
type: Code
type: Thing

section of harbor
in scheme: http://www.geonames.org/ontology#H
definition: _
type: Concept
type: Code
type: Thing

grazing area
in scheme: http://www.geonames.org/ontology#L
definition: an area of grasses and shrubs used for grazing
type: Concept
type: Code
type: Thing

post office
in scheme: http://www.geonames.org/ontology#S
definition: a public building in which mail is received, sorted and distributed
type: Concept
type: Code
type: Thing

desert
in scheme: http://www.geonames.org/ontology#T
definition: a large area with little or no vegetation due to extreme environmental conditions
type: Concept
type: Code
type: Thing

interdune trough(s)
in scheme: http://www.geonames.org/ontology#T
definition: a long wind-swept trough between parallel longitudinal dunes
type: Concept
type: Code
type: Thing

dry stream bed
in scheme: http://www.geonames.org/ontology#T
definition: a channel formerly containing the water of a stream
type: Concept
type: Code
type: Thing

badlands
in scheme: http://www.geonames.org/ontology#T
definition: an area characterized by a maze of very closely spaced, deep, narrow, steep-sided ravines, and sharp crests and pinnacles
type: Concept
type: Code
type: Thing

abandoned canal
in scheme: http://www.geonames.org/ontology#H
definition: _
type: Concept
type: Code
type: Thing

golf course
in scheme: http://www.geonames.org/ontology#S
definition: a recreation field where golf is played
type: Concept
type: Code
type: Thing

portage
in scheme: http://www.geonames.org/ontology#R
definition: a place where boats, goods, etc., are carried overland between navigable waters
type: Concept
type: Code
type: Thing

atoll(s)
in scheme: http://www.geonames.org/ontology#T
definition: a ring-shaped coral reef which has closely spaced islands on it encircling a lagoon
type: Concept
type: Code
type: Thing

veterinary facility
in scheme: http://www.geonames.org/ontology#S
definition: a building or camp at which veterinary services are available
type: Concept
type: Code
type: Thing

section of lake
in scheme: http://www.geonames.org/ontology#H
definition: _
type: Concept
type: Code
type: Thing

shrine
in scheme: http://www.geonames.org/ontology#S
definition: a structure or place memorializing a person or religious concept
type: Concept
type: Code
type: Thing

reach
in scheme: http://www.geonames.org/ontology#H
definition: a straight section of a navigable stream or channel between two bends
type: Concept
type: Code
type: Thing

sand area
in scheme: http://www.geonames.org/ontology#T
definition: a tract of land covered with sand
type: Concept
type: Code
type: Thing

crater(s)
in scheme: http://www.geonames.org/ontology#T
definition: a generally circular saucer or bowl-shaped depression caused by volcanic or meteorite explosive action
type: Concept
type: Code
type: Thing

casino
in scheme: http://www.geonames.org/ontology#S
definition: a building used for entertainment, especially gambling
type: Concept
type: Code
type: Thing

Map
disjoint with: Nothing
subclass of: Thing
subclass of: Document
type: Class
comment: A Web page displaying a map

restaurant
in scheme: http://www.geonames.org/ontology#S
definition: A place where meals are served to the public
type: Concept
type: Code
type: Thing

stream
in scheme: http://www.geonames.org/ontology#H
definition: a body of running water moving to a lower level in a channel on land
type: Concept
type: Code
type: Thing

natural tunnel
in scheme: http://www.geonames.org/ontology#R
definition: a cave that is open at both ends
type: Concept
type: Code
type: Thing

lagoon
in scheme: http://www.geonames.org/ontology#H
definition: a shallow coastal waterbody, completely or partly separated from a larger body of water by a barrier island, coral reef or other depositional feature
type: Concept
type: Code
type: Thing

railroad stop
in scheme: http://www.geonames.org/ontology#S
definition: a place lacking station facilities where trains stop to pick up and unload passengers and freight
type: Concept
type: Code
type: Thing

ledge
in scheme: http://www.geonames.org/ontology#U
definition: a rocky projection or outcrop, commonly linear and near shore
type: Concept
type: Code
type: Thing

hydroelectric power station
in scheme: http://www.geonames.org/ontology#S
definition: a building where electricity is generated from water power
type: Concept
type: Code
type: Thing

escarpment (or scarp)
in scheme: http://www.geonames.org/ontology#U
definition: an elongated and comparatively steep slope separating flat or gently sloping areas
type: Concept
type: Code
type: Thing

caldera
in scheme: http://www.geonames.org/ontology#T
definition: a depression measuring kilometers across formed by the collapse of a volcanic mountain
type: Concept
type: Code
type: Thing

hunting reserve
in scheme: http://www.geonames.org/ontology#L
definition: a tract of land used primarily for hunting
type: Concept
type: Code
type: Thing

intermittent stream
in scheme: http://www.geonames.org/ontology#H
definition: _
type: Concept
type: Code
type: Thing

sandy desert
in scheme: http://www.geonames.org/ontology#T
definition: an extensive tract of shifting sand and sand dunes
type: Concept
type: Code
type: Thing

orchard(s)
in scheme: http://www.geonames.org/ontology#V
definition: a planting of fruit or nut trees
type: Concept
type: Code
type: Thing

water tank
in scheme: http://www.geonames.org/ontology#H
definition: a contained pool or tank of water at, below, or above ground level
type: Concept
type: Code
type: Thing

building(s)
in scheme: http://www.geonames.org/ontology#S
definition: a structure built for permanent use, as a house, factory, etc.
type: Concept
type: Code
type: Thing

terrace
in scheme: http://www.geonames.org/ontology#T
definition: a long, narrow alluvial platform bounded by steeper slopes above and below, usually overlooking a waterbody
type: Concept
type: Code
type: Thing

patrol post
in scheme: http://www.geonames.org/ontology#S
definition: a post from which patrols are sent out
type: Concept
type: Code
type: Thing

escarpment
in scheme: http://www.geonames.org/ontology#T
definition: a long line of cliffs or steep slopes separating level surfaces above and below
type: Concept
type: Code
type: Thing

hot spring(s)
in scheme: http://www.geonames.org/ontology#H
definition: a place where hot ground water flows naturally out of the ground
type: Concept
type: Code
type: Thing

section of lagoon
in scheme: http://www.geonames.org/ontology#H
definition: _
type: Concept
type: Code
type: Thing

estuary
in scheme: http://www.geonames.org/ontology#H
definition: a funnel-shaped stream mouth or embayment where fresh water mixes with sea water under tidal influences
type: Concept
type: Code
type: Thing

park gate
in scheme: http://www.geonames.org/ontology#S
definition: a controlled access to a park
type: Concept
type: Code
type: Thing

current
in scheme: http://www.geonames.org/ontology#H
definition: a horizontal flow of water in a given direction with uniform velocity
type: Concept
type: Code
type: Thing

cirque
in scheme: http://www.geonames.org/ontology#T
definition: a bowl-like hollow partially surrounded by cliffs or steep slopes at the head of a glaciated valley
type: Concept
type: Code
type: Thing

mound
in scheme: http://www.geonames.org/ontology#U
definition: a low, isolated, rounded hill
type: Concept
type: Code
type: Thing

wadi mouth
in scheme: http://www.geonames.org/ontology#H
definition: the lower terminus of a wadi where it widens into an adjoining floodplain, depression, or waterbody
type: Concept
type: Code
type: Thing

lakes
in scheme: http://www.geonames.org/ontology#H
definition: large inland bodies of standing water
type: Concept
type: Code
type: Thing

radio observatory
in scheme: http://www.geonames.org/ontology#S
definition: a facility equipped with an array of antennae for receiving radio waves from space
type: Concept
type: Code
type: Thing

sabkha(s)
in scheme: http://www.geonames.org/ontology#H
definition: a salt flat or salt encrusted plain subject to periodic inundation from flooding or high tides
type: Concept
type: Code
type: Thing

http://www.geonames.org/ontology#H
type: ConceptScheme
type: Class
type: Thing
comment: stream, lake, ...

section of peninsula
in scheme: http://www.geonames.org/ontology#T
definition: _
type: Concept
type: Code
type: Thing

scientific research base
in scheme: http://www.geonames.org/ontology#S
definition: a scientific facility used as a base from which research is carried out or monitored
type: Concept
type: Code
type: Thing

seamounts
in scheme: http://www.geonames.org/ontology#U
definition: elevations rising generally more than 1,000 meters and of limited extent across the summit
type: Concept
type: Code
type: Thing

promenade
in scheme: http://www.geonames.org/ontology#R
definition: a place for public walking, usually along a beach front
type: Concept
type: Code
type: Thing

oil pipeline terminal
in scheme: http://www.geonames.org/ontology#S
definition: a tank farm or loading facility at the end of an oil pipeline
type: Concept
type: Code
type: Thing

distributary(-ies)
in scheme: http://www.geonames.org/ontology#H
definition: a branch which flows away from the main stream, as in a delta or irrigation canal
type: Concept
type: Code
type: Thing

cove(s)
in scheme: http://www.geonames.org/ontology#H
definition: a small coastal indentation, smaller than a bay
type: Concept
type: Code
type: Thing

seamount
in scheme: http://www.geonames.org/ontology#U
definition: an elevation rising generally more than 1,000 meters and of limited extent across the summit
type: Concept
type: Code
type: Thing

satellite station
in scheme: http://www.geonames.org/ontology#S
definition: a facility for tracking and communicating with orbiting satellites
type: Concept
type: Code
type: Thing

flat
in scheme: http://www.geonames.org/ontology#U
definition: a small level or nearly level area
type: Concept
type: Code
type: Thing

lagoons
in scheme: http://www.geonames.org/ontology#H
definition: shallow coastal waterbodies, completely or partly separated from a larger body of water by a barrier island, coral reef or other depositional feature
type: Concept
type: Code
type: Thing

railroad yard
in scheme: http://www.geonames.org/ontology#R
definition: a system of tracks used for the making up of trains, and switching and storing freight cars
type: Concept
type: Code
type: Thing

icecap depression
in scheme: http://www.geonames.org/ontology#H
definition: a comparatively depressed area on an icecap
type: Concept
type: Code
type: Thing

lost river
in scheme: http://www.geonames.org/ontology#H
definition: a surface stream that disappears into an underground channel, or dries up in an arid area
type: Concept
type: Code
type: Thing

spur
in scheme: http://www.geonames.org/ontology#U
definition: a subordinate elevation, ridge, or rise projecting outward from a larger feature
type: Concept
type: Code
type: Thing

airbase
in scheme: http://www.geonames.org/ontology#S
definition: an area used to store supplies, provide barracks for air force personnel, hangars and runways for aircraft, and from which operations are initiated
type: Concept
type: Code
type: Thing

valleys
in scheme: http://www.geonames.org/ontology#U
definition: a relatively shallow, wide depression, the bottom of which usually has a continuous gradient
type: Concept
type: Code
type: Thing

blowhole(s)
in scheme: http://www.geonames.org/ontology#T
definition: a hole in coastal rock through which sea water is forced by a rising tide or waves and spurted through an outlet into the air
type: Concept
type: Code
type: Thing

maritime school
in scheme: http://www.geonames.org/ontology#S
definition: a school at which maritime sciences form the core of the curriculum
type: Concept
type: Code
type: Thing

neighbouring features
sub property of: topObjectProperty
property disjoint with: bottomObjectProperty
type: ObjectProperty
comment: Links to an RDF document containing the descriptions of neighbouring features. Applies when the feature has definite boarders.
domain: Feature
range: RDF Data

salt lake
in scheme: http://www.geonames.org/ontology#H
definition: an inland body of salt water with no outlet
type: Concept
type: Code
type: Thing

section of plain
in scheme: http://www.geonames.org/ontology#T
definition: _
type: Concept
type: Code
type: Thing

wall
in scheme: http://www.geonames.org/ontology#S
definition: a thick masonry structure, usually enclosing a field or building, or forming the side of a structure
type: Concept
type: Code
type: Thing

feature code
sub property of: topObjectProperty
sub property of: subject
property disjoint with: bottomObjectProperty
type: ObjectProperty
comment: Type of the feature, as defined in geonames taxonomy.
domain: Feature
range: Code

beacon
in scheme: http://www.geonames.org/ontology#S
definition: a fixed artificial navigation mark
type: Concept
type: Code
type: Thing

mission
in scheme: http://www.geonames.org/ontology#S
definition: a place characterized by dwellings, school, church, hospital and other facilities operated by a religious group for the purpose of providing charitable services and to propagate religion
type: Concept
type: Code
type: Thing

shoal(s)
in scheme: http://www.geonames.org/ontology#H
definition: a surface-navigation hazard composed of unconsolidated material
type: Concept
type: Code
type: Thing

wikipedia article
sub property of: topObjectProperty
property disjoint with: bottomObjectProperty
type: ObjectProperty
comment: A Wikipedia article of which subject is the resource.
domain: Feature
range: Wikipedia Article

grassland
in scheme: http://www.geonames.org/ontology#V
definition: an area dominated by grass vegetation
type: Concept
type: Code
type: Thing

abandoned camp
in scheme: http://www.geonames.org/ontology#S
definition: _
type: Concept
type: Code
type: Thing

pinnacle
in scheme: http://www.geonames.org/ontology#U
definition: a high tower or spire-shaped pillar of rock or coral, alone or cresting a summit
type: Concept
type: Code
type: Thing

section of canal
in scheme: http://www.geonames.org/ontology#H
definition: _
type: Concept
type: Code
type: Thing

neighbour
sub property of: topObjectProperty
property disjoint with: bottomObjectProperty
type: ObjectProperty
comment: A feature sharing a common boarder with the reference feature
domain: Feature
range: Feature

peak
in scheme: http://www.geonames.org/ontology#T
definition: a pointed elevation atop a mountain, ridge, or other hypsographic feature
type: Concept
type: Code
type: Thing

mountains
in scheme: http://www.geonames.org/ontology#T
definition: a mountain range or a group of mountains or high ridges
type: Concept
type: Code
type: Thing

farms
in scheme: http://www.geonames.org/ontology#S
definition: tracts of land with associated buildings devoted to agriculture
type: Concept
type: Code
type: Thing

http://www.geonames.org/ontology#T
type: ConceptScheme
type: Class
type: Thing
comment: mountain, hill, rock, ...

republic
in scheme: http://www.geonames.org/ontology#L
definition: _
type: Concept
type: Code
type: Thing

bight(s)
in scheme: http://www.geonames.org/ontology#H
definition: an open body of water forming a slight recession in a coastline
type: Concept
type: Code
type: Thing

feature class
sub property of: topObjectProperty
sub property of: subject
property disjoint with: bottomObjectProperty
type: ObjectProperty
comment: The main category of the feature, as defined in geonames taxonomy.
domain: Feature
range: Class

bush(es)
in scheme: http://www.geonames.org/ontology#V
definition: a small clump of conspicuous bushes in an otherwise bare area
type: Concept
type: Code
type: Thing

Class
disjoint with: Nothing
subclass of: ConceptScheme
subclass of: Thing
comment: A class of features.

oil well
in scheme: http://www.geonames.org/ontology#S
definition: a well from which oil may be pumped
type: Concept
type: Code
type: Thing

stony desert
in scheme: http://www.geonames.org/ontology#T
definition: a desert plain characterized by a surface veneer of gravel and stones
type: Concept
type: Code
type: Thing

knolls
in scheme: http://www.geonames.org/ontology#U
definition: elevations rising generally more than 500 meters and less than 1,000 meters and of limited extent across the summits
type: Concept
type: Code
type: Thing

name
sub property of: prefLabel
sub property of: topDataProperty
property disjoint with: bottomDataProperty
type: DatatypeProperty
comment: The preferred name of the feature.
domain: Feature

canal bend
in scheme: http://www.geonames.org/ontology#H
definition: a conspicuously curved or bent section of a canal
type: Concept
type: Code
type: Thing

first-order administrative division
in scheme: http://www.geonames.org/ontology#A
definition: a primary administrative division of a country, such as a state in the United States
type: Concept
type: Code
type: Thing

territory
in scheme: http://www.geonames.org/ontology#A
definition: _
type: Concept
type: Code
type: Thing

hut
in scheme: http://www.geonames.org/ontology#S
definition: a small primitive house
type: Concept
type: Code
type: Thing

port
in scheme: http://www.geonames.org/ontology#L
definition: a place provided with terminal and transfer facilities for loading and discharging waterborne cargo or passengers, usually located in a harbor
type: Concept
type: Code
type: Thing

butte(s)
in scheme: http://www.geonames.org/ontology#T
definition: a small, isolated, usually flat-topped hill with steep sides
type: Concept
type: Code
type: Thing

navigation channel
in scheme: http://www.geonames.org/ontology#H
definition: a buoyed channel of sufficient depth for the safe navigation of vessels
type: Concept
type: Code
type: Thing

intermittent lake
in scheme: http://www.geonames.org/ontology#H
definition: _
type: Concept
type: Code
type: Thing

fuel depot
in scheme: http://www.geonames.org/ontology#S
definition: an area where fuel is stored
type: Concept
type: Code
type: Thing

ferry
in scheme: http://www.geonames.org/ontology#S
definition: a boat or other floating conveyance and terminal facilities regularly used to transport people and vehicles across a waterbody
type: Concept
type: Code
type: Thing

mole
in scheme: http://www.geonames.org/ontology#S
definition: a massive structure of masonry or large stones serving as a pier or breakwater
type: Concept
type: Code
type: Thing

ravine
in scheme: http://www.geonames.org/ontology#U
definition: a small canyon
type: Concept
type: Code
type: Thing

mangrove swamp
in scheme: http://www.geonames.org/ontology#H
definition: a tropical tidal mud flat characterized by mangrove vegetation
type: Concept
type: Code
type: Thing

hotel
in scheme: http://www.geonames.org/ontology#S
definition: a building providing lodging and/or meals for the public
type: Concept
type: Code
type: Thing

section of island
in scheme: http://www.geonames.org/ontology#T
definition: _
type: Concept
type: Code
type: Thing

nursery(-ies)
in scheme: http://www.geonames.org/ontology#S
definition: a place where plants are propagated for transplanting or grafting
type: Concept
type: Code
type: Thing

logging camp
in scheme: http://www.geonames.org/ontology#S
definition: a camp used by loggers
type: Concept
type: Code
type: Thing

underground lake
in scheme: http://www.geonames.org/ontology#H
definition: a standing body of water in a cave
type: Concept
type: Code
type: Thing

road tunnel
in scheme: http://www.geonames.org/ontology#R
definition: a tunnel through which a road passes
type: Concept
type: Code
type: Thing

munitions plant
in scheme: http://www.geonames.org/ontology#S
definition: a factory where ammunition is made
type: Concept
type: Code
type: Thing

waterhole(s)
in scheme: http://www.geonames.org/ontology#H
definition: a natural hole, hollow, or small depression that contains water, used by man and animals, especially in arid areas
type: Concept
type: Code
type: Thing

Wikipedia Article
disjoint with: Nothing
subclass of: Thing
subclass of: Document
type: Class
comment: A Wikipedia article

gas-oil separator plant
in scheme: http://www.geonames.org/ontology#S
definition: a facility for separating gas from oil
type: Concept
type: Code
type: Thing

snowfield
in scheme: http://www.geonames.org/ontology#L
definition: an area of permanent snow and ice forming the accumulation area of a glacier
type: Concept
type: Code
type: Thing

landing
in scheme: http://www.geonames.org/ontology#S
definition: a place where boats receive or discharge passengers and freight, but lacking most port facilities
type: Concept
type: Code
type: Thing

mining camp
in scheme: http://www.geonames.org/ontology#S
definition: a camp used by miners
type: Concept
type: Code
type: Thing

inspection station
in scheme: http://www.geonames.org/ontology#S
definition: a station at which vehicles, goods, and people are inspected
type: Concept
type: Code
type: Thing

wetland
in scheme: http://www.geonames.org/ontology#H
definition: an area subject to inundation, usually characterized by bog, marsh, or swamp vegetation
type: Concept
type: Code
type: Thing

gorge(s)
in scheme: http://www.geonames.org/ontology#T
definition: a short, narrow, steep-sided section of a stream valley
type: Concept
type: Code
type: Thing

oil refinery
in scheme: http://www.geonames.org/ontology#S
definition: a facility for converting crude oil into refined petroleum products
type: Concept
type: Code
type: Thing

intermittent salt pond(s)
in scheme: http://www.geonames.org/ontology#H
definition: _
type: Concept
type: Code
type: Thing

road bend
in scheme: http://www.geonames.org/ontology#R
definition: a conspicuously curved or bent section of a road
type: Concept
type: Code
type: Thing

abandoned populated place
in scheme: http://www.geonames.org/ontology#P
definition: _
type: Concept
type: Code
type: Thing

hole
in scheme: http://www.geonames.org/ontology#U
definition: a small depression of the sea floor
type: Concept
type: Code
type: Thing

clearing
in scheme: http://www.geonames.org/ontology#L
definition: an area in a forest with trees removed
type: Concept
type: Code
type: Thing

oilfield
in scheme: http://www.geonames.org/ontology#L
definition: an area containing a subterranean store of petroleum of economic value
type: Concept
type: Code
type: Thing

nickel mine(s)
in scheme: http://www.geonames.org/ontology#S
definition: a mine where nickel ore is extracted
type: Concept
type: Code
type: Thing

Driving School
in scheme: http://www.geonames.org/ontology#S
definition: Driving School
type: Concept
type: Code
type: Thing

intermittent oxbow lake
in scheme: http://www.geonames.org/ontology#H
definition: _
type: Concept
type: Code
type: Thing

salt marsh
in scheme: http://www.geonames.org/ontology#H
definition: a flat area, subject to periodic salt water inundation, dominated by grassy salt-tolerant plants
type: Concept
type: Code
type: Thing

plateau
in scheme: http://www.geonames.org/ontology#T
definition: an elevated plain with steep slopes on one or more sides, and often with incised streams
type: Concept
type: Code
type: Thing

mesa
in scheme: http://www.geonames.org/ontology#U
definition: an isolated, extensive, flat-topped elevation on the shelf, with relatively steep sides
type: Concept
type: Code
type: Thing

fort
in scheme: http://www.geonames.org/ontology#S
definition: a defensive structure or earthworks
type: Concept
type: Code
type: Thing

fissure
in scheme: http://www.geonames.org/ontology#T
definition: a crack associated with volcanism
type: Concept
type: Code
type: Thing

peat cutting area
in scheme: http://www.geonames.org/ontology#L
definition: an area where peat is harvested
type: Concept
type: Code
type: Thing

leased area
in scheme: http://www.geonames.org/ontology#A
definition: a tract of land leased by the United Kingdom from the People's Republic of China to form part of Hong Kong
type: Concept
type: Code
type: Thing

canyons
in scheme: http://www.geonames.org/ontology#U
definition: relatively narrow, deep depressions with steep sides, the bottom of which generally has a continuous slope
type: Concept
type: Code
type: Thing

stock route
in scheme: http://www.geonames.org/ontology#R
definition: a route taken by livestock herds
type: Concept
type: Code
type: Thing

islands
in scheme: http://www.geonames.org/ontology#T
definition: tracts of land, smaller than a continent, surrounded by water at high water
type: Concept
type: Code
type: Thing

seaplane landing area
in scheme: http://www.geonames.org/ontology#H
definition: a place on a waterbody where floatplanes land and take off
type: Concept
type: Code
type: Thing

navigation canal(s)
in scheme: http://www.geonames.org/ontology#H
definition: a watercourse constructed for navigation of vessels
type: Concept
type: Code
type: Thing

parish
in scheme: http://www.geonames.org/ontology#A
definition: an ecclesiastical district
type: Concept
type: Code
type: Thing

beach
in scheme: http://www.geonames.org/ontology#T
definition: a shore zone of coarse unconsolidated sediment that extends from the low-water line to the highest reach of storm waves
type: Concept
type: Code
type: Thing

facility center
in scheme: http://www.geonames.org/ontology#S
definition: a place where more than one facility is situated
type: Concept
type: Code
type: Thing

landfill
in scheme: http://www.geonames.org/ontology#S
definition: a place for trash and garbage disposal in which the waste is buried between layers of earth to build up low-lying land
type: Concept
type: Code
type: Thing

glacier(s)
in scheme: http://www.geonames.org/ontology#H
definition: a mass of ice, usually at high latitudes or high elevations, with sufficient thickness to flow away from the source area in lobes, tongues, or masses
type: Concept
type: Code
type: Thing

peak
in scheme: http://www.geonames.org/ontology#U
definition: a prominent elevation, part of a larger feature, either pointed or of very limited extent across the summit
type: Concept
type: Code
type: Thing

tidal creek(s)
in scheme: http://www.geonames.org/ontology#H
definition: a meandering channel in a coastal wetland subject to bi-directional tidal currents
type: Concept
type: Code
type: Thing

master source holdings list
in scheme: http://www.geonames.org/ontology#L
definition: _
type: Concept
type: Code
type: Thing

watercourse
in scheme: http://www.geonames.org/ontology#H
definition: a natural, well-defined channel produced by flowing water, or an artificial channel designed to carry flowing water
type: Concept
type: Code
type: Thing

dry dock
in scheme: http://www.geonames.org/ontology#S
definition: a dock providing support for a vessel, and means for removing the water so that the bottom of the vessel can be exposed
type: Concept
type: Code
type: Thing

ocean
in scheme: http://www.geonames.org/ontology#H
definition: one of the major divisions of the vast expanse of salt water covering part of the earth
type: Concept
type: Code
type: Thing

rapids
in scheme: http://www.geonames.org/ontology#H
definition: a turbulent section of a stream associated with a steep, irregular stream bed
type: Concept
type: Code
type: Thing

ISO country code
sub property of: topDataProperty
property disjoint with: bottomDataProperty
type: DatatypeProperty
comment: A two letters country code in the ISO 3166 list
domain: Feature

leprosarium
in scheme: http://www.geonames.org/ontology#S
definition: an asylum or hospital for lepers
type: Concept
type: Code
type: Thing

geyser
in scheme: http://www.geonames.org/ontology#H
definition: a type of hot spring with intermittent eruptions of jets of hot water and steam
type: Concept
type: Code
type: Thing

saddle
in scheme: http://www.geonames.org/ontology#U
definition: a low part, resembling in shape a saddle, in a ridge or between contiguous seamounts
type: Concept
type: Code
type: Thing

knoll
in scheme: http://www.geonames.org/ontology#U
definition: an elevation rising generally more than 500 meters and less than 1,000 meters and of limited extent across the summit
type: Concept
type: Code
type: Thing

vineyard
in scheme: http://www.geonames.org/ontology#V
definition: a planting of grapevines
type: Concept
type: Code
type: Thing

palm grove
in scheme: http://www.geonames.org/ontology#V
definition: a planting of palm trees
type: Concept
type: Code
type: Thing

salt lakes
in scheme: http://www.geonames.org/ontology#H
definition: inland bodies of salt water with no outlet
type: Concept
type: Code
type: Thing

marsh(es)
in scheme: http://www.geonames.org/ontology#H
definition: a wetland dominated by grass-like vegetation
type: Concept
type: Code
type: Thing

asylum
in scheme: http://www.geonames.org/ontology#S
definition: a facility where the insane are cared for and protected
type: Concept
type: Code
type: Thing

wharf(-ves)
in scheme: http://www.geonames.org/ontology#S
definition: a structure of open rather than solid construction along a shore or a bank which provides berthing for ships and cargo-handling facilities
type: Concept
type: Code
type: Thing

labor camp
in scheme: http://www.geonames.org/ontology#S
definition: a camp used by migrant or temporary laborers
type: Concept
type: Code
type: Thing

section of reef
in scheme: http://www.geonames.org/ontology#H
definition: _
type: Concept
type: Code
type: Thing

ditch mouth(s)
in scheme: http://www.geonames.org/ontology#H
definition: an area where a drainage ditch enters a lagoon, lake or bay
type: Concept
type: Code
type: Thing

bench
in scheme: http://www.geonames.org/ontology#T
definition: a long, narrow bedrock platform bounded by steeper slopes above and below, usually overlooking a waterbody
type: Concept
type: Code
type: Thing

fork
in scheme: http://www.geonames.org/ontology#U
definition: a branch of a canyon or valley
type: Concept
type: Code
type: Thing

saddle
in scheme: http://www.geonames.org/ontology#T
definition: a broad, open pass crossing a ridge or between hills or mountains
type: Concept
type: Code
type: Thing

hospital
in scheme: http://www.geonames.org/ontology#S
definition: a building in which sick or injured, especially those confined to bed, are medically treated
type: Concept
type: Code
type: Thing

populated locality
in scheme: http://www.geonames.org/ontology#P
definition: an area similar to a locality but with a small group of dwellings or other buildings
type: Concept
type: Code
type: Thing

tower
in scheme: http://www.geonames.org/ontology#S
definition: a high conspicuous structure, typically much higher than its diameter
type: Concept
type: Code
type: Thing

bridge
in scheme: http://www.geonames.org/ontology#S
definition: a structure erected across an obstacle such as a stream, road, etc., in order to carry roads, railroads, and pedestrians across
type: Concept
type: Code
type: Thing

convent
in scheme: http://www.geonames.org/ontology#S
definition: a building where a community of nuns lives in seclusion
type: Concept
type: Code
type: Thing

street
in scheme: http://www.geonames.org/ontology#R
definition: a paved urban thoroughfare
type: Concept
type: Code
type: Thing

ruined bridge
in scheme: http://www.geonames.org/ontology#S
definition: a destroyed or decayed bridge which is no longer functional
type: Concept
type: Code
type: Thing

mosque
in scheme: http://www.geonames.org/ontology#S
definition: a building for public Islamic worship
type: Concept
type: Code
type: Thing

karst area
in scheme: http://www.geonames.org/ontology#T
definition: a distinctive landscape developed on soluble rock such as limestone characterized by sinkholes, caves, disappearing streams, and underground drainage
type: Concept
type: Code
type: Thing

canyon
in scheme: http://www.geonames.org/ontology#T
definition: a deep, narrow valley with steep sides cutting into a plateau or mountainous area
type: Concept
type: Code
type: Thing

triangulation station
in scheme: http://www.geonames.org/ontology#S
definition: a point on the earth whose position has been determined by triangulation
type: Concept
type: Code
type: Thing

meadow
in scheme: http://www.geonames.org/ontology#V
definition: a small, poorly drained area dominated by grassy vegetation
type: Concept
type: Code
type: Thing

scrubland
in scheme: http://www.geonames.org/ontology#V
definition: an area of low trees, bushes, and shrubs stunted by some environmental limitation
type: Concept
type: Code
type: Thing

reservation
in scheme: http://www.geonames.org/ontology#L
definition: a tract of land set aside for aboriginal, tribal, or native populations
type: Concept
type: Code
type: Thing

harbor(s)
in scheme: http://www.geonames.org/ontology#H
definition: a haven or space of deep water so sheltered by the adjacent land as to afford a safe anchorage for ships
type: Concept
type: Code
type: Thing

semi-independent political entity
in scheme: http://www.geonames.org/ontology#A
definition: _
type: Concept
type: Code
type: Thing

irrigation canal
in scheme: http://www.geonames.org/ontology#H
definition: a canal which serves as a main conduit for irrigation water
type: Concept
type: Code
type: Thing

buffer zone
in scheme: http://www.geonames.org/ontology#A
definition: a zone recognized as a buffer between two nations in which military presence is minimal or absent
type: Concept
type: Code
type: Thing

wadi
in scheme: http://www.geonames.org/ontology#H
definition: a valley or ravine, bounded by relatively steep banks, which in the rainy season becomes a watercourse; found primarily in North Africa and the Middle East
type: Concept
type: Code
type: Thing

atomic center
in scheme: http://www.geonames.org/ontology#S
definition: a facility where atomic research is carried out
type: Concept
type: Code
type: Thing

hermitage
in scheme: http://www.geonames.org/ontology#S
definition: a secluded residence, usually for religious sects
type: Concept
type: Code
type: Thing

lighthouse
in scheme: http://www.geonames.org/ontology#S
definition: a distinctive structure exhibiting a major navigation light
type: Concept
type: Code
type: Thing

wadi junction
in scheme: http://www.geonames.org/ontology#H
definition: a place where two or more wadies join
type: Concept
type: Code
type: Thing

prison
in scheme: http://www.geonames.org/ontology#S
definition: a facility for confining prisoners
type: Concept
type: Code
type: Thing

cannery
in scheme: http://www.geonames.org/ontology#S
definition: a building where food items are canned
type: Concept
type: Code
type: Thing

former causeway
in scheme: http://www.geonames.org/ontology#R
definition: a causeway no longer used for transportation
type: Concept
type: Code
type: Thing

copper mine(s)
in scheme: http://www.geonames.org/ontology#S
definition: a mine where copper ore is extracted
type: Concept
type: Code
type: Thing

tribal area
in scheme: http://www.geonames.org/ontology#L
definition: a tract of land used by nomadic or other tribes
type: Concept
type: Code
type: Thing

vineyards
in scheme: http://www.geonames.org/ontology#V
definition: plantings of grapevines
type: Concept
type: Code
type: Thing

forest(s)
in scheme: http://www.geonames.org/ontology#V
definition: an area dominated by tree vegetation
type: Concept
type: Code
type: Thing

salt evaporation ponds
in scheme: http://www.geonames.org/ontology#H
definition: diked salt ponds used in the production of solar evaporated salt
type: Concept
type: Code
type: Thing

icecap dome
in scheme: http://www.geonames.org/ontology#H
definition: a comparatively elevated area on an icecap
type: Concept
type: Code
type: Thing

rookery
in scheme: http://www.geonames.org/ontology#S
definition: a breeding place of a colony of birds or seals
type: Concept
type: Code
type: Thing

religious center
in scheme: http://www.geonames.org/ontology#S
definition: a facility where more than one religious activity is carried out, e.g., retreat, school, monastery, worship
type: Concept
type: Code
type: Thing

intermittent lakes
in scheme: http://www.geonames.org/ontology#H
definition: _
type: Concept
type: Code
type: Thing

plain(s)
in scheme: http://www.geonames.org/ontology#T
definition: an extensive area of comparatively level to gently undulating land, lacking surface irregularities, and usually adjacent to a higher area
type: Concept
type: Code
type: Thing

cattle dipping tank
in scheme: http://www.geonames.org/ontology#S
definition: a small artificial pond used for immersing cattle in chemically treated water for disease control
type: Concept
type: Code
type: Thing

estate(s)
in scheme: http://www.geonames.org/ontology#S
definition: a large commercialized agricultural landholding with associated buildings and other facilities
type: Concept
type: Code
type: Thing

anabranch
in scheme: http://www.geonames.org/ontology#H
definition: a diverging branch flowing out of a main stream and rejoining it downstream
type: Concept
type: Code
type: Thing

seat of government of a political entity
in scheme: http://www.geonames.org/ontology#P
definition: _
type: Concept
type: Code
type: Thing

pan
in scheme: http://www.geonames.org/ontology#T
definition: a near-level shallow, natural depression or basin, usually containing an intermittent lake, pond, or pool
type: Concept
type: Code
type: Thing

beaches
in scheme: http://www.geonames.org/ontology#T
definition: a shore zone of coarse unconsolidated sediment that extends from the low-water line to the highest reach of storm waves
type: Concept
type: Code
type: Thing

http://www.geonames.org/ontology#V
type: ConceptScheme
type: Class
type: Thing
comment: forest, heath, ...

narrows
in scheme: http://www.geonames.org/ontology#H
definition: a navigable narrow part of a bay, strait, river, etc.
type: Concept
type: Code
type: Thing

novitiate
in scheme: http://www.geonames.org/ontology#S
definition: a religious house or school where novices are trained
type: Concept
type: Code
type: Thing

whirlpool
in scheme: http://www.geonames.org/ontology#H
definition: a turbulent, rotating movement of water in a stream
type: Concept
type: Code
type: Thing

abandoned railroad station
in scheme: http://www.geonames.org/ontology#S
definition: _
type: Concept
type: Code
type: Thing

caravan route
in scheme: http://www.geonames.org/ontology#R
definition: the route taken by caravans
type: Concept
type: Code
type: Thing

bank
in scheme: http://www.geonames.org/ontology#S
definition: A business establishment in which money is kept for saving or commercial purposes or is invested, supplied for loans, or exchanged.
type: Concept
type: Code
type: Thing

University Prep School
in scheme: http://www.geonames.org/ontology#S
definition: University Preparation Schools & Institutions
type: Concept
type: Code
type: Thing

huts
in scheme: http://www.geonames.org/ontology#S
definition: small primitive houses
type: Concept
type: Code
type: Thing

church
in scheme: http://www.geonames.org/ontology#S
definition: a building for public Christian worship
type: Concept
type: Code
type: Thing

section of populated place
in scheme: http://www.geonames.org/ontology#P
definition: _
type: Concept
type: Code
type: Thing

fjord
in scheme: http://www.geonames.org/ontology#H
definition: a long, narrow, steep-walled, deep-water arm of the sea at high latitudes, usually along mountainous coasts
type: Concept
type: Code
type: Thing

quarry(-ies)
in scheme: http://www.geonames.org/ontology#S
definition: a surface mine where building stone or gravel and sand, etc. are extracted
type: Concept
type: Code
type: Thing

drainage canal
in scheme: http://www.geonames.org/ontology#H
definition: an artificial waterway carrying water away from a wetland or from drainage ditches
type: Concept
type: Code
type: Thing

third-order administrative division
in scheme: http://www.geonames.org/ontology#A
definition: a subdivision of a second-order administrative division
type: Concept
type: Code
type: Thing

spillway
in scheme: http://www.geonames.org/ontology#S
definition: a passage or outlet through which surplus water flows over, around or through a dam
type: Concept
type: Code
type: Thing

rock desert
in scheme: http://www.geonames.org/ontology#T
definition: a relatively sand-free, high bedrock plateau in a hot desert, with or without a gravel veneer
type: Concept
type: Code
type: Thing

fracture zone
in scheme: http://www.geonames.org/ontology#U
definition: an extensive linear zone of irregular topography of the sea floor, characterized by steep-sided or asymmetrical ridges, troughs, or escarpments
type: Concept
type: Code
type: Thing

lock(s)
in scheme: http://www.geonames.org/ontology#S
definition: a basin in a waterway with gates at each end by means of which vessels are passed from one water level to another
type: Concept
type: Code
type: Thing

section of intermittent stream
in scheme: http://www.geonames.org/ontology#H
definition: _
type: Concept
type: Code
type: Thing

ditch
in scheme: http://www.geonames.org/ontology#H
definition: a small artificial watercourse dug for draining or irrigating the land
type: Concept
type: Code
type: Thing

farm
in scheme: http://www.geonames.org/ontology#S
definition: a tract of land with associated buildings devoted to agriculture
type: Concept
type: Code
type: Thing

populated place
in scheme: http://www.geonames.org/ontology#P
definition: a city, town, village, or other agglomeration of buildings where people live and work
type: Concept
type: Code
type: Thing

power station
in scheme: http://www.geonames.org/ontology#S
definition: a facility for generating electric power
type: Concept
type: Code
type: Thing

shelf
in scheme: http://www.geonames.org/ontology#U
definition: a zone adjacent to a continent (or around an island) that extends from the low water line to a depth at which there is usually a marked increase of slope towards oceanic depths
type: Concept
type: Code
type: Thing

seachannel
in scheme: http://www.geonames.org/ontology#U
definition: a continuously sloping, elongated depression commonly found in fans or plains and customarily bordered by levees on one or two sides
type: Concept
type: Code
type: Thing

airport
in scheme: http://www.geonames.org/ontology#S
definition: a place where aircraft regularly land and take off, with runways, navigational aids, and major facilities for the commercial handling of passengers and cargo
type: Concept
type: Code
type: Thing

administrative division
in scheme: http://www.geonames.org/ontology#A
definition: an administrative division of a country, undifferentiated as to administrative level
type: Concept
type: Code
type: Thing

medical center
in scheme: http://www.geonames.org/ontology#S
definition: a complex of health care buildings including two or more of the following: hospital, medical school, clinic, pharmacy, doctor's offices, etc.
type: Concept
type: Code
type: Thing

sluice
in scheme: http://www.geonames.org/ontology#S
definition: a conduit or passage for carrying off surplus water from a waterbody, usually regulated by means of a sluice gate
type: Concept
type: Code
type: Thing

section of bank
in scheme: http://www.geonames.org/ontology#H
definition: _
type: Concept
type: Code
type: Thing

seat of a second-order administrative division
in scheme: http://www.geonames.org/ontology#P
definition: _
type: Concept
type: Code
type: Thing

abandoned mission
in scheme: http://www.geonames.org/ontology#S
definition: _
type: Concept
type: Code
type: Thing

headland
in scheme: http://www.geonames.org/ontology#T
definition: a high projection of land extending into a large body of water beyond the line of the coast
type: Concept
type: Code
type: Thing

former inlet
in scheme: http://www.geonames.org/ontology#H
definition: an inlet which has been filled in, or blocked by deposits
type: Concept
type: Code
type: Thing

burial cave(s)
in scheme: http://www.geonames.org/ontology#S
definition: a cave used for human burials
type: Concept
type: Code
type: Thing

Centre Continuous Learning
in scheme: http://www.geonames.org/ontology#S
definition: Centres for Continuous Learning
type: Concept
type: Code
type: Thing

trench
in scheme: http://www.geonames.org/ontology#U
definition: a long, narrow, characteristically very deep and asymmetrical depression of the sea floor, with relatively steep sides
type: Concept
type: Code
type: Thing

abandoned well
in scheme: http://www.geonames.org/ontology#H
definition: _
type: Concept
type: Code
type: Thing

bench
in scheme: http://www.geonames.org/ontology#U
definition: a small terrace
type: Concept
type: Code
type: Thing

business center
in scheme: http://www.geonames.org/ontology#L
definition: a place where a number of businesses are located
type: Concept
type: Code
type: Thing

pans
in scheme: http://www.geonames.org/ontology#T
definition: a near-level shallow, natural depression or basin, usually containing an intermittent lake, pond, or pool
type: Concept
type: Code
type: Thing

mountain
in scheme: http://www.geonames.org/ontology#U
definition: a well-delineated subdivision of a large and complex positive feature
type: Concept
type: Code
type: Thing

channel
in scheme: http://www.geonames.org/ontology#H
definition: the deepest part of a stream, bay, lagoon, or strait, through which the main current flows
type: Concept
type: Code
type: Thing

levee
in scheme: http://www.geonames.org/ontology#T
definition: a natural low embankment bordering a distributary or meandering stream; often built up artificially to control floods
type: Concept
type: Code
type: Thing

customs post
in scheme: http://www.geonames.org/ontology#S
definition: a building at an international boundary where customs and duties are paid on goods
type: Concept
type: Code
type: Thing

tank farm
in scheme: http://www.geonames.org/ontology#S
definition: a tract of land occupied by large, cylindrical, metal tanks in which oil or liquid petrochemicals are stored
type: Concept
type: Code
type: Thing

spring(s)
in scheme: http://www.geonames.org/ontology#H
definition: a place where ground water flows naturally out of the ground
type: Concept
type: Code
type: Thing

stream mouth(s)
in scheme: http://www.geonames.org/ontology#H
definition: a place where a stream discharges into a lagoon, lake, or the sea
type: Concept
type: Code
type: Thing

railroad junction
in scheme: http://www.geonames.org/ontology#R
definition: a place where two or more railroad tracks join
type: Concept
type: Code
type: Thing

populated places
in scheme: http://www.geonames.org/ontology#P
definition: cities, towns, villages, or other agglomerations of buildings where people live and work
type: Concept
type: Code
type: Thing

independent political entity
in scheme: http://www.geonames.org/ontology#A
definition: _
type: Concept
type: Code
type: Thing

ponds
in scheme: http://www.geonames.org/ontology#H
definition: small standing waterbodies
type: Concept
type: Code
type: Thing

spa
in scheme: http://www.geonames.org/ontology#S
definition: a resort area usually developed around a medicinal spring
type: Concept
type: Code
type: Thing

intermittent salt lakes
in scheme: http://www.geonames.org/ontology#H
definition: _
type: Concept
type: Code
type: Thing

ridge
in scheme: http://www.geonames.org/ontology#U
definition: a long narrow elevation with steep sides
type: Concept
type: Code
type: Thing

mesa(s)
in scheme: http://www.geonames.org/ontology#T
definition: a flat-topped, isolated elevation with steep slopes on all sides, less extensive than a plateau
type: Concept
type: Code
type: Thing

rubber plantation
in scheme: http://www.geonames.org/ontology#S
definition: an estate which specializes in growing and tapping rubber trees
type: Concept
type: Code
type: Thing

theater
in scheme: http://www.geonames.org/ontology#S
definition: A building, room, or outdoor structure for the presentation of plays, films, or other dramatic performances
type: Concept
type: Code
type: Thing

religious site
in scheme: http://www.geonames.org/ontology#S
definition: an ancient site of significant religious importance
type: Concept
type: Code
type: Thing

peninsula
in scheme: http://www.geonames.org/ontology#T
definition: an elongate area of land projecting into a body of water and nearly surrounded by water
type: Concept
type: Code
type: Thing

fossilized forest
in scheme: http://www.geonames.org/ontology#V
definition: a forest fossilized by geologic processes and now exposed at the earth's surface
type: Concept
type: Code
type: Thing

reef(s)
in scheme: http://www.geonames.org/ontology#H
definition: a surface-navigation hazard composed of consolidated material
type: Concept
type: Code
type: Thing

mill(s)
in scheme: http://www.geonames.org/ontology#S
definition: a building housing machines for transforming, shaping, finishing, grinding, or extracting products
type: Concept
type: Code
type: Thing

Code
disjoint with: Nothing
subclass of: Concept
subclass of: Thing
type: Class
comment: A feature code.

rockfall
in scheme: http://www.geonames.org/ontology#T
definition: an irregular mass of fallen rock at the base of a cliff or steep slope
type: Concept
type: Code
type: Thing

pine grove
in scheme: http://www.geonames.org/ontology#V
definition: a planting of pine trees
type: Concept
type: Code
type: Thing

cone(s)
in scheme: http://www.geonames.org/ontology#T
definition: a conical landform composed of mud or volcanic material
type: Concept
type: Code
type: Thing

coal mine(s)
in scheme: http://www.geonames.org/ontology#S
definition: a mine where coal is extracted
type: Concept
type: Code
type: Thing

valley
in scheme: http://www.geonames.org/ontology#U
definition: a relatively shallow, wide depression, the bottom of which usually has a continuous gradient
type: Concept
type: Code
type: Thing

cuesta(s)
in scheme: http://www.geonames.org/ontology#T
definition: an asymmetric ridge formed on tilted strata
type: Concept
type: Code
type: Thing

zoo
in scheme: http://www.geonames.org/ontology#S
definition: a zoological garden or park where wild animals are kept for exhibition
type: Concept
type: Code
type: Thing

confluence
in scheme: http://www.geonames.org/ontology#H
definition: a place where two or more streams or intermittent streams flow together
type: Concept
type: Code
type: Thing

http://www.geonames.org/ontology#L
type: ConceptScheme
type: Class
type: Thing
comment: parks,area, ...

observation point
in scheme: http://www.geonames.org/ontology#S
definition: a wildlife or scenic observation point
type: Concept
type: Code
type: Thing

mud flat(s)
in scheme: http://www.geonames.org/ontology#H
definition: a relatively level area of mud either between high and low tide lines, or subject to flooding
type: Concept
type: Code
type: Thing

sill
in scheme: http://www.geonames.org/ontology#U
definition: the low part of a gap or saddle separating basins
type: Concept
type: Code
type: Thing

banks
in scheme: http://www.geonames.org/ontology#U
definition: elevations, typically located on a shelf, over which the depth of water is relatively shallow but sufficient for safe surface navigation
type: Concept
type: Code
type: Thing

monument
in scheme: http://www.geonames.org/ontology#S
definition: a commemorative structure or statue
type: Concept
type: Code
type: Thing

forest station
in scheme: http://www.geonames.org/ontology#S
definition: a collection of buildings and facilities for carrying out forest management
type: Concept
type: Code
type: Thing

plateau
in scheme: http://www.geonames.org/ontology#U
definition: a comparatively flat-topped feature of considerable extent, dropping off abruptly on one or more sides
type: Concept
type: Code
type: Thing

astronomical station
in scheme: http://www.geonames.org/ontology#S
definition: a point on the earth whose position has been determined by observations of celestial bodies
type: Concept
type: Code
type: Thing

point
in scheme: http://www.geonames.org/ontology#T
definition: a tapering piece of land projecting into a body of water, less prominent than a cape
type: Concept
type: Code
type: Thing

points
in scheme: http://www.geonames.org/ontology#T
definition: tapering pieces of land projecting into a body of water, less prominent than a cape
type: Concept
type: Code
type: Thing

limekiln
in scheme: http://www.geonames.org/ontology#S
definition: a furnace in which limestone is reduced to lime
type: Concept
type: Code
type: Thing

parent feature
sub property of: topObjectProperty
property disjoint with: bottomObjectProperty
type: TransitiveProperty
type: ObjectProperty
comment: A feature parent of the current one, in either administrative or physical subdivision.
domain: Feature
range: Feature

forks
in scheme: http://www.geonames.org/ontology#U
definition: a branch of a canyon or valley
type: Concept
type: Code
type: Thing

railroad tunnel
in scheme: http://www.geonames.org/ontology#R
definition: a tunnel through which a railroad passes
type: Concept
type: Code
type: Thing

volcano
in scheme: http://www.geonames.org/ontology#T
definition: a conical elevation composed of volcanic materials with a crater at the top
type: Concept
type: Code
type: Thing

slide
in scheme: http://www.geonames.org/ontology#T
definition: a mound of earth material, at the base of a slope and the associated scoured area
type: Concept
type: Code
type: Thing

reformatory
in scheme: http://www.geonames.org/ontology#S
definition: a facility for confining, training, and reforming young law offenders
type: Concept
type: Code
type: Thing

headwaters
in scheme: http://www.geonames.org/ontology#H
definition: the source and upper part of a stream, including the upper drainage basin
type: Concept
type: Code
type: Thing

dependent political entity
in scheme: http://www.geonames.org/ontology#A
definition: _
type: Concept
type: Code
type: Thing

dike
in scheme: http://www.geonames.org/ontology#S
definition: an earth or stone embankment usually constructed for flood or stream control
type: Concept
type: Code
type: Thing

salt pond
in scheme: http://www.geonames.org/ontology#H
definition: a small standing body of salt water often in a marsh or swamp, usually along a seacoast
type: Concept
type: Code
type: Thing

section of waterfall(s)
in scheme: http://www.geonames.org/ontology#H
definition: _
type: Concept
type: Code
type: Thing

whaling station
in scheme: http://www.geonames.org/ontology#S
definition: a facility for butchering whales and processing train oil
type: Concept
type: Code
type: Thing

agricultural school
in scheme: http://www.geonames.org/ontology#S
definition: a school with a curriculum focused on agriculture
type: Concept
type: Code
type: Thing

observatory
in scheme: http://www.geonames.org/ontology#S
definition: a facility equipped for observation of atmospheric or space phenomena
type: Concept
type: Code
type: Thing

camp(s)
in scheme: http://www.geonames.org/ontology#S
definition: a site occupied by tents, huts, or other shelters for temporary use
type: Concept
type: Code
type: Thing

sulphur spring(s)
in scheme: http://www.geonames.org/ontology#H
definition: a place where sulphur ground water flows naturally out of the ground
type: Concept
type: Code
type: Thing

road cut
in scheme: http://www.geonames.org/ontology#R
definition: an excavation cut through a hill or ridge for a road
type: Concept
type: Code
type: Thing

historical site
in scheme: http://www.geonames.org/ontology#S
definition: a place of historical importance
type: Concept
type: Code
type: Thing

swamp
in scheme: http://www.geonames.org/ontology#H
definition: a wetland dominated by tree vegetation
type: Concept
type: Code
type: Thing

airfield
in scheme: http://www.geonames.org/ontology#S
definition: a place on land where aircraft land and take off; no facilities provided for the commercial handling of passengers and cargo
type: Concept
type: Code
type: Thing

cave(s)
in scheme: http://www.geonames.org/ontology#S
definition: an underground passageway or chamber, or cavity on the side of a cliff
type: Concept
type: Code
type: Thing

boatyard
in scheme: http://www.geonames.org/ontology#S
definition: a waterside facility for servicing, repairing, and building small vessels
type: Concept
type: Code
type: Thing

customs house
in scheme: http://www.geonames.org/ontology#S
definition: a building in a port where customs and duties are paid, and where vessels are entered and cleared
type: Concept
type: Code
type: Thing

water pumping station
in scheme: http://www.geonames.org/ontology#S
definition: a facility for pumping water from a major well or through a pipeline
type: Concept
type: Code
type: Thing

water mill
in scheme: http://www.geonames.org/ontology#S
definition: a mill powered by running water
type: Concept
type: Code
type: Thing

furrow
in scheme: http://www.geonames.org/ontology#U
definition: a closed, linear, narrow, shallow depression
type: Concept
type: Code
type: Thing

trough
in scheme: http://www.geonames.org/ontology#U
definition: a long depression of the sea floor characteristically flat bottomed and steep sided, and normally shallower than a trench
type: Concept
type: Code
type: Thing

borderland
in scheme: http://www.geonames.org/ontology#U
definition: a region adjacent to a continent, normally occupied by or bordering a shelf, that is highly irregular with depths well in excess of those typical of a shelf
type: Concept
type: Code
type: Thing

wreck
in scheme: http://www.geonames.org/ontology#S
definition: the site of the remains of a wrecked vessel
type: Concept
type: Code
type: Thing

transit terminal
in scheme: http://www.geonames.org/ontology#S
definition: facilities for the handling of vehicular freight and passengers
type: Concept
type: Code
type: Thing

arch
in scheme: http://www.geonames.org/ontology#S
definition: a natural or man-made structure in the form of an arch
type: Concept
type: Code
type: Thing

sisal plantation
in scheme: http://www.geonames.org/ontology#S
definition: an estate that specializes in growing sisal
type: Concept
type: Code
type: Thing

united states government establishment
in scheme: http://www.geonames.org/ontology#S
definition: a facility operated by the United States Government in Panama
type: Concept
type: Code
type: Thing

map
sub property of: topObjectProperty
property disjoint with: bottomObjectProperty
type: ObjectProperty
comment: A geonames map centered on the feature.
domain: Feature
range: Map

nearby
sub property of: topObjectProperty
property disjoint with: bottomObjectProperty
type: ObjectProperty
comment: A feature close to the reference feature
domain: Feature
range: Feature

asphalt lake
in scheme: http://www.geonames.org/ontology#T
definition: a small basin containing naturally occurring asphalt
type: Concept
type: Code
type: Thing

resthouse
in scheme: http://www.geonames.org/ontology#S
definition: a structure maintained for the rest and shelter of travelers
type: Concept
type: Code
type: Thing

foundry
in scheme: http://www.geonames.org/ontology#S
definition: a building or works where metal casting is carried out
type: Concept
type: Code
type: Thing

racetrack
in scheme: http://www.geonames.org/ontology#S
definition: a track where races are held
type: Concept
type: Code
type: Thing

oil pipeline junction
in scheme: http://www.geonames.org/ontology#S
definition: a section of an oil pipeline where two or more pipes join together
type: Concept
type: Code
type: Thing

palace
in scheme: http://www.geonames.org/ontology#S
definition: a large stately house, often a royal or presidential residence
type: Concept
type: Code
type: Thing

canalized stream
in scheme: http://www.geonames.org/ontology#H
definition: a stream that has been substantially ditched, diked, or straightened
type: Concept
type: Code
type: Thing

sewage treatment plant
in scheme: http://www.geonames.org/ontology#S
definition: facility for the processing of sewage and/or wastewater
type: Concept
type: Code
type: Thing

intermittent pond
in scheme: http://www.geonames.org/ontology#H
definition: _
type: Concept
type: Code
type: Thing

blowout(s)
in scheme: http://www.geonames.org/ontology#T
definition: a small depression in sandy terrain, caused by wind erosion
type: Concept
type: Code
type: Thing

radio station
in scheme: http://www.geonames.org/ontology#S
definition: a facility for producing and transmitting information by radio waves
type: Concept
type: Code
type: Thing

waterworks
in scheme: http://www.geonames.org/ontology#S
definition: a facility for supplying potable water through a water source and a system of pumps and filtration beds
type: Concept
type: Code
type: Thing

sound
in scheme: http://www.geonames.org/ontology#H
definition: a long arm of the sea forming a channel between the mainland and an island or islands; or connecting two larger bodies of water
type: Concept
type: Code
type: Thing

locality
in scheme: http://www.geonames.org/ontology#L
definition: a minor area or place of unspecified or mixed character and indefinite boundaries
type: Concept
type: Code
type: Thing

region
in scheme: http://www.geonames.org/ontology#L
definition: an area distinguished by one or more observable physical or cultural characteristics
type: Concept
type: Code
type: Thing

ranch(es)
in scheme: http://www.geonames.org/ontology#S
definition: a large farm specializing in extensive grazing of livestock
type: Concept
type: Code
type: Thing

ridge(s)
in scheme: http://www.geonames.org/ontology#T
definition: a long narrow elevation with steep sides, and a more or less continuous crest
type: Concept
type: Code
type: Thing

promontory(-ies)
in scheme: http://www.geonames.org/ontology#T
definition: a bluff or prominent hill overlooking or projecting into a lowland
type: Concept
type: Code
type: Thing

oasis(-es)
in scheme: http://www.geonames.org/ontology#L
definition: an area in a desert made productive by the availability of water
type: Concept
type: Code
type: Thing

salt ponds
in scheme: http://www.geonames.org/ontology#H
definition: small standing bodies of salt water often in a marsh or swamp, usually along a seacoast
type: Concept
type: Code
type: Thing

abandoned police post
in scheme: http://www.geonames.org/ontology#S
definition: _
type: Concept
type: Code
type: Thing

sanatorium
in scheme: http://www.geonames.org/ontology#S
definition: a facility where victims of physical or mental disorders are treated
type: Concept
type: Code
type: Thing

military school
in scheme: http://www.geonames.org/ontology#S
definition: a school at which military science forms the core of the curriculum
type: Concept
type: Code
type: Thing

canal tunnel
in scheme: http://www.geonames.org/ontology#H
definition: a tunnel through which a canal passes
type: Concept
type: Code
type: Thing

tin mine(s)
in scheme: http://www.geonames.org/ontology#S
definition: a mine where tin ore is extracted
type: Concept
type: Code
type: Thing

bay
in scheme: http://www.geonames.org/ontology#H
definition: a coastal indentation between two capes or headlands, larger than a cove but smaller than a gulf
type: Concept
type: Code
type: Thing

sugar mill
in scheme: http://www.geonames.org/ontology#S
definition: a facility where sugar cane is processed into raw sugar
type: Concept
type: Code
type: Thing

chrome mine(s)
in scheme: http://www.geonames.org/ontology#S
definition: a mine where chrome ore is extracted
type: Concept
type: Code
type: Thing

placer mine(s)
in scheme: http://www.geonames.org/ontology#S
definition: a place where heavy metals are concentrated and running water is used to extract them from unconsolidated sediments
type: Concept
type: Code
type: Thing

gulf
in scheme: http://www.geonames.org/ontology#H
definition: a large recess in the coastline, larger than a bay
type: Concept
type: Code
type: Thing

athletic field
in scheme: http://www.geonames.org/ontology#S
definition: a tract of land used for playing team sports, and athletic track and field events
type: Concept
type: Code
type: Thing

tree(s)
in scheme: http://www.geonames.org/ontology#V
definition: a conspicuous tree used as a landmark
type: Concept
type: Code
type: Thing

dispensary
in scheme: http://www.geonames.org/ontology#S
definition: a building where medical or dental aid is dispensed
type: Concept
type: Code
type: Thing

reefs
in scheme: http://www.geonames.org/ontology#U
definition: surface-navigation hazards composed of consolidated material
type: Concept
type: Code
type: Thing

sugar plantation
in scheme: http://www.geonames.org/ontology#S
definition: an estate that specializes in growing sugar cane
type: Concept
type: Code
type: Thing

depression(s)
in scheme: http://www.geonames.org/ontology#T
definition: a low area surrounded by higher land and usually characterized by interior drainage
type: Concept
type: Code
type: Thing

icecap
in scheme: http://www.geonames.org/ontology#H
definition: a dome-shaped mass of glacial ice covering an area of mountain summits or other high lands; smaller than an ice sheet
type: Concept
type: Code
type: Thing

section of wadi
in scheme: http://www.geonames.org/ontology#H
definition: _
type: Concept
type: Code
type: Thing

railroad siding
in scheme: http://www.geonames.org/ontology#S
definition: a short track parallel to and joining the main track
type: Concept
type: Code
type: Thing

quay
in scheme: http://www.geonames.org/ontology#S
definition: a structure of solid construction along a shore or bank which provides berthing for ships and which generally provides cargo handling facilities
type: Concept
type: Code
type: Thing

ancient wall
in scheme: http://www.geonames.org/ontology#S
definition: the remains of a linear defensive stone structure
type: Concept
type: Code
type: Thing

drainage basin
in scheme: http://www.geonames.org/ontology#L
definition: an area drained by a stream
type: Concept
type: Code
type: Thing

abandoned factory
in scheme: http://www.geonames.org/ontology#S
definition: _
type: Concept
type: Code
type: Thing

levee
in scheme: http://www.geonames.org/ontology#U
definition: an embankment bordering a canyon, valley, or seachannel
type: Concept
type: Code
type: Thing

seat of a fourth-order administrative division
in scheme: http://www.geonames.org/ontology#P
definition: _
type: Concept
type: Code
type: Thing

basin
in scheme: http://www.geonames.org/ontology#U
definition: a depression more or less equidimensional in plan and of variable extent
type: Concept
type: Code
type: Thing

http://www.geonames.org/ontology#S
type: ConceptScheme
type: Class
type: Thing
comment: spot, building, farm, ...

tidal flat(s)
in scheme: http://www.geonames.org/ontology#H
definition: a large flat area of mud or sand attached to the shore and alternately covered and uncovered by the tide
type: Concept
type: Code
type: Thing

Feature
disjoint with: Nothing
subclass of: SpatialThing
subclass of: Thing
type: Class
comment: A geographical object uniquely defined by its geonames id.

meteorological station
in scheme: http://www.geonames.org/ontology#S
definition: a station at which weather elements are recorded
type: Concept
type: Code
type: Thing

intermittent reservoir
in scheme: http://www.geonames.org/ontology#H
definition: _
type: Concept
type: Code
type: Thing

bank
in scheme: http://www.geonames.org/ontology#U
definition: an elevation, typically located on a shelf, over which the depth of water is relatively shallow but sufficient for safe surface navigation
type: Concept
type: Code
type: Thing

pyramid
in scheme: http://www.geonames.org/ontology#S
definition: an ancient massive structure of square ground plan with four triangular faces meeting at a point and used for enclosing tombs
type: Concept
type: Code
type: Thing

artillery range
in scheme: http://www.geonames.org/ontology#L
definition: a tract of land used for artillery firing practice
type: Concept
type: Code
type: Thing

cotton plantation
in scheme: http://www.geonames.org/ontology#S
definition: an estate specializing in the cultivation of cotton
type: Concept
type: Code
type: Thing

wells
in scheme: http://www.geonames.org/ontology#H
definition: cylindrical holes, pits, or tunnels drilled or dug down to a depth from which water, oil, or gas can be pumped or brought to the surface
type: Concept
type: Code
type: Thing

boulder field
in scheme: http://www.geonames.org/ontology#T
definition: a high altitude or high latitude bare, flat area covered with large angular rocks
type: Concept
type: Code
type: Thing

cleft(s)
in scheme: http://www.geonames.org/ontology#T
definition: a deep narrow slot, notch, or groove in a coastal cliff
type: Concept
type: Code
type: Thing

park headquarters
in scheme: http://www.geonames.org/ontology#S
definition: a park administrative facility
type: Concept
type: Code
type: Thing

located in
sub property of: topObjectProperty
property disjoint with: bottomObjectProperty
type: ObjectProperty
comment: Indicates that the subject resource is located in the object feature
range: Feature

tablemounts (or guyots)
in scheme: http://www.geonames.org/ontology#U
definition: seamounts having a comparatively smooth, flat top
type: Concept
type: Code
type: Thing

road
in scheme: http://www.geonames.org/ontology#R
definition: an open way with improved surface for transportation of animals, people and vehicles
type: Concept
type: Code
type: Thing

abandoned prison
in scheme: http://www.geonames.org/ontology#S
definition: _
type: Concept
type: Code
type: Thing

garden(s)
in scheme: http://www.geonames.org/ontology#S
definition: an enclosure for displaying selected plant or animal life
type: Concept
type: Code
type: Thing

nature reserve
in scheme: http://www.geonames.org/ontology#L
definition: an area reserved for the maintenance of a natural habitat
type: Concept
type: Code
type: Thing

baling station
in scheme: http://www.geonames.org/ontology#S
definition: a facility for baling agricultural products
type: Concept
type: Code
type: Thing

intermittent ponds
in scheme: http://www.geonames.org/ontology#H
definition: _
type: Concept
type: Code
type: Thing

artificial island
in scheme: http://www.geonames.org/ontology#T
definition: an island created by landfill or diking and filling in a wetland, bay, or lagoon
type: Concept
type: Code
type: Thing

bays
in scheme: http://www.geonames.org/ontology#H
definition: coastal indentations between two capes or headlands, larger than a cove but smaller than a gulf
type: Concept
type: Code
type: Thing

interfluve
in scheme: http://www.geonames.org/ontology#T
definition: a relatively undissected upland between adjacent stream valleys
type: Concept
type: Code
type: Thing

oil pipeline
in scheme: http://www.geonames.org/ontology#R
definition: a pipeline used for transporting oil
type: Concept
type: Code
type: Thing

aqueduct
in scheme: http://www.geonames.org/ontology#H
definition: a conduit used to carry water
type: Concept
type: Code
type: Thing

mining area
in scheme: http://www.geonames.org/ontology#L
definition: an area of mine sites where minerals and ores are extracted
type: Concept
type: Code
type: Thing

wadi bend
in scheme: http://www.geonames.org/ontology#H
definition: a conspicuously curved or bent segment of a wadi
type: Concept
type: Code
type: Thing

marine channel
in scheme: http://www.geonames.org/ontology#H
definition: that part of a body of water deep enough for navigation through an area otherwise not suitable
type: Concept
type: Code
type: Thing

weir(s)
in scheme: http://www.geonames.org/ontology#S
definition: a small dam in a stream, designed to raise the water level or to divert stream flow through a desired channel
type: Concept
type: Code
type: Thing

tea plantation
in scheme: http://www.geonames.org/ontology#S
definition: an estate which specializes in growing tea bushes
type: Concept
type: Code
type: Thing

phosphate works
in scheme: http://www.geonames.org/ontology#S
definition: a facility for producing fertilizer
type: Concept
type: Code
type: Thing

section of plateau
in scheme: http://www.geonames.org/ontology#T
definition: _
type: Concept
type: Code
type: Thing

ruined dam
in scheme: http://www.geonames.org/ontology#S
definition: a destroyed or decayed dam which is no longer functional
type: Concept
type: Code
type: Thing

meander neck
in scheme: http://www.geonames.org/ontology#T
definition: a narrow strip of land between the two limbs of a meander loop at its narrowest point
type: Concept
type: Code
type: Thing

intermittent wetland
in scheme: http://www.geonames.org/ontology#H
definition: _
type: Concept
type: Code
type: Thing

gap
in scheme: http://www.geonames.org/ontology#T
definition: a low place in a ridge, not used for transportation
type: Concept
type: Code
type: Thing

bar
in scheme: http://www.geonames.org/ontology#T
definition: a shallow ridge or mound of coarse unconsolidated material in a stream channel, at the mouth of a stream, estuary, or lagoon and in the wave-break zone along coasts
type: Concept
type: Code
type: Thing

shore
in scheme: http://www.geonames.org/ontology#T
definition: a narrow zone bordering a waterbody which covers and uncovers at high and low water, respectively
type: Concept
type: Code
type: Thing

police post
in scheme: http://www.geonames.org/ontology#S
definition: a building in which police are stationed
type: Concept
type: Code
type: Thing

windmill
in scheme: http://www.geonames.org/ontology#S
definition: a mill or water pump powered by wind
type: Concept
type: Code
type: Thing

library
in scheme: http://www.geonames.org/ontology#S
definition: A place in which information resources such as books are kept for reading, reference, or lending.
type: Concept
type: Code
type: Thing

province
in scheme: http://www.geonames.org/ontology#U
definition: a region identifiable by a group of similar physiographic features whose characteristics are markedly in contrast with surrounding areas
type: Concept
type: Code
type: Thing

shelf edge
in scheme: http://www.geonames.org/ontology#U
definition: a line along which there is a marked increase of slope at the outer margin of a continental shelf or island shelf
type: Concept
type: Code
type: Thing

mine(s)
in scheme: http://www.geonames.org/ontology#S
definition: a site where mineral ores are extracted from the ground by excavating surface pits and subterranean passages
type: Concept
type: Code
type: Thing

coconut grove
in scheme: http://www.geonames.org/ontology#V
definition: a planting of coconut trees
type: Concept
type: Code
type: Thing

docking basin
in scheme: http://www.geonames.org/ontology#H
definition: a part of a harbor where ships dock
type: Concept
type: Code
type: Thing

wadies
in scheme: http://www.geonames.org/ontology#H
definition: valleys or ravines, bounded by relatively steep banks, which in the rainy season become watercourses; found primarily in North Africa and the Middle East
type: Concept
type: Code
type: Thing

agricultural facility
in scheme: http://www.geonames.org/ontology#S
definition: a building and/or tract of land used for improving agriculture
type: Concept
type: Code
type: Thing

factory
in scheme: http://www.geonames.org/ontology#S
definition: one or more buildings where goods are manufactured, processed or fabricated
type: Concept
type: Code
type: Thing

tomb(s)
in scheme: http://www.geonames.org/ontology#S
definition: a structure for interring bodies
type: Concept
type: Code
type: Thing

median valley
in scheme: http://www.geonames.org/ontology#U
definition: the axial depression of the mid-oceanic ridge system
type: Concept
type: Code
type: Thing

former sugar mill
in scheme: http://www.geonames.org/ontology#S
definition: a sugar mill no longer used as a sugar mill
type: Concept
type: Code
type: Thing

road junction
in scheme: http://www.geonames.org/ontology#R
definition: a place where two or more roads join
type: Concept
type: Code
type: Thing

common
in scheme: http://www.geonames.org/ontology#L
definition: a park or pasture for community use
type: Concept
type: Code
type: Thing

spit
in scheme: http://www.geonames.org/ontology#T
definition: a narrow, straight or curved continuation of a beach into a waterbody
type: Concept
type: Code
type: Thing

community center
in scheme: http://www.geonames.org/ontology#S
definition: a facility for community recreation and other activities
type: Concept
type: Code
type: Thing

abandoned oil well
in scheme: http://www.geonames.org/ontology#S
definition: _
type: Concept
type: Code
type: Thing

heath
in scheme: http://www.geonames.org/ontology#V
definition: an upland moor or sandy area dominated by low shrubby vegetation including heather
type: Concept
type: Code
type: Thing

petroleum basin
in scheme: http://www.geonames.org/ontology#L
definition: an area underlain by an oil-rich structural basin
type: Concept
type: Code
type: Thing

mountain
in scheme: http://www.geonames.org/ontology#T
definition: an elevation standing high above the surrounding area with small summit area, steep slopes and local relief of 300m or more
type: Concept
type: Code
type: Thing

reservoir(s)
in scheme: http://www.geonames.org/ontology#H
definition: an artificial pond or lake
type: Concept
type: Code
type: Thing

market
in scheme: http://www.geonames.org/ontology#S
definition: a place where goods are bought and sold at regular intervals
type: Concept
type: Code
type: Thing

ancient road
in scheme: http://www.geonames.org/ontology#R
definition: the remains of a road used by ancient cultures
type: Concept
type: Code
type: Thing

dockyard
in scheme: http://www.geonames.org/ontology#S
definition: a facility for servicing, building, or repairing ships
type: Concept
type: Code
type: Thing

sinkhole
in scheme: http://www.geonames.org/ontology#T
definition: a small crater-shape depression in a karst area
type: Concept
type: Code
type: Thing

gravel area
in scheme: http://www.geonames.org/ontology#L
definition: an area covered with gravel
type: Concept
type: Code
type: Thing

freely associated state
in scheme: http://www.geonames.org/ontology#A
definition: _
type: Concept
type: Code
type: Thing

arctic land
in scheme: http://www.geonames.org/ontology#L
definition: a tract of land in the Arctic
type: Concept
type: Code
type: Thing

postal code
sub property of: topDataProperty
property disjoint with: bottomDataProperty
type: DatatypeProperty
domain: Feature

retreat
in scheme: http://www.geonames.org/ontology#S
definition: a place of temporary seclusion, especially for religious groups
type: Concept
type: Code
type: Thing

ancient site
in scheme: http://www.geonames.org/ontology#S
definition: a place where archeological remains, old structures, or cultural artifacts are located
type: Concept
type: Code
type: Thing

sub-surface dam
in scheme: http://www.geonames.org/ontology#S
definition: a dam put down to bedrock in a sand river
type: Concept
type: Code
type: Thing

platform
in scheme: http://www.geonames.org/ontology#U
definition: a flat or gently sloping underwater surface extending seaward from the shore
type: Concept
type: Code
type: Thing

pagoda
in scheme: http://www.geonames.org/ontology#S
definition: a tower-like storied structure, usually a Buddhist shrine
type: Concept
type: Code
type: Thing

college
in scheme: http://www.geonames.org/ontology#S
definition: the grounds and buildings of an institution of higher learning
type: Concept
type: Code
type: Thing

arch
in scheme: http://www.geonames.org/ontology#U
definition: a low bulge around the southeastern end of the island of Hawaii
type: Concept
type: Code
type: Thing

barracks
in scheme: http://www.geonames.org/ontology#S
definition: a building for lodging military personnel
type: Concept
type: Code
type: Thing

oil palm plantation
in scheme: http://www.geonames.org/ontology#S
definition: an estate specializing in the cultivation of oil palm trees
type: Concept
type: Code
type: Thing

crater lake
in scheme: http://www.geonames.org/ontology#H
definition: a lake in a crater or caldera
type: Concept
type: Code
type: Thing

lake bed(s)
in scheme: http://www.geonames.org/ontology#H
definition: a dried up or drained area of a former lake
type: Concept
type: Code
type: Thing

lead mine(s)
in scheme: http://www.geonames.org/ontology#S
definition: a mine where lead ore is extracted
type: Concept
type: Code
type: Thing

steps
in scheme: http://www.geonames.org/ontology#S
definition: stones or slabs placed for ease in ascending or descending a steep slope
type: Concept
type: Code
type: Thing

moraine
in scheme: http://www.geonames.org/ontology#T
definition: a mound, ridge, or other accumulation of glacial till
type: Concept
type: Code
type: Thing

heliport
in scheme: http://www.geonames.org/ontology#S
definition: a place where helicopters land and take off
type: Concept
type: Code
type: Thing

technical school
in scheme: http://www.geonames.org/ontology#S
definition: post-secondary school with a specifically technical or vocational curriculum
type: Concept
type: Code
type: Thing

hill
in scheme: http://www.geonames.org/ontology#T
definition: a rounded elevation of limited extent rising above the surrounding land with local relief of less than 300m
type: Concept
type: Code
type: Thing

dairy
in scheme: http://www.geonames.org/ontology#S
definition: a facility for the processing, sale and distribution of milk or milk products
type: Concept
type: Code
type: Thing

mound(s)
in scheme: http://www.geonames.org/ontology#T
definition: a low, isolated, rounded hill
type: Concept
type: Code
type: Thing

coast guard station
in scheme: http://www.geonames.org/ontology#S
definition: a facility from which the coast is guarded by armed vessels
type: Concept
type: Code
type: Thing

guest house
in scheme: http://www.geonames.org/ontology#S
definition: a house used to provide lodging for paying guests
type: Concept
type: Code
type: Thing

corridor
in scheme: http://www.geonames.org/ontology#T
definition: a strip or area of land having significance as an access way
type: Concept
type: Code
type: Thing

ridges
in scheme: http://www.geonames.org/ontology#U
definition: long narrow elevations with steep sides
type: Concept
type: Code
type: Thing

olive grove
in scheme: http://www.geonames.org/ontology#V
definition: a planting of olive trees
type: Concept
type: Code
type: Thing

underground irrigation canal(s)
in scheme: http://www.geonames.org/ontology#H
definition: a gently inclined underground tunnel bringing water for irrigation from aquifers
type: Concept
type: Code
type: Thing

abandoned mine
in scheme: http://www.geonames.org/ontology#S
definition: _
type: Concept
type: Code
type: Thing

rock
in scheme: http://www.geonames.org/ontology#T
definition: a conspicuous, isolated rocky mass
type: Concept
type: Code
type: Thing

fan
in scheme: http://www.geonames.org/ontology#U
definition: a relatively smooth feature normally sloping away from the lower termination of a canyon or canyon system
type: Concept
type: Code
type: Thing

facility
in scheme: http://www.geonames.org/ontology#S
definition: a building or buildings housing a center, institute, foundation, hospital, prison, mission, courthouse, etc.
type: Concept
type: Code
type: Thing

cairn
in scheme: http://www.geonames.org/ontology#S
definition: a heap of stones erected as a landmark or for other purposes
type: Concept
type: Code
type: Thing

iron mine(s)
in scheme: http://www.geonames.org/ontology#S
definition: a mine where iron ore is extracted
type: Concept
type: Code
type: Thing

Bus Station
in scheme: http://www.geonames.org/ontology#S
definition: a facility comprising ticket office, platforms, etc. for loading and unloading passengers
type: Concept
type: Code
type: Thing

square
in scheme: http://www.geonames.org/ontology#S
definition: a broad, open, public area near the center of a town or city
type: Concept
type: Code
type: Thing

dock(s)
in scheme: http://www.geonames.org/ontology#H
definition: a waterway between two piers, or cut into the land for the berthing of ships
type: Concept
type: Code
type: Thing

irrigated field(s)
in scheme: http://www.geonames.org/ontology#L
definition: a tract of level or terraced land which is irrigated
type: Concept
type: Code
type: Thing

roadstead
in scheme: http://www.geonames.org/ontology#H
definition: an open anchorage affording less protection than a harbor
type: Concept
type: Code
type: Thing

hills
in scheme: http://www.geonames.org/ontology#T
definition: rounded elevations of limited extent rising above the surrounding land with local relief of less than 300m
type: Concept
type: Code
type: Thing

pool(s)
in scheme: http://www.geonames.org/ontology#H
definition: a small and comparatively still, deep part of a larger body of water such as a stream or harbor; or a small body of standing water
type: Concept
type: Code
type: Thing

mangrove island
in scheme: http://www.geonames.org/ontology#T
definition: a mangrove swamp surrounded by a waterbody
type: Concept
type: Code
type: Thing

tunnel
in scheme: http://www.geonames.org/ontology#R
definition: a subterranean passageway for transportation
type: Concept
type: Code
type: Thing

tundra
in scheme: http://www.geonames.org/ontology#V
definition: a marshy, treeless, high latitude plain, dominated by mosses, lichens, and low shrub vegetation under permafrost conditions
type: Concept
type: Code
type: Thing

overfalls
in scheme: http://www.geonames.org/ontology#H
definition: an area of breaking waves caused by the meeting of currents or by waves moving against the current
type: Concept
type: Code
type: Thing

spur(s)
in scheme: http://www.geonames.org/ontology#T
definition: a subordinate ridge projecting outward from a hill, mountain or other elevation
type: Concept
type: Code
type: Thing

stable
in scheme: http://www.geonames.org/ontology#S
definition: a building for the shelter and feeding of farm animals, especially horses
type: Concept
type: Code
type: Thing

copper works
in scheme: http://www.geonames.org/ontology#S
definition: a facility for processing copper ore
type: Concept
type: Code
type: Thing

brewery
in scheme: http://www.geonames.org/ontology#S
definition: one or more buildings where beer is brewed
type: Concept
type: Code
type: Thing

oxbow lake
in scheme: http://www.geonames.org/ontology#H
definition: a crescent-shaped lake commonly found adjacent to meandering streams
type: Concept
type: Code
type: Thing

gasfield
in scheme: http://www.geonames.org/ontology#L
definition: an area containing a subterranean store of natural gas of economic value
type: Concept
type: Code
type: Thing

jetty
in scheme: http://www.geonames.org/ontology#S
definition: a structure built out into the water at a river mouth or harbor entrance to regulate currents and silting
type: Concept
type: Code
type: Thing

arrugado
in scheme: http://www.geonames.org/ontology#U
definition: an area of subdued corrugations off Baja California
type: Concept
type: Code
type: Thing

shelf valley
in scheme: http://www.geonames.org/ontology#U
definition: a valley on the shelf, generally the shoreward extension of a canyon
type: Concept
type: Code
type: Thing

hanging valley
in scheme: http://www.geonames.org/ontology#T
definition: a valley the floor of which is notably higher than the valley or shore to which it leads; most common in areas that have been glaciated
type: Concept
type: Code
type: Thing

gap
in scheme: http://www.geonames.org/ontology#U
definition: a narrow break in a ridge or rise
type: Concept
type: Code
type: Thing

halting place
in scheme: http://www.geonames.org/ontology#S
definition: a place where caravans stop for rest
type: Concept
type: Code
type: Thing

ravine(s)
in scheme: http://www.geonames.org/ontology#H
definition: a small, narrow, deep, steep-sided stream channel, smaller than a gorge
type: Concept
type: Code
type: Thing

inlet
in scheme: http://www.geonames.org/ontology#H
definition: a narrow waterway extending into the land, or connecting a bay or lagoon with a larger body of water
type: Concept
type: Code
type: Thing

seachannels
in scheme: http://www.geonames.org/ontology#U
definition: continuously sloping, elongated depressions commonly found in fans or plains and customarily bordered by levees on one or two sides
type: Concept
type: Code
type: Thing

marina
in scheme: http://www.geonames.org/ontology#S
definition: a harbor facility for small boats, yachts, etc.
type: Concept
type: Code
type: Thing

railroad signal
in scheme: http://www.geonames.org/ontology#S
definition: a signal at the entrance of a particular section of track governing the movement of trains
type: Concept
type: Code
type: Thing

automatic teller machine
in scheme: http://www.geonames.org/ontology#S
definition: An unattended electronic machine in a public place, connected to a data system and related equipment and activated by a bank customer to obtain cash withdrawals and other banking services.
type: Concept
type: Code
type: Thing

bog(s)
in scheme: http://www.geonames.org/ontology#H
definition: a wetland characterized by peat forming sphagnum moss, sedge, and other acid-water plants
type: Concept
type: Code
type: Thing

lake
in scheme: http://www.geonames.org/ontology#H
definition: a large inland body of standing water
type: Concept
type: Code
type: Thing

continent
in scheme: http://www.geonames.org/ontology#L
definition: continent : Europe, Africa, Asia, North America, South America, Oceania,Antarctica
type: Concept
type: Code
type: Thing

ruin(s)
in scheme: http://www.geonames.org/ontology#S
definition: a destroyed or decayed structure which is no longer functional
type: Concept
type: Code
type: Thing

peaks
in scheme: http://www.geonames.org/ontology#U
definition: prominent elevations, part of a larger feature, either pointed or of very limited extent across the summit
type: Concept
type: Code
type: Thing

farm village
in scheme: http://www.geonames.org/ontology#P
definition: a populated place where the population is largely engaged in agricultural activities
type: Concept
type: Code
type: Thing

farmstead
in scheme: http://www.geonames.org/ontology#S
definition: the buildings and adjacent service areas of a farm
type: Concept
type: Code
type: Thing

http://www.geonames.org/ontology#U
type: ConceptScheme
type: Class
type: Thing
comment: undersea

section of valley
in scheme: http://www.geonames.org/ontology#T
definition: _
type: Concept
type: Code
type: Thing

tongue
in scheme: http://www.geonames.org/ontology#U
definition: an elongate (tongue-like) extension of a flat sea floor into an adjacent higher feature
type: Concept
type: Code
type: Thing

official name
sub property of: topDataProperty
sub property of: altLabel
sub property of: alternate name
property disjoint with: bottomDataProperty
type: DatatypeProperty
comment: A name in an official local language

fjords
in scheme: http://www.geonames.org/ontology#H
definition: long, narrow, steep-walled, deep-water arms of the sea at high latitudes, usually along mountainous coasts
type: Concept
type: Code
type: Thing

sill
in scheme: http://www.geonames.org/ontology#H
definition: the low part of an underwater gap or saddle separating basins, including a similar feature at the mouth of a fjord
type: Concept
type: Code
type: Thing

pass
in scheme: http://www.geonames.org/ontology#T
definition: a break in a mountain range or other high obstruction, used for transportation from one side to the other [See also gap]
type: Concept
type: Code
type: Thing

cutoff
in scheme: http://www.geonames.org/ontology#H
definition: a channel formed as a result of a stream cutting through a meander neck
type: Concept
type: Code
type: Thing

postgrad & MBA
in scheme: http://www.geonames.org/ontology#S
definition: Post Universitary Education Institutes (post graduate studies and highly specialised master programs) & MBA
type: Concept
type: Code
type: Thing

beach ridge
in scheme: http://www.geonames.org/ontology#T
definition: a ridge of sand just inland and parallel to the beach, usually in series
type: Concept
type: Code
type: Thing

parking lot
in scheme: http://www.geonames.org/ontology#S
definition: an area used for parking vehicles
type: Concept
type: Code
type: Thing

palm tree reserve
in scheme: http://www.geonames.org/ontology#L
definition: an area of palm trees where use is controlled
type: Concept
type: Code
type: Thing

abandoned watercourse
in scheme: http://www.geonames.org/ontology#H
definition: a former stream or distributary no longer carrying flowing water, but still evident due to lakes, wetland, topographic or vegetation patterns
type: Concept
type: Code
type: Thing

destroyed populated place
in scheme: http://www.geonames.org/ontology#P
definition: a village, town or city destroyed by a natural disaster, or by war
type: Concept
type: Code
type: Thing

maneuver area
in scheme: http://www.geonames.org/ontology#L
definition: a tract of land where military field exercises are carried out
type: Concept
type: Code
type: Thing

reef
in scheme: http://www.geonames.org/ontology#U
definition: a surface-navigation hazard composed of consolidated material
type: Concept
type: Code
type: Thing

mountains
in scheme: http://www.geonames.org/ontology#U
definition: well-delineated subdivisions of a large and complex positive feature
type: Concept
type: Code
type: Thing

sheepfold
in scheme: http://www.geonames.org/ontology#S
definition: a fence or wall enclosure for sheep and other small herd animals
type: Concept
type: Code
type: Thing

range
in scheme: http://www.geonames.org/ontology#U
definition: a series of associated ridges or seamounts
type: Concept
type: Code
type: Thing

field(s)
in scheme: http://www.geonames.org/ontology#L
definition: an open as opposed to wooded area
type: Concept
type: Code
type: Thing

second-order administrative division
in scheme: http://www.geonames.org/ontology#A
definition: a subdivision of a first-order administrative division
type: Concept
type: Code
type: Thing

museum
in scheme: http://www.geonames.org/ontology#S
definition: a building where objects of permanent interest in one or more of the arts and sciences are preserved and exhibited
type: Concept
type: Code
type: Thing

apron
in scheme: http://www.geonames.org/ontology#U
definition: a gentle slope, with a generally smooth surface, particularly found around groups of islands and seamounts
type: Concept
type: Code
type: Thing

valley
in scheme: http://www.geonames.org/ontology#T
definition: an elongated depression usually traversed by a stream
type: Concept
type: Code
type: Thing

gold mine(s)
in scheme: http://www.geonames.org/ontology#S
definition: a mine where gold ore, or alluvial gold is extracted
type: Concept
type: Code
type: Thing

oil pumping station
in scheme: http://www.geonames.org/ontology#S
definition: a facility for pumping oil through a pipeline
type: Concept
type: Code
type: Thing

moor(s)
in scheme: http://www.geonames.org/ontology#H
definition: an area of open ground overlaid with wet peaty soils
type: Concept
type: Code
type: Thing

ramp
in scheme: http://www.geonames.org/ontology#U
definition: a gentle slope connecting areas of different elevations
type: Concept
type: Code
type: Thing

icecap ridge
in scheme: http://www.geonames.org/ontology#H
definition: a linear elevation on an icecap
type: Concept
type: Code
type: Thing

ore treatment plant
in scheme: http://www.geonames.org/ontology#S
definition: a facility for improving the metal content of ore by concentration
type: Concept
type: Code
type: Thing

amusement park
in scheme: http://www.geonames.org/ontology#L
definition: Amusement Park are theme parks, adventure parks offering entertainment, similar to funfairs but with a fix location
type: Concept
type: Code
type: Thing

crater lakes
in scheme: http://www.geonames.org/ontology#H
definition: lakes in a crater or caldera
type: Concept
type: Code
type: Thing

economic region
in scheme: http://www.geonames.org/ontology#L
definition: a region of a country established for economic development or for statistical purposes
type: Concept
type: Code
type: Thing

naval base
in scheme: http://www.geonames.org/ontology#L
definition: an area used to store supplies, provide barracks for troops and naval personnel, a port for naval vessels, and from which operations are initiated
type: Concept
type: Code
type: Thing

boundary marker
in scheme: http://www.geonames.org/ontology#S
definition: a fixture marking a point along a boundary
type: Concept
type: Code
type: Thing

pond
in scheme: http://www.geonames.org/ontology#H
definition: a small standing waterbody
type: Concept
type: Code
type: Thing

children features
sub property of: topObjectProperty
property disjoint with: bottomObjectProperty
type: ObjectProperty
comment: Links to an RDF document containing the descriptions of children features
domain: Feature
range: RDF Data

house(s)
in scheme: http://www.geonames.org/ontology#S
definition: a building used as a human habitation
type: Concept
type: Code
type: Thing

seat of a first-order administrative division
in scheme: http://www.geonames.org/ontology#P
definition: seat of a first-order administrative division (PPLC takes precedence over PPLA)
type: Concept
type: Code
type: Thing

coast
in scheme: http://www.geonames.org/ontology#L
definition: a zone of variable width straddling the shoreline
type: Concept
type: Code
type: Thing

nearby features
sub property of: topObjectProperty
property disjoint with: bottomObjectProperty
type: ObjectProperty
comment: Links to an RDF document containing the descriptions of nearby features
domain: Feature
range: RDF Data

http://www.geonames.org/ontology#P
type: ConceptScheme
type: Class
type: Thing
comment: city, village,...

mall
in scheme: http://www.geonames.org/ontology#S
definition: A large, often enclosed shopping complex containing various stores, businesses, and restaurants usually accessible by common passageways.
type: Concept
type: Code
type: Thing

trail
in scheme: http://www.geonames.org/ontology#R
definition: a path, track, or route used by pedestrians, animals, or off-road vehicles
type: Concept
type: Code
type: Thing

valleys
in scheme: http://www.geonames.org/ontology#T
definition: elongated depressions usually traversed by a stream
type: Concept
type: Code
type: Thing

waterfall(s)
in scheme: http://www.geonames.org/ontology#H
definition: a perpendicular or very steep descent of the water of a stream
type: Concept
type: Code
type: Thing

cirques
in scheme: http://www.geonames.org/ontology#T
definition: bowl-like hollows partially surrounded by cliffs or steep slopes at the head of a glaciated valley
type: Concept
type: Code
type: Thing

pier
in scheme: http://www.geonames.org/ontology#S
definition: a structure built out into navigable water on piles providing berthing for ships and recreation
type: Concept
type: Code
type: Thing

RDF Data
disjoint with: Nothing
subclass of: Thing
subclass of: Document
type: Class
comment: A Document containing RDF description of one or several features.

border post
in scheme: http://www.geonames.org/ontology#S
definition: a post or station at an international boundary for the regulation of movement of people and goods
type: Concept
type: Code
type: Thing

slope(s)
in scheme: http://www.geonames.org/ontology#T
definition: a surface with a relatively uniform slope angle
type: Concept
type: Code
type: Thing

religious populated place
in scheme: http://www.geonames.org/ontology#P
definition: a populated place whose population is largely engaged in religious occupations
type: Concept
type: Code
type: Thing

research institute
in scheme: http://www.geonames.org/ontology#S
definition: a facility where research is carried out
type: Concept
type: Code
type: Thing

fishponds
in scheme: http://www.geonames.org/ontology#H
definition: ponds or enclosures in which fish are kept or raised
type: Concept
type: Code
type: Thing

State Exam Prep Centre
in scheme: http://www.geonames.org/ontology#S
definition: State Exam Preparation Centres
type: Concept
type: Code
type: Thing

plain
in scheme: http://www.geonames.org/ontology#U
definition: a flat, gently sloping or nearly level region
type: Concept
type: Code
type: Thing

sugar refinery
in scheme: http://www.geonames.org/ontology#S
definition: a facility for converting raw sugar into refined sugar
type: Concept
type: Code
type: Thing

ford
in scheme: http://www.geonames.org/ontology#T
definition: a shallow part of a stream which can be crossed on foot or by land vehicle
type: Concept
type: Code
type: Thing

terrace
in scheme: http://www.geonames.org/ontology#U
definition: a relatively flat horizontal or gently inclined surface, sometimes long and narrow, which is bounded by a steeper ascending slope on one side and by a steep descending slope on the opposite side
type: Concept
type: Code
type: Thing

cultivated area
in scheme: http://www.geonames.org/ontology#V
definition: an area under cultivation
type: Concept
type: Code
type: Thing

hills
in scheme: http://www.geonames.org/ontology#U
definition: elevations rising generally less than 500 meters
type: Concept
type: Code
type: Thing

bank(s)
in scheme: http://www.geonames.org/ontology#H
definition: an elevation, typically located on a shelf, over which the depth of water is relatively shallow but sufficient for most surface navigation
type: Concept
type: Code
type: Thing

leper colony
in scheme: http://www.geonames.org/ontology#S
definition: a settled area inhabited by lepers in relative isolation
type: Concept
type: Code
type: Thing

railroad
in scheme: http://www.geonames.org/ontology#R
definition: a permanent twin steel-rail track on which freight and passenger cars move long distances
type: Concept
type: Code
type: Thing

slope
in scheme: http://www.geonames.org/ontology#U
definition: the slope seaward from the shelf edge to the beginning of a continental rise or the point where there is a general reduction in slope
type: Concept
type: Code
type: Thing

land-tied island
in scheme: http://www.geonames.org/ontology#T
definition: a coastal island connected to the mainland by barrier beaches, levees or dikes
type: Concept
type: Code
type: Thing

grave
in scheme: http://www.geonames.org/ontology#S
definition: a burial site
type: Concept
type: Code
type: Thing

stream bank
in scheme: http://www.geonames.org/ontology#H
definition: a sloping margin of a stream channel which normally confines the stream to its channel on land
type: Concept
type: Code
type: Thing

concession area
in scheme: http://www.geonames.org/ontology#L
definition: a lease of land by a government for economic development, e.g., mining, forestry
type: Concept
type: Code
type: Thing

stadium
in scheme: http://www.geonames.org/ontology#S
definition: a structure with an enclosure for athletic games with tiers of seats for spectators
type: Concept
type: Code
type: Thing

tablemount (or guyot)
in scheme: http://www.geonames.org/ontology#U
definition: a seamount having a comparatively smooth, flat top
type: Concept
type: Code
type: Thing

canal
in scheme: http://www.geonames.org/ontology#H
definition: an artificial watercourse
type: Concept
type: Code
type: Thing

political entity
in scheme: http://www.geonames.org/ontology#A
definition: _
type: Concept
type: Code
type: Thing

experiment station
in scheme: http://www.geonames.org/ontology#S
definition: a facility for carrying out experiments
type: Concept
type: Code
type: Thing

rise
in scheme: http://www.geonames.org/ontology#U
definition: a broad elevation that rises gently, and generally smoothly, from the sea floor
type: Concept
type: Code
type: Thing

refugee camp
in scheme: http://www.geonames.org/ontology#S
definition: a camp used by refugees
type: Concept
type: Code
type: Thing

irrigation system
in scheme: http://www.geonames.org/ontology#H
definition: a network of ditches and one or more of the following elements: water supply, reservoir, canal, pump, well, drain, etc.
type: Concept
type: Code
type: Thing

free trade zone
in scheme: http://www.geonames.org/ontology#S
definition: an area, usually a section of a port, where goods may be received and shipped free of customs duty and of most customs regulations
type: Concept
type: Code
type: Thing

resort
in scheme: http://www.geonames.org/ontology#S
definition: a specialized facility for vacation, health, or participation sports activities
type: Concept
type: Code
type: Thing

moat
in scheme: http://www.geonames.org/ontology#U
definition: an annular depression that may not be continuous, located at the base of many seamounts, islands, and other isolated elevations
type: Concept
type: Code
type: Thing

anchorage
in scheme: http://www.geonames.org/ontology#H
definition: an area where vessels may anchor
type: Concept
type: Code
type: Thing

railroad station
in scheme: http://www.geonames.org/ontology#S
definition: a facility comprising ticket office, platforms, etc. for loading and unloading train passengers and freight
type: Concept
type: Code
type: Thing

nunatak
in scheme: http://www.geonames.org/ontology#T
definition: a rock or mountain peak protruding through glacial ice
type: Concept
type: Code
type: Thing

nunataks
in scheme: http://www.geonames.org/ontology#T
definition: rocks or mountain peaks protruding through glacial ice
type: Concept
type: Code
type: Thing

forest reserve
in scheme: http://www.geonames.org/ontology#L
definition: a forested area set aside for preservation or controlled use
type: Concept
type: Code
type: Thing

dam
in scheme: http://www.geonames.org/ontology#S
definition: a barrier constructed across a stream to impound water
type: Concept
type: Code
type: Thing

israeli settlement
in scheme: http://www.geonames.org/ontology#P
definition: _
type: Concept
type: Code
type: Thing

canyon
in scheme: http://www.geonames.org/ontology#U
definition: a relatively narrow, deep depression with steep sides, the bottom of which generally has a continuous slope
type: Concept
type: Code
type: Thing

polder
in scheme: http://www.geonames.org/ontology#T
definition: an area reclaimed from the sea by diking and draining
type: Concept
type: Code
type: Thing

rocks
in scheme: http://www.geonames.org/ontology#T
definition: conspicuous, isolated rocky masses
type: Concept
type: Code
type: Thing

abandoned railroad
in scheme: http://www.geonames.org/ontology#R
definition: _
type: Concept
type: Code
type: Thing

park
in scheme: http://www.geonames.org/ontology#L
definition: an area, often of forested land, maintained as a place of beauty, or for recreation
type: Concept
type: Code
type: Thing

Bus Stop
in scheme: http://www.geonames.org/ontology#S
definition: a place lacking station facilities
type: Concept
type: Code
type: Thing

opera house
in scheme: http://www.geonames.org/ontology#S
definition: A theater designed chiefly for the performance of operas.
type: Concept
type: Code
type: Thing

zone
in scheme: http://www.geonames.org/ontology#A
definition: _
type: Concept
type: Code
type: Thing

cape
in scheme: http://www.geonames.org/ontology#T
definition: a land area, more prominent than a point, projecting into the sea and marking a notable change in coastal direction
type: Concept
type: Code
type: Thing

sea
in scheme: http://www.geonames.org/ontology#H
definition: a large body of salt water more or less confined by continuous land or chains of islands forming a subdivision of an ocean
type: Concept
type: Code
type: Thing

abandoned railroad stop
in scheme: http://www.geonames.org/ontology#S
definition: _
type: Concept
type: Code
type: Thing

university
in scheme: http://www.geonames.org/ontology#S
definition: An institution for higher learning with teaching and research facilities constituting a graduate school and professional schools that award master's degrees and doctorates and an undergraduate division that awards bachelor's degrees.
type: Concept
type: Code
type: Thing

wildlife reserve
in scheme: http://www.geonames.org/ontology#L
definition: a tract of public land reserved for the preservation of wildlife
type: Concept
type: Code
type: Thing

section of stream
in scheme: http://www.geonames.org/ontology#H
definition: _
type: Concept
type: Code
type: Thing

metro station
in scheme: http://www.geonames.org/ontology#S
definition: metro station (Underground, Tube, or Métro)
type: Concept
type: Code
type: Thing

military base
in scheme: http://www.geonames.org/ontology#L
definition: a place used by an army or other armed service for storing arms and supplies, and for accommodating and training troops, a base from which operations can be initiated
type: Concept
type: Code
type: Thing

delta
in scheme: http://www.geonames.org/ontology#T
definition: a flat plain formed by alluvial deposits at the mouth of a stream
type: Concept
type: Code
type: Thing

strait
in scheme: http://www.geonames.org/ontology#H
definition: a relatively narrow waterway, usually narrower and less extensive than a sound, connecting two larger bodies of water
type: Concept
type: Code
type: Thing

monastery
in scheme: http://www.geonames.org/ontology#S
definition: a building and grounds where a community of monks lives in seclusion
type: Concept
type: Code
type: Thing

castle
in scheme: http://www.geonames.org/ontology#S
definition: a large fortified building or set of buildings
type: Concept
type: Code
type: Thing

pyramids
in scheme: http://www.geonames.org/ontology#S
definition: ancient massive structures of square ground plan with four triangular faces meeting at a point and used for enclosing tombs
type: Concept
type: Code
type: Thing

talus slope
in scheme: http://www.geonames.org/ontology#T
definition: a steep concave slope formed by an accumulation of loose rock fragments at the base of a cliff or steep slope
type: Concept
type: Code
type: Thing

coral reef(s)
in scheme: http://www.geonames.org/ontology#H
definition: a surface-navigation hazard composed of coral
type: Concept
type: Code
type: Thing

gate
in scheme: http://www.geonames.org/ontology#S
definition: a controlled access entrance or exit
type: Concept
type: Code
type: Thing

shoals
in scheme: http://www.geonames.org/ontology#U
definition: hazards to surface navigation composed of unconsolidated material
type: Concept
type: Code
type: Thing

space center
in scheme: http://www.geonames.org/ontology#S
definition: a facility for launching, tracking, or controlling satellites and space vehicles
type: Concept
type: Code
type: Thing

lake region
in scheme: http://www.geonames.org/ontology#L
definition: a tract of land distinguished by numerous lakes
type: Concept
type: Code
type: Thing

salt mine(s)
in scheme: http://www.geonames.org/ontology#S
definition: a mine from which salt is extracted
type: Concept
type: Code
type: Thing

courthouse
in scheme: http://www.geonames.org/ontology#S
definition: a building in which courts of law are held
type: Concept
type: Code
type: Thing

fishing area
in scheme: http://www.geonames.org/ontology#H
definition: a fishing ground, bank or area where fishermen go to catch fish
type: Concept
type: Code
type: Thing

corral(s)
in scheme: http://www.geonames.org/ontology#S
definition: a pen or enclosure for confining or capturing animals
type: Concept
type: Code
type: Thing

battlefield
in scheme: http://www.geonames.org/ontology#L
definition: a site of a land battle of historical importance
type: Concept
type: Code
type: Thing

irrigation ditch
in scheme: http://www.geonames.org/ontology#H
definition: a ditch which serves to distribute irrigation water
type: Concept
type: Code
type: Thing

section of independent political entity
in scheme: http://www.geonames.org/ontology#A
definition: _
type: Concept
type: Code
type: Thing

agricultural reserve
in scheme: http://www.geonames.org/ontology#L
definition: a tract of land reserved for agricultural reclamation and/or development
type: Concept
type: Code
type: Thing

causeway
in scheme: http://www.geonames.org/ontology#R
definition: a raised roadway across wet ground or shallow water
type: Concept
type: Code
type: Thing

stream bend
in scheme: http://www.geonames.org/ontology#H
definition: a conspicuously curved or bent segment of a stream
type: Concept
type: Code
type: Thing

hill
in scheme: http://www.geonames.org/ontology#U
definition: an elevation rising generally less than 500 meters
type: Concept
type: Code
type: Thing

agricultural colony
in scheme: http://www.geonames.org/ontology#L
definition: a tract of land set aside for agricultural settlement
type: Concept
type: Code
type: Thing

reserve
in scheme: http://www.geonames.org/ontology#L
definition: a tract of public land reserved for future use or restricted as to use
type: Concept
type: Code
type: Thing

divide
in scheme: http://www.geonames.org/ontology#T
definition: a line separating adjacent drainage basins
type: Concept
type: Code
type: Thing

isthmus
in scheme: http://www.geonames.org/ontology#T
definition: a narrow strip of land connecting two larger land masses and bordered by water
type: Concept
type: Code
type: Thing

streams
in scheme: http://www.geonames.org/ontology#H
definition: bodies of running water moving to a lower level in a channel on land
type: Concept
type: Code
type: Thing

industrial area
in scheme: http://www.geonames.org/ontology#L
definition: an area characterized by industrial activity
type: Concept
type: Code
type: Thing

administrative facility
in scheme: http://www.geonames.org/ontology#S
definition: a government building
type: Concept
type: Code
type: Thing

amphitheater
in scheme: http://www.geonames.org/ontology#S
definition: an oval or circular structure with rising tiers of seats about a stage or open space
type: Concept
type: Code
type: Thing

fourth-order administrative division
in scheme: http://www.geonames.org/ontology#A
definition: a subdivision of a third-order administrative division
type: Concept
type: Code
type: Thing

coalfield
in scheme: http://www.geonames.org/ontology#L
definition: a region in which coal deposits of possible economic value occur
type: Concept
type: Code
type: Thing

communication center
in scheme: http://www.geonames.org/ontology#S
definition: a facility, including buildings, antennae, towers and electronic equipment for receiving and transmitting information
type: Concept
type: Code
type: Thing

cemetery
in scheme: http://www.geonames.org/ontology#S
definition: a burial place or ground
type: Concept
type: Code
type: Thing

Language School
in scheme: http://www.geonames.org/ontology#S
definition: Language Schools & Institutions
type: Concept
type: Code
type: Thing

section of estate
in scheme: http://www.geonames.org/ontology#S
definition: _
type: Concept
type: Code
type: Thing

dune(s)
in scheme: http://www.geonames.org/ontology#T
definition: a wave form, ridge or star shape feature composed of sand
type: Concept
type: Code
type: Thing

cliff(s)
in scheme: http://www.geonames.org/ontology#T
definition: a high, steep to perpendicular slope overlooking a waterbody or lower area
type: Concept
type: Code
type: Thing

http://www.geonames.org/ontology#A
type: ConceptScheme
type: Class
type: Thing
comment: country, state, region ...

intermittent pool
in scheme: http://www.geonames.org/ontology#H
definition: _
type: Concept
type: Code
type: Thing

clinic
in scheme: http://www.geonames.org/ontology#S
definition: a medical facility associated with a hospital for outpatients
type: Concept
type: Code
type: Thing

olive oil mill
in scheme: http://www.geonames.org/ontology#S
definition: a mill where oil is extracted from olives
type: Concept
type: Code
type: Thing

intermittent salt lake
in scheme: http://www.geonames.org/ontology#H
definition: _
type: Concept
type: Code
type: Thing

abandoned airfield
in scheme: http://www.geonames.org/ontology#S
definition: _
type: Concept
type: Code
type: Thing

oil camp
in scheme: http://www.geonames.org/ontology#S
definition: a camp used by oilfield workers
type: Concept
type: Code
type: Thing

salt area
in scheme: http://www.geonames.org/ontology#L
definition: a shallow basin or flat where salt accumulates after periodic inundation
type: Concept
type: Code
type: Thing

country house
in scheme: http://www.geonames.org/ontology#S
definition: a large house, mansion, or chateau, on a large estate
type: Concept
type: Code
type: Thing

gully
in scheme: http://www.geonames.org/ontology#U
definition: a small valley-like feature
type: Concept
type: Code
type: Thing

temple(s)
in scheme: http://www.geonames.org/ontology#S
definition: an edifice dedicated to religious worship
type: Concept
type: Code
type: Thing

drainage ditch
in scheme: http://www.geonames.org/ontology#H
definition: a ditch which serves to drain the land
type: Concept
type: Code
type: Thing

seat of a third-order administrative division
in scheme: http://www.geonames.org/ontology#P
definition: _
type: Concept
type: Code
type: Thing

sawmill
in scheme: http://www.geonames.org/ontology#S
definition: a mill where logs or lumber are sawn to specified shapes and sizes
type: Concept
type: Code
type: Thing

capital of a political entity
in scheme: http://www.geonames.org/ontology#P
definition: _
type: Concept
type: Code
type: Thing

abandoned farm
in scheme: http://www.geonames.org/ontology#S
definition: _
type: Concept
type: Code
type: Thing

http://www.geonames.org/ontology#R
type: ConceptScheme
type: Class
type: Thing
comment: road, railroad, ...

hammock(s)
in scheme: http://www.geonames.org/ontology#T
definition: a patch of ground, distinct from and slightly above the surrounding plain or wetland. Often occurs in groups
type: Concept
type: Code
type: Thing

continental rise
in scheme: http://www.geonames.org/ontology#U
definition: a gentle slope rising from oceanic depths towards the foot of a continental slope
type: Concept
type: Code
type: Thing

fan(s)
in scheme: http://www.geonames.org/ontology#T
definition: a fan-shaped wedge of coarse alluvium with apex merging with a mountain stream bed and the fan spreading out at a low angle slope onto an adjacent plain
type: Concept
type: Code
type: Thing

banana plantation
in scheme: http://www.geonames.org/ontology#S
definition: an estate that specializes in the growing of bananas
type: Concept
type: Code
type: Thing

housing development
in scheme: http://www.geonames.org/ontology#L
definition: a tract of land on which many houses of similar design are built according to a development plan
type: Concept
type: Code
type: Thing

military installation
in scheme: http://www.geonames.org/ontology#S
definition: a facility for use of and control by armed forces
type: Concept
type: Code
type: Thing

Geonames ontology
type: Ontology
comment: Modifications from version 2.0 : removed "#inCountry" ObjectProperty and "Country" class, replaced by "#countryCode" DatatypeProperty. "#name" and "#alternateName" declared as subproperties of skos:prefLabel and skos:altLabel respectively, no more need for the "Full" ontology present in version 2.0. Updated list of feature codes. Mappings from codes to external resources (GEMET) are removed. A further SKOS publication of feature codes will include status, dates, multilingual translations and mappings with other concept schemes.
prior version: ontology v2.0 Lite.rdf
version info: Version 2.1 - 2010-05-10