has instructor
range: Thing
domain: Thing
type: ObjectProperty
domain: Course
comment: A person delivering tuition as part of the course
range: Person
type: Property
domain: Resource
domain: Abstract-Information
range: Resource

Assessment Method
subclass of: Thing
subclass of: Resource
type: Class
comment: A method by which a student is assessed; instances of this class may include examination, coursework, etc.

has infrastructure requirement
range: Thing
domain: Thing
type: ObjectProperty
range: Technology
domain: Course
comment: An infrastructure requirement that is needed to carry out the course
type: Property
domain: Resource
domain: Abstract-Information
range: Resource

has pre-requisite
range: Thing
domain: Thing
type: ObjectProperty
domain: Course
range: Pre-requisite
type: Property
domain: Resource
domain: Abstract-Information
range: Resource

involves organisation
range: Thing
domain: Thing
type: ObjectProperty
domain: Course
range: Organization
comment: The association of an organisation which is involved in delivering a course
type: Property
domain: Resource
domain: Abstract-Information
range: Resource

Student Interaction Type
subclass of: Thing
subclass of: Resource
type: Class
comment: A type of interaction in which a student engages whilst undertaking a course; instances of this class may include lectures, laboratory sessions, and group or individual projects.

has author
range: Thing
domain: Thing
type: ObjectProperty
range: Generic-Agent
domain: Course
comment: A person which is involved with the creation of the course
type: Property
domain: Resource
domain: Abstract-Information
range: Resource

has-rights
range: Thing
domain: Thing
type: ObjectProperty
domain: Abstract-Information
comment: This property describes the intellectual property rights and conditions of use for this learning object.
type: Property
domain: Resource
range: Resource

has student interaction type
range: Thing
domain: Thing
type: ObjectProperty
range: Student Interaction Type
comment: Identifies a course as having the prescribed interaction type
domain: Course
type: Property
domain: Resource
domain: Abstract-Information
range: Resource

Pre-requisite
subclass of: Resource
subclass of: Thing
type: Class
comment: This class encapsulates a body of previous knowledge required to undertake a course.

has assessment method
range: Thing
domain: Thing
type: ObjectProperty
domain: Course
range: Assessment Method
type: Property
domain: Resource
domain: Abstract-Information
range: Resource

Course
subclass of: Thing
subclass of: Resource
type: Class
comment: This class encapsulates a course that is taught to students
subclass of: Abstract-Information

has courseware
range: Thing
domain: Thing
type: ObjectProperty
comment: Courseware used by the Resist-Course (reference texts, personal hand-outs, slides, etc).
range: Publication-Reference
domain: Course
type: Property
domain: Resource
domain: Abstract-Information
range: Resource

submitted by
range: Thing
domain: Thing
type: ObjectProperty
range: Generic-Agent
domain: Course
comment: The ReSIST Project member who has submitted and is the point of contact for this course
type: Property
domain: Resource
domain: Abstract-Information
range: Resource

taught at
range: Thing
domain: Thing
type: ObjectProperty
domain: Course
range: Organization
comment: The organization at which this course is taught
type: Property
domain: Resource
domain: Abstract-Information
range: Resource

detailed description
type: DatatypeProperty
comment: A detailed description of the content conveyed within the course
domain: Course
range: string
type: Property
domain: Thing
domain: Resource
domain: Abstract-Information
range: Resource

http://lodlaundromat.org/.well-known/genid/samples/jena///predicate//850ac28620189b839293ec032b7c07aa/8b5db2fc411646582e971757d8e5c77c#8
rest: http://lodlaundromat.org/.well-known/genid/samples/jena///predicate//850ac28620189b839293ec032b7c07aa/8b5db2fc411646582e971757d8e5c77c#9
first: false

total hours of engagement
type: DatatypeProperty
range: float
domain: Course
comment: The total number of hours of engagement while undertaking this course
type: Property
domain: Thing
domain: Resource
domain: Abstract-Information
range: Resource

http://lodlaundromat.org/.well-known/genid/samples/jena///predicate//850ac28620189b839293ec032b7c07aa/8b5db2fc411646582e971757d8e5c77c#2
first: false
rest: http://lodlaundromat.org/.well-known/genid/samples/jena///predicate//850ac28620189b839293ec032b7c07aa/8b5db2fc411646582e971757d8e5c77c#3

has language
type: DatatypeProperty
domain: Abstract-Information
comment: The language in which an item of abstract information is written, expressed or delivered.
range: language
type: Property
domain: Resource
range: Resource

course duration
type: DatatypeProperty
comment: The total duration of the course (in hours)
range: integer
domain: Course
type: Property
domain: Thing
domain: Resource
domain: Abstract-Information
range: Resource
range: decimal

ReSIST Courseware Ontology
type: Ontology
description: The ReSIST Courseware Ontology represents the various eduacational courses and resources within the ReSIST project
version info: 0.1
creator: Bene Rodriguez
creator: Ian Millard
created: 2006-05-03
imports: portal

has-rights-description
type: DatatypeProperty
range: string
domain: Abstract-Information
comment: Comments on the conditions of use of this learning resource.
type: Property
domain: Resource
range: Resource

http://lodlaundromat.org/.well-known/genid/samples/jena///predicate//850ac28620189b839293ec032b7c07aa/8b5db2fc411646582e971757d8e5c77c#6
rest: nil
first: true

course objectives
type: DatatypeProperty
range: string
domain: Course
comment: The objectives of this course
type: Property
domain: Thing
domain: Resource
domain: Abstract-Information
range: Resource

title
type: DatatypeProperty
range: string
domain: Course
comment: The title of this course
sub property of: label
type: Property
domain: Thing
domain: Resource
domain: Abstract-Information
range: Resource

http://lodlaundromat.org/.well-known/genid/samples/jena///predicate//850ac28620189b839293ec032b7c07aa/8b5db2fc411646582e971757d8e5c77c#5
rest: http://lodlaundromat.org/.well-known/genid/samples/jena///predicate//850ac28620189b839293ec032b7c07aa/8b5db2fc411646582e971757d8e5c77c#6
first: false

hours of personal study
type: DatatypeProperty
range: float
domain: Course
comment: The total number of hours of personal study in this course
type: Property
domain: Thing
domain: Resource
domain: Abstract-Information
range: Resource

has-rights-copyright
type: DatatypeProperty
range: http://lodlaundromat.org/.well-known/genid/samples/jena///predicate//850ac28620189b839293ec032b7c07aa/8b5db2fc411646582e971757d8e5c77c#4
domain: Abstract-Information
comment: Whether copyright or other restrictions apply to the use of this learning resource.
type: Property
domain: Resource
range: http://lodlaundromat.org/.well-known/genid/samples/jena///predicate//850ac28620189b839293ec032b7c07aa/8b5db2fc411646582e971757d8e5c77c#1
range: http://lodlaundromat.org/.well-known/genid/samples/jena///predicate//850ac28620189b839293ec032b7c07aa/8b5db2fc411646582e971757d8e5c77c#7
range: Resource

www.aktors.org
locale: en_US
type: website
title: Turning Shoe Information to Knowledge of Technology and Deals
description: Take a look at Nike and Adidas Shoe technology, and use Finish Line coupons to save money on athletic shoes and performance apparel
site name: Aktors

number of credits
type: DatatypeProperty
domain: Course
comment: The number of EU BS/MS program credits
range: float
type: Property
domain: Thing
domain: Resource
domain: Abstract-Information
range: Resource

hours of labs
type: DatatypeProperty
domain: Course
range: float
comment: The total number of hours of laboratory sessions in this course
type: Property
domain: Thing
domain: Resource
domain: Abstract-Information
range: Resource

http://lodlaundromat.org/.well-known/genid/samples/jena///predicate//850ac28620189b839293ec032b7c07aa/8b5db2fc411646582e971757d8e5c77c#9
rest: nil
first: true

hours of lectures
type: DatatypeProperty
domain: Course
range: float
comment: The total number of hours of lectures delivered in this course
type: Property
domain: Thing
domain: Resource
domain: Abstract-Information
range: Resource

http://lodlaundromat.org/.well-known/genid/samples/jena///predicate//850ac28620189b839293ec032b7c07aa/8b5db2fc411646582e971757d8e5c77c#3
rest: nil
first: true

has-rights-cost
type: DatatypeProperty
comment: Whether use of this learning resource requires payment
domain: Abstract-Information
range: http://lodlaundromat.org/.well-known/genid/samples/jena///predicate//850ac28620189b839293ec032b7c07aa/8b5db2fc411646582e971757d8e5c77c#1
type: Property
domain: Resource
range: http://lodlaundromat.org/.well-known/genid/samples/jena///predicate//850ac28620189b839293ec032b7c07aa/8b5db2fc411646582e971757d8e5c77c#7
range: Resource
range: http://lodlaundromat.org/.well-known/genid/samples/jena///predicate//850ac28620189b839293ec032b7c07aa/8b5db2fc411646582e971757d8e5c77c#4