at place
range: Thing
domain: Thing
type: ObjectProperty
issued: 2009-07-28
comment: This property relates an event to some meaningful place, which may have a name (e.g. "Paris") or may be defined relative to some other entity or entities (e.g. "the unincorporated area between Carson and Harbor Gateway"). An event may be related to more than one such place.
domain: Event
range: Place
sub property of: hasLocation
definition: a named or relatively specified place that is where an event happened.
type: Property
range: Resource
domain: Resource
domain: E2 Temporal Entity

Event
subclass of: Thing
subclass of: Event
subclass of: Resource
type: Class
issued: 2009-07-28
definition: "Something that happened," as might be reported in a news article or explained by a historian.
comment: An event consists of some temporal and spatial boundaries subjectively imposed on the flux of reality or imagination, that we wish to treat as an entity for the purposes of making statements about it. In particular, we may wish to make statements that relate people, places, or things to an event.
comment: Note that, unlike some defintions of "event," this definition does not specify that an event involves a change of state, nor does it attempt to distinguish events from processes or states.
subclass of: E2 Temporal Entity
equivalent class: Event

in space
range: Thing
domain: Thing
sub property of: place
definition: an abstract region of space (e.g. a geospatial point or region) that is where an event happened.
comment: Note that a statement that relates an event to a region of space using this property only asserts that an event occurred somewhere within the region and does not assert that it occurred everywhere within the region.
sub property of: hasRegion
type: ObjectProperty
domain: Event
type: FunctionalProperty
issued: 2009-07-28
range: SpatialThing
comment: This property relates an event to some subjectively imposed spatial boundaries, i.e. a region of space. An event can be related to only one such region of space.
equivalent property: place
type: Property
domain: Resource
domain: E2 Temporal Entity
range: Resource

illustrate
range: Thing
type: ObjectProperty
issued: 2010-10-07
comment: This property relates any thing (typically a media object) to an event which it illustrates, documents or comments upon.
domain: Thing
range: Event
definition: an event illustrated by some thing (typically a media object)
type: Property
range: Resource
range: E2 Temporal Entity
domain: Resource

circa
range: Thing
domain: Thing
type: ObjectProperty
issued: 2009-07-28
comment: This property relates a span of time that cannot be precisely located in a chronological series to another span of time that can be precisely located, thus asserting that the latter is an approximation of the former.
comment: An temporal relation expressing nearness in time.
domain: TemporalEntity
range: DateTimeInterval
definition: an interval of time that can be precisely described using calendar dates and clock times.
type: Property
range: Resource
domain: Resource

involved
range: Thing
domain: Thing
sub property of: hasParticipant
type: ObjectProperty
issued: 2009-07-28
comment: This property relates an event to any physical, social, or mental object or substance. It does not imply any causal relationship or influence or any other kind of explanatory relationship such as creation, destruction, etc.
domain: Event
range: Object
equivalent property: hasParticipant
definition: a (physical, social, or mental) object involved in an event.
type: Property
domain: Resource
domain: E2 Temporal Entity
range: Resource

at time
range: Thing
domain: Thing
sub property of: time
issued: 2009-07-28
range: TemporalEntity
type: ObjectProperty
domain: Event
comment: Equivalent definitions from other ontologies: * C4DM Event ontology: "Relates an event to a time object, classifying a time region (either instantaneous or having an extent)."
sub property of: isObservableAt
sub property of: P4 has time-span
comment: This property relates an event to some subjectively imposed temporal boundaries, i.e. a span of time. An event can be related to only one such span of time.
type: FunctionalProperty
definition: an abstract instant or interval of time that is when an event happened.
equivalent property: time
type: Property
domain: Resource
domain: E2 Temporal Entity
range: Resource

involved agent
range: Thing
domain: Thing
sub property of: involvesAgent
sub property of: hasParticipant
type: ObjectProperty
definition: an agent involved in an event.
issued: 2009-07-28
equivalent property: involvesAgent
range: Agent
sub property of: involved
domain: Event
comment: This property relates an event to anything with agency, such as a (legal or natural) person, a group, an organization, a computational agent, etc. It does not imply any causal relationship, influence, intentionality, etc.
type: Property
domain: Resource
domain: E2 Temporal Entity
range: Object
range: Resource

Language
issued: 1999-07-02
note: A second property with the same name as this property has been declared in the dcterms: namespace (http://purl.org/dc/terms/). See the Introduction to the document "DCMI Metadata Terms" (http://dublincore.org/documents/dcmi-terms/) for an explanation.
has version: language-007
description: Recommended best practice is to use a controlled vocabulary such as RFC 4646 [RFC4646].
type: Property
comment: A language of the resource.
modified: 2008-01-14

application/rdf+xml
type: IMT
label: RDF/XML

Coverage
description: Spatial topic and spatial applicability may be a named place or a location specified by its geographic coordinates. Temporal topic may be a named period, date, or date range. A jurisdiction may be a named administrative entity or a geographic place to which the resource applies. Recommended best practice is to use a controlled vocabulary such as the Thesaurus of Geographic Names [TGN]. Where appropriate, named places or time periods can be used in preference to numeric identifiers such as sets of coordinates or date ranges.
has version: coverage-006
issued: 1999-07-02
modified: 2008-01-14
type: Property
comment: The spatial or temporal topic of the resource, the spatial applicability of the resource, or the jurisdiction under which the resource is relevant.
note: A second property with the same name as this property has been declared in the dcterms: namespace (http://purl.org/dc/terms/). See the Introduction to the document "DCMI Metadata Terms" (http://dublincore.org/documents/dcmi-terms/) for an explanation.

LODE: An ontology for Linking Open Descriptions of Events
has format: rdfxml
has format: http://linkedevents.org/ontology/html/
contributor: Lynda Hardman
date: 2010-10-07
preferred namespace prefix: lode
version info: 2010-10-07
issued: 2009-10-07
rights: Copyright © 2010 Ryan Shaw
comment: This document describes an ontology for publishing descriptions of historical events as Linked Data, and for mapping between other event-related vocabularies and ontologies.
license: http://creativecommons.org/licenses/by-sa/3.0/
modified: 2010-10-07
type: Ontology
creator: Ryan Shaw
contributor: Raphaël Troncy

text/html
type: IMT
label: HTML

Publisher
description: Examples of a Publisher include a person, an organization, or a service. Typically, the name of a Publisher should be used to indicate the entity.
has version: publisher-006
issued: 1999-07-02
modified: 2008-01-14
type: Property
comment: An entity responsible for making the resource available.
note: A second property with the same name as this property has been declared in the dcterms: namespace (http://purl.org/dc/terms/). See the Introduction to the document "DCMI Metadata Terms" (http://dublincore.org/documents/dcmi-terms/) for an explanation.

Relation
description: Recommended best practice is to identify the related resource by means of a string conforming to a formal identification system.
has version: relation-006
issued: 1999-07-02
modified: 2008-01-14
type: Property
comment: A related resource.
note: A second property with the same name as this property has been declared in the dcterms: namespace (http://purl.org/dc/terms/). See the Introduction to the document "DCMI Metadata Terms" (http://dublincore.org/documents/dcmi-terms/) for an explanation.

Creator
description: Examples of a Creator include a person, an organization, or a service. Typically, the name of a Creator should be used to indicate the entity.
has version: creator-006
issued: 1999-07-02
modified: 2008-01-14
type: Property
comment: An entity primarily responsible for making the resource.
note: A second property with the same name as this property has been declared in the dcterms: namespace (http://purl.org/dc/terms/). See the Introduction to the document "DCMI Metadata Terms" (http://dublincore.org/documents/dcmi-terms/) for an explanation.

Subject
description: Typically, the subject will be represented using keywords, key phrases, or classification codes. Recommended best practice is to use a controlled vocabulary.
has version: subject-007
issued: 1999-07-02
modified: 2012-06-14
type: Property
comment: The topic of the resource.
note: A second property with the same name as this property has been declared in the dcterms: namespace (http://purl.org/dc/terms/). See the Introduction to the document "DCMI Metadata Terms" (http://dublincore.org/documents/dcmi-terms/) for an explanation.

Format
description: Examples of dimensions include size and duration. Recommended best practice is to use a controlled vocabulary such as the list of Internet Media Types [MIME].
has version: format-007
issued: 1999-07-02
modified: 2008-01-14
type: Property
comment: The file format, physical medium, or dimensions of the resource.
note: A second property with the same name as this property has been declared in the dcterms: namespace (http://purl.org/dc/terms/). See the Introduction to the document "DCMI Metadata Terms" (http://dublincore.org/documents/dcmi-terms/) for an explanation.

Rights
description: Typically, rights information includes a statement about various property rights associated with the resource, including intellectual property rights.
has version: rights-006
issued: 1999-07-02
modified: 2008-01-14
type: Property
comment: Information about rights held in and over the resource.
note: A second property with the same name as this property has been declared in the dcterms: namespace (http://purl.org/dc/terms/). See the Introduction to the document "DCMI Metadata Terms" (http://dublincore.org/documents/dcmi-terms/) for an explanation.

Title
has version: title-006
issued: 1999-07-02
modified: 2008-01-14
type: Property
comment: A name given to the resource.
note: A second property with the same name as this property has been declared in the dcterms: namespace (http://purl.org/dc/terms/). See the Introduction to the document "DCMI Metadata Terms" (http://dublincore.org/documents/dcmi-terms/) for an explanation.

Identifier
description: Recommended best practice is to identify the resource by means of a string conforming to a formal identification system.
has version: identifier-006
issued: 1999-07-02
modified: 2008-01-14
type: Property
comment: An unambiguous reference to the resource within a given context.
note: A second property with the same name as this property has been declared in the dcterms: namespace (http://purl.org/dc/terms/). See the Introduction to the document "DCMI Metadata Terms" (http://dublincore.org/documents/dcmi-terms/) for an explanation.

Type
description: Recommended best practice is to use a controlled vocabulary such as the DCMI Type Vocabulary [DCMITYPE]. To describe the file format, physical medium, or dimensions of the resource, use the Format element.
has version: type-006
issued: 1999-07-02
modified: 2008-01-14
type: Property
comment: The nature or genre of the resource.
note: A second property with the same name as this property has been declared in the dcterms: namespace (http://purl.org/dc/terms/). See the Introduction to the document "DCMI Metadata Terms" (http://dublincore.org/documents/dcmi-terms/) for an explanation.

Source
description: The described resource may be derived from the related resource in whole or in part. Recommended best practice is to identify the related resource by means of a string conforming to a formal identification system.
has version: source-006
issued: 1999-07-02
modified: 2008-01-14
type: Property
comment: A related resource from which the described resource is derived.
note: A second property with the same name as this property has been declared in the dcterms: namespace (http://purl.org/dc/terms/). See the Introduction to the document "DCMI Metadata Terms" (http://dublincore.org/documents/dcmi-terms/) for an explanation.

Dublin Core Metadata Element Set, Version 1.1
modified: 2012-06-14
publisher: DCMI

Description
description: Description may include but is not limited to: an abstract, a table of contents, a graphical representation, or a free-text account of the resource.
has version: description-006
issued: 1999-07-02
modified: 2008-01-14
type: Property
comment: An account of the resource.
note: A second property with the same name as this property has been declared in the dcterms: namespace (http://purl.org/dc/terms/). See the Introduction to the document "DCMI Metadata Terms" (http://dublincore.org/documents/dcmi-terms/) for an explanation.

Contributor
description: Examples of a Contributor include a person, an organization, or a service. Typically, the name of a Contributor should be used to indicate the entity.
has version: contributor-006
issued: 1999-07-02
modified: 2008-01-14
type: Property
comment: An entity responsible for making contributions to the resource.
note: A second property with the same name as this property has been declared in the dcterms: namespace (http://purl.org/dc/terms/). See the Introduction to the document "DCMI Metadata Terms" (http://dublincore.org/documents/dcmi-terms/) for an explanation.

Date
description: Date may be used to express temporal information at any level of granularity. Recommended best practice is to use an encoding scheme, such as the W3CDTF profile of ISO 8601 [W3CDTF].
has version: date-006
issued: 1999-07-02
modified: 2008-01-14
type: Property
comment: A point or period of time associated with an event in the lifecycle of the resource.
note: A second property with the same name as this property has been declared in the dcterms: namespace (http://purl.org/dc/terms/). See the Introduction to the document "DCMI Metadata Terms" (http://dublincore.org/documents/dcmi-terms/) for an explanation.