part of
range: Thing
domain: Thing
type: ObjectProperty
comment: Relates a point to a geometric shape's boundary.
domain: Point
range: LineString
term status: unstable
type: Property
range: Resource
range: Geometry
domain: Resource
domain: SpatialThing

Polygon
subclass of: Resource
subclass of: Thing
type: Class
comment: A closed area defined by an exterior boundary, and optionally one or more interior boundaries.
subclass of: Geometry
subclass of: http://lodlaundromat.org/.well-known/genid/samples/jena///class//798659e801660b8f233ca70a336d5f79/798659e801660b8f233ca70a336d5f79#1
subclass of: http://lodlaundromat.org/.well-known/genid/samples/jena///class//798659e801660b8f233ca70a336d5f79/798659e801660b8f233ca70a336d5f79#2
term status: unstable

Bounding Box
subclass of: Resource
subclass of: Thing
type: Class
comment: Represents a bounding box composed by four line segments.
subclass of: Geometry
term status: unstable

LineString member
range: Thing
domain: Thing
type: ObjectProperty
comment: Links a LineString simple geometry to a MultiLineString composite geometry.
domain: MultiLineString
range: LineString
term status: unstable
type: Property
range: Resource
range: Geometry
domain: Resource
domain: Geometry Collection
domain: Geometry

MultiPoint
subclass of: Resource
subclass of: Thing
type: Class
comment: Describes a collection of Point resources, which define a resource's geometric representation.
subclass of: Geometry Collection
term status: unstable
subclass of: Geometry

Geometry Collection
subclass of: Resource
subclass of: Thing
type: Class
comment: Super-class grouping all composite geometrical representations.
subclass of: Geometry
term status: unstable

Point
subclass of: Thing
subclass of: Resource
type: Class
subclass of: SpatialThing
label: point
comment: A point, typically described using a coordinate system relative to Earth, such as WGS84.
comment: Uniquely identified by lat/long/alt. i.e. spaciallyIntersects(P1, P2) :- lat(P1, LAT), long(P1, LONG), alt(P1, ALT), lat(P2, LAT), long(P2, LONG), alt(P2, ALT). sameThing(P1, P2) :- type(P1, Point), type(P2, Point), spaciallyIntersects(P1, P2).

interior
range: Thing
domain: Thing
type: ObjectProperty
comment: Defines an polygon's boundary within its outer boundary, i.e. a polygon with 'holes' in it.
domain: Polygon
range: LinearRing
sub property of: boundary
term status: unstable
type: Property
range: Resource
range: LineString
range: Geometry
domain: Resource
domain: Geometry
domain: http://lodlaundromat.org/.well-known/genid/samples/jena///class//798659e801660b8f233ca70a336d5f79/798659e801660b8f233ca70a336d5f79#1
domain: http://lodlaundromat.org/.well-known/genid/samples/jena///class//798659e801660b8f233ca70a336d5f79/798659e801660b8f233ca70a336d5f79#2

position list
range: Thing
domain: Thing
type: ObjectProperty
comment: Relates a LineString or LinearRing to the points that define them.
domain: LineString
term status: unstable
type: Property
range: Resource
domain: Resource
domain: Geometry

LineString
subclass of: Thing
subclass of: Resource
type: Class
comment: Represents a series of points connected by straight lines.
subclass of: Geometry
term status: unstable

MultiLineString
subclass of: Resource
subclass of: Thing
type: Class
comment: Describes a geometric shape composed of several LineString resources.
subclass of: Geometry Collection
term status: unstable
subclass of: Geometry

Geometry
subclass of: Thing
subclass of: Resource
type: Class
comment: Super-class grouping all geometrical representations (also ones in non-RDF formats, such as KML, GML, WKT...).
term status: testing

geometry
range: Thing
domain: Thing
type: ObjectProperty
comment: Relates a resource to its geometric shape.
range: Geometry
term status: testing
type: Property
range: Resource
domain: Resource

Point member
range: Thing
domain: Thing
type: ObjectProperty
comment: Links a Point simple geometry to a MultiPoint composite Geometry.
domain: MultiPoint
range: Point
term status: unstable
type: Property
range: Resource
range: SpatialThing
domain: Resource
domain: Geometry Collection
domain: Geometry

LinearRing
subclass of: Resource
subclass of: Thing
type: Class
comment: Represents a series of points connected by straight lines, which form a closed shape. Last point must be the same as the first point.
subclass of: LineString
term status: unstable
subclass of: Geometry

http://lodlaundromat.org/.well-known/genid/samples/jena///class//798659e801660b8f233ca70a336d5f79/798659e801660b8f233ca70a336d5f79#1
subclass of: Resource
subclass of: Thing
type: Class
type: Restriction
on class: LinearRing
on property: exterior
qualified cardinality: 1

MultiPolygon
subclass of: Resource
subclass of: Thing
type: Class
comment: Describes a geometric shape composed of several Polygon resources.
subclass of: Geometry Collection
term status: unstable
subclass of: Geometry

SpatialThing
subclass of: Resource
type: Class
comment: Anything with spatial extent, i.e. size, shape, or position. e.g. people, places, bowling balls, as well as abstract areas like cubes.

Polygon member
range: Thing
domain: Thing
type: ObjectProperty
comment: Links a Polygon simple geometry to a MultiPolygon composite geometry.
domain: MultiPolygon
range: Polygon
term status: unstable
type: Property
range: Resource
range: http://lodlaundromat.org/.well-known/genid/samples/jena///class//798659e801660b8f233ca70a336d5f79/798659e801660b8f233ca70a336d5f79#2
range: Geometry
range: http://lodlaundromat.org/.well-known/genid/samples/jena///class//798659e801660b8f233ca70a336d5f79/798659e801660b8f233ca70a336d5f79#1
domain: Resource
domain: Geometry Collection
domain: Geometry

exterior
range: Thing
domain: Thing
type: ObjectProperty
comment: Defines a polygon's outer boundary.
domain: Polygon
range: LinearRing
sub property of: boundary
term status: unstable
type: Property
range: Resource
range: LineString
range: Geometry
domain: Resource
domain: Geometry
domain: http://lodlaundromat.org/.well-known/genid/samples/jena///class//798659e801660b8f233ca70a336d5f79/798659e801660b8f233ca70a336d5f79#1
domain: http://lodlaundromat.org/.well-known/genid/samples/jena///class//798659e801660b8f233ca70a336d5f79/798659e801660b8f233ca70a336d5f79#2

bounding box
range: Thing
domain: Thing
type: ObjectProperty
comment: Relates a Geometry to its Bounding Box.
domain: Geometry
range: Bounding Box
term status: unstable
type: Property
range: Resource
range: Geometry
domain: Resource

boundary
range: Thing
domain: Thing
type: ObjectProperty
comment: Super-property that groups all properties defining a polygon's boundaries.
domain: Polygon
range: LinearRing
term status: unstable
type: Property
range: Resource
range: LineString
range: Geometry
domain: Resource
domain: http://lodlaundromat.org/.well-known/genid/samples/jena///class//798659e801660b8f233ca70a336d5f79/798659e801660b8f233ca70a336d5f79#2
domain: Geometry
domain: http://lodlaundromat.org/.well-known/genid/samples/jena///class//798659e801660b8f233ca70a336d5f79/798659e801660b8f233ca70a336d5f79#1

lat/long
type: Property
comment: A comma-separated representation of a latitude, longitude coordinate.

longitude
type: Property
domain: SpatialThing
comment: The WGS84 longitude of a SpatialThing (decimal degrees).
domain: Resource

NeoGeo Geometry Ontology
type: Ontology
comment: A vocabulary for describing geographical regions in RDF. $Id: geometry# 81 2012-02-05 11:06:49Z non88sense@gmail.com $
imports: geometry

WGS84 Geo Positioning: an RDF vocabulary
description: A vocabulary for representing latitude, longitude and altitude information in the WGS84 geodetic reference datum. Version $Id: wgs84_pos.rdf,v 1.22 2009/04/20 15:00:30 timbl Exp $. See http://www.w3.org/2003/01/geo/ for more details.
date: $Date: 2009/04/20 15:00:30 $
label: geo
comment: Recent changes to this namespace: $Log: wgs84_pos.rdf,v $ Revision 1.22 2009/04/20 15:00:30 timbl Remove the time bits which have been deal with elsewhere eg in iCal. Revision 1.21 2009/04/20 12:52:47 timbl try again Revision 1.20 2009/04/20 12:42:11 timbl Add Event (edited ages ago and never checked in), and location (following discussion http://chatlogs.planetrdf.com/swig/2009-04-20#T12-36-09) Revision 1.19 2009/04/20 12:36:31 timbl Add Event (edited ages ago and never checked in), and location (following discussion http://chatlogs.planetrdf.com/swig/2009-04-20#T12-36-09) Revision 1.18 2006/02/01 22:01:04 danbri Clarified that lat and long are decimal degrees, and that alt is decimal metres about local reference ellipsoid Revision 1.17 2004/02/06 17:38:12 danbri Fixed a bad commit screwup Revision 1.15 2003/04/19 11:24:08 danbri Fixed the typo even more. Revision 1.14 2003/04/19 11:16:56 danbri fixed a typo Revision 1.13 2003/02/19 22:27:27 connolly relaxed domain constraints on lat/long/alt from Point to SpatialThing Revision 1.12 2003/01/12 01:41:41 danbri Trying local copy of XSLT doc. Revision 1.11 2003/01/12 01:20:18 danbri added a link to morten's xslt rdfs viewer. Revision 1.10 2003/01/11 18:56:49 danbri Removed datatype range from lat and long properties, since they would have required each occurance of the property to mention the datatype. Revision 1.9 2003/01/11 11:41:31 danbri Another typo; repaired rdfs:Property to rdf:Property x4 Revision 1.8 2003/01/11 11:05:02 danbri Added an rdfs:range for each lat/long/alt property, http://www.w3.org/2001/XMLSchema#float Revision 1.7 2003/01/10 20:25:16 danbri Longer rdfs:comment for Point, trying to be Earth-centric and neutral about coordinate system(s) at the same time. Feedback welcomed. Revision 1.6 2003/01/10 20:18:30 danbri Added CVS log comments into the RDF/XML as an rdfs:comment property of the vocabulary. Note that this is not common practice (but seems both harmless and potentially useful). revision 1.…

altitude
type: Property
domain: SpatialThing
comment: The WGS84 altitude of a SpatialThing (decimal meters above the local reference ellipsoid).
domain: Resource

As WKT
type: DatatypeProperty
comment: WKT serialization of the geometry.
term status: deprecated
type: Property

location
type: Property
range: SpatialThing
sub property of: based near
comment: The relation between something and the point, or other geometrical thing in space, where it is. For example, the realtionship between a radio tower and a Point with a given lat and long. Or a relationship between a park and its outline as a closed arc of points, or a road and its location as a arc (a sequence of points). Clearly in practice there will be limit to the accuracy of any such statement, but one would expect an accuracy appropriate for the size of the object and uses such as mapping
range: Resource

latitude
type: Property
domain: SpatialThing
comment: The WGS84 latitude of a SpatialThing (decimal degrees).
domain: Resource