part of
range: Thing
domain: Thing
type: ObjectProperty
comment: Relates a point to a geometric shape's boundary.
domain: Point
range: LineString
term status: unstable
type: Property
range: Resource
range: Geometry
domain: Resource

Polygon
subclass of: Resource
subclass of: Thing
type: Class
comment: A closed area defined by an exterior boundary, and optionally one or more interior boundaries.
subclass of: Geometry
subclass of: http://lodlaundromat.org/.well-known/genid/798659e801660b8f233ca70a336d5f79#1
subclass of: http://lodlaundromat.org/.well-known/genid/798659e801660b8f233ca70a336d5f79#2
term status: unstable

Bounding Box
subclass of: Resource
subclass of: Thing
type: Class
comment: Represents a bounding box composed by four line segments.
subclass of: Geometry
term status: unstable

LineString member
range: Thing
domain: Thing
type: ObjectProperty
comment: Links a LineString simple geometry to a MultiLineString composite geometry.
domain: MultiLineString
range: LineString
term status: unstable
type: Property
range: Resource
range: Geometry
domain: Resource
domain: Geometry Collection
domain: Geometry

MultiPoint
subclass of: Resource
subclass of: Thing
type: Class
comment: Describes a collection of Point resources, which define a resource's geometric representation.
subclass of: Geometry Collection
term status: unstable
subclass of: Geometry

Geometry Collection
subclass of: Resource
subclass of: Thing
type: Class
comment: Super-class grouping all composite geometrical representations.
subclass of: Geometry
term status: unstable

Point
subclass of: Thing
subclass of: Resource
type: Class

interior
range: Thing
domain: Thing
type: ObjectProperty
comment: Defines an polygon's boundary within its outer boundary, i.e. a polygon with 'holes' in it.
domain: Polygon
range: LinearRing
sub property of: boundary
term status: unstable
type: Property
range: Resource
range: LineString
range: Geometry
domain: Resource
domain: Geometry
domain: http://lodlaundromat.org/.well-known/genid/798659e801660b8f233ca70a336d5f79#1
domain: http://lodlaundromat.org/.well-known/genid/798659e801660b8f233ca70a336d5f79#2

position list
range: Thing
domain: Thing
type: ObjectProperty
comment: Relates a LineString or LinearRing to the points that define them.
domain: LineString
term status: unstable
type: Property
range: Resource
domain: Resource
domain: Geometry

LineString
subclass of: Thing
subclass of: Resource
type: Class
comment: Represents a series of points connected by straight lines.
subclass of: Geometry
term status: unstable

http://lodlaundromat.org/.well-known/genid/798659e801660b8f233ca70a336d5f79#1
subclass of: Resource
subclass of: Thing
type: Class
type: Restriction
on class: LinearRing
on property: exterior
qualified cardinality: 1

MultiLineString
subclass of: Resource
subclass of: Thing
type: Class
comment: Describes a geometric shape composed of several LineString resources.
subclass of: Geometry Collection
term status: unstable
subclass of: Geometry

Geometry
subclass of: Thing
subclass of: Resource
type: Class
comment: Super-class grouping all geometrical representations (also ones in non-RDF formats, such as KML, GML, WKT...).
term status: testing

geometry
range: Thing
domain: Thing
type: ObjectProperty
comment: Relates a resource to its geometric shape.
range: Geometry
term status: testing
type: Property
range: Resource
domain: Resource

Point member
range: Thing
domain: Thing
type: ObjectProperty
comment: Links a Point simple geometry to a MultiPoint composite Geometry.
domain: MultiPoint
range: Point
term status: unstable
type: Property
range: Resource
domain: Resource
domain: Geometry Collection
domain: Geometry

LinearRing
subclass of: Resource
subclass of: Thing
type: Class
comment: Represents a series of points connected by straight lines, which form a closed shape. Last point must be the same as the first point.
subclass of: LineString
term status: unstable
subclass of: Geometry

MultiPolygon
subclass of: Resource
subclass of: Thing
type: Class
comment: Describes a geometric shape composed of several Polygon resources.
subclass of: Geometry Collection
term status: unstable
subclass of: Geometry

Polygon member
range: Thing
domain: Thing
type: ObjectProperty
comment: Links a Polygon simple geometry to a MultiPolygon composite geometry.
domain: MultiPolygon
range: Polygon
term status: unstable
type: Property
range: http://lodlaundromat.org/.well-known/genid/798659e801660b8f233ca70a336d5f79#2
range: Resource
range: http://lodlaundromat.org/.well-known/genid/798659e801660b8f233ca70a336d5f79#1
range: Geometry
domain: Resource
domain: Geometry Collection
domain: Geometry

exterior
range: Thing
domain: Thing
type: ObjectProperty
comment: Defines a polygon's outer boundary.
domain: Polygon
range: LinearRing
sub property of: boundary
term status: unstable
type: Property
range: Resource
range: LineString
range: Geometry
domain: Resource
domain: Geometry
domain: http://lodlaundromat.org/.well-known/genid/798659e801660b8f233ca70a336d5f79#1
domain: http://lodlaundromat.org/.well-known/genid/798659e801660b8f233ca70a336d5f79#2

bounding box
range: Thing
domain: Thing
type: ObjectProperty
comment: Relates a Geometry to its Bounding Box.
domain: Geometry
range: Bounding Box
term status: unstable
type: Property
range: Resource
range: Geometry
domain: Resource

boundary
range: Thing
domain: Thing
type: ObjectProperty
comment: Super-property that groups all properties defining a polygon's boundaries.
domain: Polygon
range: LinearRing
term status: unstable
type: Property
range: Resource
range: LineString
range: Geometry
domain: http://lodlaundromat.org/.well-known/genid/798659e801660b8f233ca70a336d5f79#2
domain: Resource
domain: http://lodlaundromat.org/.well-known/genid/798659e801660b8f233ca70a336d5f79#1
domain: Geometry

NeoGeo Geometry Ontology
type: Ontology
comment: A vocabulary for describing geographical regions in RDF. $Id: geometry# 81 2012-02-05 11:06:49Z non88sense@gmail.com $
imports: geometry

As WKT
type: DatatypeProperty
comment: WKT serialization of the geometry.
term status: deprecated
type: Property