knows
term status: stable
type: Thing
sub property of: topObjectProperty
property disjoint with: bottomObjectProperty
type: ObjectProperty
type: Property
comment: A person known by this person (indicating some level of reciprocated interaction between the parties).
domain: Person
range: Person

has standard identifier
sub property of: has resource identifier
type: Thing
scope note: Customary labels include "ISBN", "ISSN", "ISMN".
property disjoint with: bottomObjectProperty
sub property of: topObjectProperty
has unconstrained: P1154
status: Published
name: hasStandardIdentifier
type: ObjectProperty
definition: Relates a resource to a standard identifier preceded by its customary label.
domain: C2001
type: Property

firstName
term status: testing
type: Thing
sub property of: topDataProperty
property disjoint with: bottomDataProperty
type: DatatypeProperty
type: Property
comment: The first name of a person.
domain: Person
range: Literal

ICQ chat ID
sub property of: nickname
term status: testing
type: Thing
property disjoint with: bottomDataProperty
sub property of: topDataProperty
type: InverseFunctionalProperty
type: DatatypeProperty
domain: Agent
range: Literal
comment: An ICQ chat ID
type: Property

has pagination
scope note: Includes notated music and cartographic resources as well as printed textual resources.
name: hasPagination
property disjoint with: bottomObjectProperty
scope note: Includes the numbering of leaves, columns, etc.
definition: Relates a resource that is a printed text to the sequential numbering of the pages.
status: Published
type: Thing
type: ObjectProperty
sub property of: topObjectProperty
has unconstrained: P1054
domain: C2001
type: Property

birthday
term status: unstable
type: Thing
sub property of: topDataProperty
property disjoint with: bottomDataProperty
type: FunctionalProperty
type: DatatypeProperty
type: Property
comment: The birthday of this Agent, represented in mm-dd string form, eg. '12-31'.
domain: Agent
range: Literal

Given name
term status: archaic
type: Thing
sub property of: topDataProperty
property disjoint with: bottomDataProperty
type: DatatypeProperty
type: Property
comment: The given name of some person.

focus
term status: testing
type: Thing
sub property of: topObjectProperty
property disjoint with: bottomObjectProperty
type: ObjectProperty
type: Property
comment: The underlying or 'focal' entity associated with some SKOS-described concept.
domain: Concept
range: Thing

openid
type: ObjectProperty
term status: testing
sub property of: page
property disjoint with: bottomObjectProperty
type: InverseFunctionalProperty
sub property of: is primary topic of
sub property of: topObjectProperty
type: Thing
range: Document
type: Property
domain: Agent
comment: An OpenID for an Agent.

has specific material designation
type: ObjectProperty
property disjoint with: bottomObjectProperty
status: Published
name: hasSpecificMaterialDesignation
definition: Relates a resource to a term indicating the specific class of material (usually the class of physical object) to which it belongs, and the number of units.
type: Thing
has unconstrained: P1146
sub property of: topObjectProperty
type: Property
domain: C2001

has parallel title statement of series or multipart monographic resource
name: hasParallelTitleStatementOfSeriesOrMultipartMonographicResource
sub property of: topObjectProperty
type: ObjectProperty
status: Published
type: Thing
definition: Relates a resource that is a series or multipart monographic resource to a statement of its parallel title.
has unconstrained: P1174
property disjoint with: bottomObjectProperty
type: Property
domain: C2001

account service homepage
term status: testing
type: Thing
sub property of: topObjectProperty
property disjoint with: bottomObjectProperty
type: ObjectProperty
type: Property
comment: Indicates a homepage of the service provide for this online account.
domain: Online Account
range: Document

is primary topic of
sub property of: topObjectProperty
property disjoint with: bottomObjectProperty
type: Thing
type: ObjectProperty
sub property of: page
type: InverseFunctionalProperty
term status: stable
inverse of: primary topic
comment: A document that this thing is the primary topic of.
domain: Thing
range: Document
type: Property

phone
term status: testing
type: Thing
sub property of: topObjectProperty
property disjoint with: bottomObjectProperty
type: ObjectProperty
type: Property
comment: A phone, specified using fully qualified tel: URI scheme (refs: http://www.w3.org/Addressing/schemes.html#tel).

Given name
term status: testing
type: Thing
sub property of: topDataProperty
property disjoint with: bottomDataProperty
type: DatatypeProperty
type: Property
comment: The given name of some person.

depicts
term status: testing
type: Thing
sub property of: topObjectProperty
property disjoint with: bottomObjectProperty
inverse of: depiction
type: ObjectProperty
type: Property
comment: A thing depicted in this representation.
domain: Image
range: Thing

Project
disjoint with: PersonalProfileDocument
type: Class
term status: testing
disjoint with: Document
subclass of: Thing
disjoint with: Nothing
disjoint with: Image
disjoint with: Person
type: Thing
comment: A project (a collective endeavour of some kind).

account
term status: testing
type: Thing
sub property of: topObjectProperty
property disjoint with: bottomObjectProperty
type: ObjectProperty
type: Property
comment: Indicates an account held by this agent.
domain: Agent
range: Online Account

Skype ID
term status: testing
type: Thing
sub property of: topDataProperty
sub property of: nickname
property disjoint with: bottomDataProperty
type: DatatypeProperty
type: Property
comment: A Skype ID
domain: Agent
range: Literal

Image
type: Class
disjoint with: Organization
subclass of: Thing
type: Thing
disjoint with: Project
subclass of: Document
disjoint with: Nothing
term status: testing
comment: An image.

has title and statement of responsibility area
name: hasTitleAndStatementOfResponsibilityArea
definition: Relates a resource to a statement including the title proper, parallel titles, other title information, and statements of responsibility.
has unconstrained: P1159
status: Published
sub property of: topObjectProperty
property disjoint with: bottomObjectProperty
type: Thing
type: ObjectProperty
type: Property
domain: C2001
range: C2004

page
term status: testing
type: Thing
sub property of: topObjectProperty
property disjoint with: bottomObjectProperty
inverse of: topic
type: ObjectProperty
type: Property
comment: A page or document about this thing.
domain: Thing
range: Document

has date of publication, production, distribution
type: ObjectProperty
name: hasDateOfPublicationProductionDistribution
has unconstrained: P1018
type: Thing
definition: Relates a resource to the date on which it is officially offered for sale or distribution to the public, usually given in the form of a year.
sub property of: topObjectProperty
status: Published
property disjoint with: bottomObjectProperty
type: Property
domain: C2001

Online E-commerce Account
term status: unstable
type: Thing
disjoint with: Nothing
subclass of: Thing
subclass of: Online Account
type: Class
comment: An online e-commerce account.

lastName
term status: testing
type: Thing
sub property of: topDataProperty
property disjoint with: bottomDataProperty
type: DatatypeProperty
type: Property
comment: The last name of a person.
domain: Person
range: Literal

membershipClass
term status: unstable
type: Thing
type: Property
type: AnnotationProperty
comment: Indicates the class of individuals that are a member of a Group

Yahoo chat ID
term status: testing
type: DatatypeProperty
type: Thing
sub property of: topDataProperty
property disjoint with: bottomDataProperty
sub property of: nickname
type: InverseFunctionalProperty
domain: Agent
range: Literal
comment: A Yahoo chat ID
type: Property

homepage
sub property of: topObjectProperty
term status: stable
sub property of: page
sub property of: is primary topic of
type: Thing
property disjoint with: bottomObjectProperty
type: ObjectProperty
type: InverseFunctionalProperty
comment: A homepage for some thing.
range: Document
type: Property
domain: Thing

topic_interest
term status: testing
type: Thing
sub property of: topObjectProperty
property disjoint with: bottomObjectProperty
type: ObjectProperty
type: Property
comment: A thing of interest to this person.
domain: Agent
range: Thing

DNA checksum
term status: archaic
type: Thing
sub property of: topDataProperty
property disjoint with: bottomDataProperty
type: DatatypeProperty
type: Property
comment: A checksum for the DNA of some thing. Joke.
range: Literal

has resource identifier
property disjoint with: bottomObjectProperty
has subproperty: has standard identifier
sub property of: topObjectProperty
has unconstrained: P1032
scope note: Includes any number or alphanumeric designation associated with and identifying a resource according to an international standard, such as an International Standard Book Number or an International Standard Serial Number, or a designation assigned by a publisher. Includes notes considered important to users of the catalogue.
name: hasResourceIdentifier
type: Thing
definition: Relates a resource to an identifier.
type: ObjectProperty
has subproperty: P1075
has subproperty: P1076
status: Published
type: Property
domain: C2001

has title proper
sub property of: P1012
scope note: The title proper includes any alternative title, but excludes parallel titles and other title information. In the case of a section or some supplements and some titles of subseries or parts, the title proper can consist of two or more components: the common title (or the title of the main series or of the multipart monographic resource), the dependent title and the dependent title designation. For resources containing several individual works the title proper is the collective title. Resources containing several individual works and lacking a collective title are considered not to have a title proper. A series or subseries also has its own title proper.
has unconstrained: P1004
definition: Relates a resource to the title proper (the chief name of a resource, i.e. the title of a resource in the form in which it appears on the preferred source of information for the resource).
status: Published
type: ObjectProperty
type: Thing
sub property of: topObjectProperty
name: hasTitleProper
property disjoint with: bottomObjectProperty
domain: C2001
type: Property

gender
term status: testing
type: Thing
sub property of: topDataProperty
property disjoint with: bottomDataProperty
type: FunctionalProperty
type: DatatypeProperty
type: Property
comment: The gender of this Agent (typically but not necessarily 'male' or 'female').
domain: Agent
range: Literal

sha1sum of a personal mailbox URI name
term status: testing
type: Thing
sub property of: topDataProperty
property disjoint with: bottomDataProperty
type: InverseFunctionalProperty
type: DatatypeProperty
type: Property
comment: The sha1sum of the URI of an Internet mailbox associated with exactly one owner, the first owner of the mailbox.
domain: Agent
range: Literal

logo
term status: testing
type: Thing
sub property of: topObjectProperty
property disjoint with: bottomObjectProperty
type: InverseFunctionalProperty
type: ObjectProperty
type: Property
comment: A logo representing some thing.
domain: Thing
range: Thing

has name of publisher, producer, distributor
definition: Relates a resource to the name of the person or corporate body appearing on the resource that effects respectively the publication, production and/or distribution or release activities for the resource.
type: Thing
type: ObjectProperty
has unconstrained: P1017
property disjoint with: bottomObjectProperty
status: Published
name: hasNameOfPublisherProducerDistributor
sub property of: topObjectProperty
type: Property
domain: C2001

funded by
term status: archaic
type: Thing
sub property of: topObjectProperty
property disjoint with: bottomObjectProperty
type: ObjectProperty
type: Property
comment: An organization funding a project or person.
domain: Thing
range: Thing

image
term status: testing
type: Thing
sub property of: topObjectProperty
sub property of: depiction
property disjoint with: bottomObjectProperty
type: ObjectProperty
type: Property
comment: An image that can be used to represent some thing (ie. those depictions which are particularly representative of something, eg. one's photo on a homepage).
domain: Person
range: Image

interest
term status: testing
type: Thing
sub property of: topObjectProperty
property disjoint with: bottomObjectProperty
type: ObjectProperty
type: Property
comment: A page about a topic of interest to this person.
domain: Agent
range: Document

has resource identifier and terms of availability area
type: Thing
sub property of: topObjectProperty
property disjoint with: bottomObjectProperty
has unconstrained: P1165
name: hasResourceIdentifierAndTermsOfAvailabilityArea
status: Published
type: ObjectProperty
definition: Relates a resource to a statement including the resource identifier, the key title, and the terms of availability.
type: Property
domain: C2001
range: C2011

familyName
term status: testing
type: Thing
sub property of: topDataProperty
property disjoint with: bottomDataProperty
type: DatatypeProperty
type: Property
comment: The family name of some person.
domain: Person
range: Literal

has common title of title proper
name: hasCommonTitleOfTitleProper
has unconstrained: P1137
scope note: The common title serves to indicate this relationship in a group of resources and together with the section title identifies a given resource. The common title may also be common to a main resource and its supplement or supplements and to a main series and its subseries when the supplement or supplements or subseries have a dependent title or titles.
type: Thing
property disjoint with: bottomObjectProperty
status: Published
definition: Relates a resource to that part of the title that is carried by a group of related resources in addition to their different section titles.
type: ObjectProperty
sub property of: topObjectProperty
type: Property
domain: C2001

status
term status: unstable
type: Thing
sub property of: topDataProperty
property disjoint with: bottomDataProperty
type: DatatypeProperty
type: Property
comment: A string expressing what the user is happy for the general public (normally) to know about their current activity.
domain: Agent
range: Literal

has dimensions
has unconstrained: P1024
type: ObjectProperty
property disjoint with: bottomObjectProperty
status: Published
scope note: Includes one or more dimensions. Includes the height of the resource, measured parallel to the spine, for printed textual and notated music resources. Includes the height by width of two-dimensional cartographic resources. Includes the height by width by depth of three-dimensional cartographic resources, excluding globes and sections of spheres. Includes the diameter for cartographic resources that are globes, sections of spheres, and two-dimensional circular forms. Includes additional dimensions such as the dimensions of a map when folded, or the dimensions of individual sheets of a collectively described group, or the individual dimensions of mounted sheets, of cartographic resources. Includes the height by width of two-dimensional multimedia resources, sound recordings, videorecordings, and still and moving images (wallcharts, microfiches, slides, transparencies, pictures, etc.). Includes the diameter, followed in parentheses by the abbreviation "diam." or its equivalent in another language, for circular forms of multimedia resources, sound recordings, videorecordings, and still and moving images. Includes the length of the vertical axis, followed in parentheses by "oval" or its equivalent, for oval forms of multimedia resources, sound recordings, videorecordings, and still and moving images. Includes two dimensions statements for the open and folded states of folded sheets of multimedia resources, sound recordings, videorecordings, and still and moving images. Includes height by width by depth (or height alone when appropriate) of three-dimensional multimedia resources, sound recordings, videorecordings, and still and moving images (dioramas, etc.). Includes the gauge of the film or width of the tape for multimedia resources, sound recordings, videorecordings, and still and moving images employing film or magnetic tape. Includes the dimensions of the physical carrier itself, irrespective of the external dimensions of any container, of electronic resources. Inclu…
definition: Relates a resource to a note on its dimensions in centimetres (or millimetres if the gauge of a film or width of a tape) rounded up to the nearest whole.
type: Thing
name: hasDimensions
sub property of: topObjectProperty
type: Property
domain: C2001

MSN chat ID
sub property of: nickname
property disjoint with: bottomDataProperty
type: Thing
sub property of: topDataProperty
type: InverseFunctionalProperty
term status: testing
type: DatatypeProperty
comment: An MSN chat ID
domain: Agent
type: Property
range: Literal

sha1sum (hex)
term status: unstable
type: Thing
sub property of: topDataProperty
property disjoint with: bottomDataProperty
type: DatatypeProperty
type: Property
comment: A sha1sum hash, in hex.
domain: Document

PersonalProfileDocument
term status: testing
disjoint with: Nothing
disjoint with: Project
type: Thing
subclass of: Thing
type: Class
subclass of: Document
disjoint with: Organization
comment: A personal profile RDF document.

work info homepage
term status: testing
type: Thing
sub property of: topObjectProperty
property disjoint with: bottomObjectProperty
type: ObjectProperty
type: Property
comment: A work info homepage of some person; a page about their work for some organization.
domain: Person
range: Document

current project
term status: testing
type: Thing
sub property of: topObjectProperty
property disjoint with: bottomObjectProperty
type: ObjectProperty
type: Property
comment: A current project this person works on.
domain: Person
range: Thing

personal mailbox
term status: stable
type: Thing
sub property of: topObjectProperty
property disjoint with: bottomObjectProperty
type: InverseFunctionalProperty
type: ObjectProperty
type: Property
comment: A personal mailbox, ie. an Internet mailbox associated with exactly one owner, the first owner of this mailbox. This is a 'static inverse functional property', in that there is (across time and change) at most one individual that ever has any particular value for foaf:mbox.
domain: Agent
range: Thing

has place of publication, production, distribution
has unconstrained: P1016
name: hasPlaceOfPublicationProductionDistribution
type: ObjectProperty
scope note: Usually given on the preferred source of information as the name of a city. If no publisher, producer or distributor is named, it is the place from which the resource was issued or distributed.
type: Thing
status: Published
definition: Relates a resource to the name of the place associated on the prescribed source of information with the name of the publisher, producer or distributor.
property disjoint with: bottomObjectProperty
sub property of: topObjectProperty
type: Property
domain: C2001

schoolHomepage
term status: testing
type: Thing
sub property of: topObjectProperty
property disjoint with: bottomObjectProperty
type: ObjectProperty
type: Property
comment: A homepage of a school attended by the person.
domain: Person
range: Document

Friend of a Friend (FOAF) vocabulary
description: The Friend of a Friend (FOAF) RDF vocabulary, described using W3C RDF Schema and the Web Ontology Language.
type: Thing
type: Ontology

Organization
term status: stable
disjoint with: Image
subclass of: Agent
disjoint with: Nothing
disjoint with: Person
disjoint with: Document
subclass of: Thing
type: Thing
disjoint with: PersonalProfileDocument
type: Class
comment: An organization.

maker
sub property of: topObjectProperty
equivalent property: creator
sub property of: creator
term status: stable
inverse of: made
property disjoint with: bottomObjectProperty
type: Thing
type: ObjectProperty
comment: An agent that made this thing.
domain: Thing
type: Property
range: Agent

account
term status: archaic
type: Thing
sub property of: topObjectProperty
property disjoint with: bottomObjectProperty
type: ObjectProperty
type: Property
comment: Indicates an account held by this agent.
domain: Agent
range: Online Account

jabber ID
term status: testing
type: Thing
sub property of: topDataProperty
property disjoint with: bottomDataProperty
type: InverseFunctionalProperty
type: DatatypeProperty
type: Property
comment: A jabber ID for something.
domain: Agent
range: Literal

past project
term status: testing
type: Thing
sub property of: topObjectProperty
property disjoint with: bottomObjectProperty
type: ObjectProperty
type: Property
comment: A project this person has previously worked on.
domain: Person
range: Thing

Online Chat Account
term status: unstable
type: Thing
disjoint with: Nothing
subclass of: Thing
subclass of: Online Account
type: Class
comment: An online chat account.

account name
term status: testing
type: Thing
sub property of: topDataProperty
property disjoint with: bottomDataProperty
type: DatatypeProperty
type: Property
comment: Indicates the name (identifier) associated with this online account.
domain: Online Account
range: Literal

name
term status: testing
type: Thing
sub property of: topDataProperty
property disjoint with: bottomDataProperty
type: DatatypeProperty
type: Property
comment: A name for some thing.
domain: Thing
range: Literal
sub property of: label

Online Account
term status: testing
type: Thing
disjoint with: Nothing
subclass of: Thing
type: Class
comment: An online account.

tipjar
term status: testing
type: Thing
sub property of: topObjectProperty
sub property of: page
property disjoint with: bottomObjectProperty
type: ObjectProperty
type: Property
comment: A tipjar document for this agent, describing means for payment and reward.
domain: Agent
range: Document

has name of publisher, producer, distributor statement
type: Thing
property disjoint with: bottomObjectProperty
status: Published
sub property of: topObjectProperty
has unconstrained: P1169
type: ObjectProperty
definition: Relates a resource to a statement including the name of publisher, producer, distributor, and the parallel statement of publisher, producer, distributor.
name: hasNameOfPublisherProducerDistributorStatement
type: Property
domain: C2001
range: C2019

age
term status: unstable
type: Thing
sub property of: topDataProperty
property disjoint with: bottomDataProperty
type: FunctionalProperty
type: DatatypeProperty
type: Property
comment: The age in years of some agent.
domain: Agent
range: Literal

primary topic
type: FunctionalProperty
sub property of: topic
term status: stable
type: ObjectProperty
type: Thing
inverse of: is primary topic of
sub property of: topObjectProperty
property disjoint with: bottomObjectProperty
domain: Document
range: Thing
type: Property
comment: The primary topic of some page or document.

myersBriggs
term status: testing
type: Thing
sub property of: topDataProperty
property disjoint with: bottomDataProperty
type: DatatypeProperty
type: Property
comment: A Myers Briggs (MBTI) personality classification.
domain: Person
range: Literal

Agent
type: Class
subclass of: Agent
equivalent class: Agent
subclass of: Thing
disjoint with: Nothing
type: Thing
term status: stable
comment: An agent (eg. person, group, software or physical artifact).

Online Gaming Account
term status: unstable
type: Thing
disjoint with: Nothing
subclass of: Thing
subclass of: Online Account
type: Class
comment: An online gaming account.

has material description area
definition: Relates a resource to a statement including the specific material designation and extent, other physical details, the dimensions, and the accompanying material statement.
has unconstrained: P1163
property disjoint with: bottomObjectProperty
type: ObjectProperty
scope note: Restricted to the resource as issued by the publisher.
name: hasMaterialDescriptionArea
status: Published
type: Thing
sub property of: topObjectProperty
type: Property
domain: C2001
range: C2008

has specific material designation and extent
sub property of: topObjectProperty
property disjoint with: bottomObjectProperty
type: ObjectProperty
status: Published
name: hasSpecificMaterialDesignationAndExtent
has unconstrained: P1022
definition: Relates a resource to a statement including the specific material designation, the extent, the pagination statement (if a printed resource), and the playing time (if the resource has an inherent durational aspect).
type: Thing
definition: Relaciona un recurso con una mención incluyendo la designación específica de material, la extension, la mención de paginación (si es un recurso impreso) y la duración (si el recurso tiene un aspecto inherente de duración).
domain: C2001
type: Property
range: C2015

depiction
term status: testing
type: Thing
sub property of: topObjectProperty
property disjoint with: bottomObjectProperty
inverse of: depicts
type: ObjectProperty
type: Property
comment: A depiction of some thing.
domain: Thing
range: Image

Published
type: Concept
type: Thing

weblog
sub property of: page
term status: testing
type: Thing
property disjoint with: bottomObjectProperty
type: InverseFunctionalProperty
type: ObjectProperty
sub property of: topObjectProperty
type: Property
range: Document
comment: A weblog of some thing (whether person, group, company etc.).
domain: Agent

workplace homepage
term status: testing
type: Thing
sub property of: topObjectProperty
property disjoint with: bottomObjectProperty
type: ObjectProperty
type: Property
comment: A workplace homepage of some person; the homepage of an organization they work for.
domain: Person
range: Document

has statement of responsibility relating to title
sub property of: topObjectProperty
status: Published
definition: Relates a resource to one or more names, phrases, or groups of characters relating to the identification and/or function of any persons or corporate bodies responsible for or contributing to the creation or realisation of the intellectual or artistic content of a work contained in the resource.
scope note: A statement of responsibility is not constructed when there is no such statement on the resource. A statement of responsibility can relate to such entities as: writers, composers, performers, graphic artists, choreographers, arrangers, cartographers, programmers, principal investigators, animators, etc., whose work is embodied in the resource, whether directly (e.g. author of text, editor, compiler, translator, illustrator, engraver, cartographer, composer, arranger, choreographer), or indirectly (e.g. author of the novel on which a film script is based, author of the work on which the software is based, adapters of an already existing work), whether in the same medium as the original or in another; collectors of various data, persons responsible for the direction of a performed work; organizations, or individuals or corporate bodies sponsoring the work of any of the above (with intellectual and not merely financial sponsorship), producers of a popular music recording;.production companies and individuals such as producers, directors, or others having some degree of overall responsibility for a work; individuals who have specific responsibilities when in the context of a particular film, or particular type of film, they have a major creative role (e.g. cinematographers, writers of screenplays or animators of animated films); developers and designers, whose work involves the creation of the content of a resource or its realisation (e.g. game designer); entities having specific responsibilities in the context of a particular resource or particular type of resource (e.g. project directors of survey data, video director).
property disjoint with: bottomObjectProperty
name: hasStatementOfResponsibilityRelatingToTitle
type: Thing
has unconstrained: P1007
type: ObjectProperty
type: Property
domain: C2001

title
term status: testing
type: Thing
sub property of: topDataProperty
property disjoint with: bottomDataProperty
type: DatatypeProperty
type: Property
comment: Title (Mr, Mrs, Ms, Dr. etc)

thumbnail
term status: testing
type: Thing
sub property of: topObjectProperty
property disjoint with: bottomObjectProperty
type: ObjectProperty
type: Property
comment: A derived thumbnail image.
domain: Image
range: Image

Person
term status: stable
subclass of: SpatialThing
disjoint with: Nothing
subclass of: Agent
disjoint with: Project
subclass of: Person
subclass of: Thing
type: Class
type: Thing
disjoint with: Organization
comment: A person.

ISBD elements
note: This is a registration of classes and properties from International Standard Bibliographic Description (ISBD), consolidated edition, published by De Gruyter Saur in July 2011 (ISBN 978-3-11-026379-4).
type: Thing

nickname
term status: testing
type: Thing
sub property of: topDataProperty
property disjoint with: bottomDataProperty
type: DatatypeProperty
type: Property
comment: A short informal nickname characterising an agent (includes login identifiers, IRC and other chat nicknames).

made
inverse of: maker
type: ObjectProperty
type: Thing
inverse of: creator
property disjoint with: bottomObjectProperty
sub property of: topObjectProperty
term status: stable
type: Property
comment: Something that was made by this agent.
domain: Agent
range: Thing

Label Property
term status: unstable
type: Thing
disjoint with: Nothing
subclass of: Thing
type: Class
comment: A foaf:LabelProperty is any RDF property with texual values that serve as labels.

based near
term status: testing
type: Thing
sub property of: topObjectProperty
property disjoint with: bottomObjectProperty
type: ObjectProperty
type: Property
comment: A location that something is based near, for some broadly human notion of near.
domain: SpatialThing
range: SpatialThing

has note on contents
type: ObjectProperty
status: Published
property disjoint with: bottomObjectProperty
sub property of: topObjectProperty
name: hasNoteOnContents
scope note: Includes the list of contents and notes on otherinclusions, such as indexes, inserts, bibliographies, discographies, etc.
has unconstrained: P1042
sub property of: P1045
type: Thing
definition: Relates a resource to a note relating to the contents.
type: Property
domain: C2001

has place of publication, production, distribution statement
type: Thing
status: Published
name: hasPlaceOfPublicationProductionDistributionStatement
property disjoint with: bottomObjectProperty
sub property of: topObjectProperty
definition: Relates a resource to a statement including the place of publication, production, distribution, the additional place of publication statement, and the parallel statement of place of publication.
has unconstrained: P1168
type: ObjectProperty
type: Property
domain: C2001
range: C2018

Surname
term status: archaic
type: Thing
sub property of: topDataProperty
property disjoint with: bottomDataProperty
type: DatatypeProperty
type: Property
comment: The surname of some person.
domain: Person
range: Literal

plan
term status: testing
type: Thing
sub property of: topDataProperty
property disjoint with: bottomDataProperty
type: DatatypeProperty
type: Property
comment: Aplan comment, in the tradition of finger and '.plan' files.
domain: Person
range: Literal

AIM chat ID
type: DatatypeProperty
property disjoint with: bottomDataProperty
sub property of: topDataProperty
type: InverseFunctionalProperty
term status: testing
type: Thing
sub property of: nickname
type: Property
domain: Agent
comment: An AIM chat ID
range: Literal

Group
type: Thing
subclass of: Agent
disjoint with: Nothing
type: Class
subclass of: Thing
term status: stable
comment: A class of Agents.

has publication, production, distribution, etc area
scope note: Covers all types of publication, production, distribution, issuing and release activities connected with resources.
definition: Relates a resource to a statement including the place of publication, production and/or distribution; the name of publisher, producer, and/or distributor; the date of publication, production, and/or distribution; the place of printing or manufacture; the name of printer or manufacturer; and the date of printing or manufacture.
status: Published
type: Thing
property disjoint with: bottomObjectProperty
has unconstrained: P1162
type: ObjectProperty
sub property of: topObjectProperty
name: hasPublicationProductionDistributionEtcArea
domain: C2001
range: C2007
type: Property

geekcode
term status: archaic
type: Thing
sub property of: topDataProperty
property disjoint with: bottomDataProperty
type: DatatypeProperty
type: Property
comment: A textual geekcode for this person, see http://www.geekcode.com/geek.html
domain: Person
range: Literal

Document
term status: testing
subclass of: Thing
disjoint with: Nothing
type: Class
disjoint with: Project
type: Thing
disjoint with: Organization
comment: A document.

theme
term status: archaic
type: Thing
sub property of: topObjectProperty
property disjoint with: bottomObjectProperty
type: ObjectProperty
type: Property
comment: A theme.
domain: Thing
range: Thing

family_name
term status: archaic
type: Thing
sub property of: topDataProperty
property disjoint with: bottomDataProperty
type: DatatypeProperty
type: Property
comment: The family name of some person.
domain: Person
range: Literal

topic
term status: testing
type: Thing
sub property of: topObjectProperty
property disjoint with: bottomObjectProperty
inverse of: page
type: ObjectProperty
type: Property
comment: A topic of some page or document.
domain: Document
range: Thing

member
term status: stable
type: Thing
sub property of: topObjectProperty
property disjoint with: bottomObjectProperty
type: ObjectProperty
type: Property
comment: Indicates a member of a Group
domain: Group
range: Agent

publications
term status: testing
type: Thing
sub property of: topObjectProperty
property disjoint with: bottomObjectProperty
type: ObjectProperty
type: Property
comment: A link to the publications of this person.
domain: Person
range: Document