maker
sub property of: creator
range: Thing
equivalent property: creator
comment: An agent that made this thing.
term status: stable
domain: Thing
inverse of: made
type: Property
range: Agent
type: ObjectProperty
domain: Resource
range: Resource

depiction
range: Thing
type: Property
type: ObjectProperty
comment: A depiction of some thing.
domain: Thing
range: Image
inverse of: depicts
term status: testing
range: Resource
range: Document
domain: Resource

knows
range: Thing
domain: Thing
type: Property
type: ObjectProperty
comment: A person known by this person (indicating some level of reciprocated interaction between the parties).
domain: Person
range: Person
term status: stable
range: Resource
range: SpatialThing
range: Agent
domain: Agent
domain: Resource
domain: SpatialThing

Online Account
subclass of: Resource
type: Class
comment: An online account.
subclass of: Thing
term status: testing

Online Chat Account
subclass of: Resource
subclass of: Thing
type: Class
comment: An online chat account.
subclass of: Online Account
term status: unstable

thumbnail
range: Thing
domain: Thing
type: Property
type: ObjectProperty
comment: A derived thumbnail image.
domain: Image
range: Image
term status: testing
range: Resource
range: Document
domain: Resource
domain: Document

interest
range: Thing
domain: Thing
type: Property
type: ObjectProperty
comment: A page about a topic of interest to this person.
domain: Agent
range: Document
term status: testing
range: Resource
domain: Resource

depicts
domain: Thing
type: Property
type: ObjectProperty
comment: A thing depicted in this representation.
domain: Image
range: Thing
inverse of: depiction
term status: testing
range: Resource
domain: Resource
domain: Document

account
range: Thing
domain: Thing
type: Property
type: ObjectProperty
comment: Indicates an account held by this agent.
domain: Agent
range: Online Account
term status: testing
range: Resource
domain: Resource

schoolHomepage
range: Thing
domain: Thing
type: Property
type: ObjectProperty
comment: A homepage of a school attended by the person.
domain: Person
range: Document
term status: testing
range: Resource
domain: Agent
domain: Resource
domain: SpatialThing

Person
subclass of: Agent
subclass of: Resource
subclass of: Thing
comment: A person.
term status: stable
subclass of: SpatialThing
disjoint with: Project
type: Class
subclass of: Person
disjoint with: Organization

topic
domain: Thing
type: Property
type: ObjectProperty
comment: A topic of some page or document.
domain: Document
range: Thing
inverse of: page
term status: testing
range: Resource
domain: Resource

member
range: Thing
domain: Thing
type: Property
type: ObjectProperty
comment: Indicates a member of a Group
domain: Group
range: Agent
term status: stable
range: Resource
domain: Agent
domain: Resource

Project
subclass of: Resource
subclass of: Thing
type: Class
comment: A project (a collective endeavour of some kind).
disjoint with: Person
disjoint with: Document
term status: testing

current project
domain: Thing
type: Property
type: ObjectProperty
comment: A current project this person works on.
domain: Person
range: Thing
term status: testing
range: Resource
domain: Agent
domain: Resource
domain: SpatialThing

homepage
range: Thing
comment: A homepage for some thing.
range: Document
type: Property
term status: stable
sub property of: page
sub property of: is primary topic of
domain: Thing
type: ObjectProperty
type: InverseFunctionalProperty
domain: Resource
range: Resource

weblog
range: Thing
domain: Thing
sub property of: page
type: Property
range: Document
term status: testing
comment: A weblog of some thing (whether person, group, company etc.).
domain: Agent
type: InverseFunctionalProperty
type: ObjectProperty
domain: Resource
range: Resource

phone
range: Thing
domain: Thing
type: Property
type: ObjectProperty
comment: A phone, specified using fully qualified tel: URI scheme (refs: http://www.w3.org/Addressing/schemes.html#tel).
term status: testing
range: Resource
domain: Resource

Image
subclass of: Resource
subclass of: Thing
type: Class
comment: An image.
subclass of: Document
term status: testing

made
domain: Thing
type: Property
type: ObjectProperty
comment: Something that was made by this agent.
domain: Agent
range: Thing
inverse of: maker
term status: stable
range: Resource
domain: Resource

is primary topic of
range: Thing
comment: A document that this thing is the primary topic of.
domain: Thing
sub property of: page
type: InverseFunctionalProperty
range: Document
type: Property
term status: stable
inverse of: primary topic
type: ObjectProperty
domain: Resource
range: Resource

Document
subclass of: Resource
subclass of: Thing
type: Class
comment: A document.
disjoint with: Organization
disjoint with: Project
term status: testing

Online Gaming Account
subclass of: Resource
subclass of: Thing
type: Class
comment: An online gaming account.
subclass of: Online Account
term status: unstable

workplace homepage
range: Thing
domain: Thing
type: Property
type: ObjectProperty
comment: A workplace homepage of some person; the homepage of an organization they work for.
domain: Person
range: Document
term status: testing
range: Resource
domain: Agent
domain: Resource
domain: SpatialThing

personal mailbox
domain: Thing
type: Property
type: InverseFunctionalProperty
type: ObjectProperty
comment: A personal mailbox, ie. an Internet mailbox associated with exactly one owner, the first owner of this mailbox. This is a 'static inverse functional property', in that there is (across time and change) at most one individual that ever has any particular value for foaf:mbox.
domain: Agent
range: Thing
term status: stable
range: Resource
domain: Resource

focus
domain: Thing
type: Property
type: ObjectProperty
comment: The underlying or 'focal' entity associated with some SKOS-described concept.
domain: Concept
range: Thing
term status: testing
range: Resource
domain: Resource

openid
sub property of: page
range: Thing
domain: Thing
range: Document
type: ObjectProperty
term status: testing
type: Property
domain: Agent
type: InverseFunctionalProperty
sub property of: is primary topic of
comment: An OpenID for an Agent.
domain: Resource
range: Resource

Online E-commerce Account
subclass of: Resource
subclass of: Thing
type: Class
comment: An online e-commerce account.
subclass of: Online Account
term status: unstable

Group
subclass of: Agent
subclass of: Resource
subclass of: Thing
type: Class
comment: A class of Agents.
term status: stable

Agent
subclass of: Thing
subclass of: Resource
subclass of: Agent
type: Class
comment: An agent (eg. person, group, software or physical artifact).
equivalent class: Agent
term status: stable

Label Property
subclass of: Resource
subclass of: Thing
type: Class
comment: A foaf:LabelProperty is any RDF property with texual values that serve as labels.
term status: unstable

Organization
subclass of: Resource
subclass of: Thing
subclass of: Agent
type: Class
comment: An organization.
disjoint with: Person
disjoint with: Document
term status: stable

publications
range: Thing
domain: Thing
type: Property
type: ObjectProperty
comment: A link to the publications of this person.
domain: Person
range: Document
term status: testing
range: Resource
domain: Agent
domain: Resource
domain: SpatialThing

image
range: Thing
domain: Thing
type: Property
type: ObjectProperty
comment: An image that can be used to represent some thing (ie. those depictions which are particularly representative of something, eg. one's photo on a homepage).
domain: Person
range: Image
sub property of: depiction
term status: testing
domain: Resource
range: Resource
range: Document
domain: Agent
domain: SpatialThing

work info homepage
range: Thing
domain: Thing
type: Property
type: ObjectProperty
comment: A work info homepage of some person; a page about their work for some organization.
domain: Person
range: Document
term status: testing
range: Resource
domain: Agent
domain: Resource
domain: SpatialThing

PersonalProfileDocument
subclass of: Resource
subclass of: Thing
type: Class
comment: A personal profile RDF document.
subclass of: Document
term status: testing

primary topic
domain: Thing
domain: Document
type: FunctionalProperty
range: Thing
type: Property
term status: stable
type: ObjectProperty
comment: The primary topic of some page or document.
inverse of: is primary topic of
range: Resource
domain: Resource

based near
range: Thing
domain: Thing
type: Property
type: ObjectProperty
comment: A location that something is based near, for some broadly human notion of near.
domain: SpatialThing
range: SpatialThing
term status: testing
range: Resource
domain: Resource

account service homepage
range: Thing
domain: Thing
type: Property
type: ObjectProperty
comment: Indicates a homepage of the service provide for this online account.
domain: Online Account
range: Document
term status: testing
range: Resource
domain: Resource

page
range: Thing
type: Property
type: ObjectProperty
comment: A page or document about this thing.
domain: Thing
range: Document
inverse of: topic
term status: testing
range: Resource
domain: Resource

topic_interest
domain: Thing
type: Property
type: ObjectProperty
comment: A thing of interest to this person.
domain: Agent
range: Thing
term status: testing
range: Resource
domain: Resource

account
range: Thing
domain: Thing
type: Property
type: ObjectProperty
comment: Indicates an account held by this agent.
domain: Agent
range: Online Account
term status: archaic
range: Resource
domain: Resource

tipjar
range: Thing
domain: Thing
type: Property
type: ObjectProperty
comment: A tipjar document for this agent, describing means for payment and reward.
domain: Agent
range: Document
sub property of: page
term status: testing
domain: Resource
range: Resource

past project
domain: Thing
type: Property
type: ObjectProperty
comment: A project this person has previously worked on.
domain: Person
range: Thing
term status: testing
range: Resource
domain: Agent
domain: Resource
domain: SpatialThing

has standard identifier
domain: C2001
sub property of: has resource identifier
scope note: Customary labels include "ISBN", "ISSN", "ISMN".
type: Property
has unconstrained: P1154
status: Published
name: hasStandardIdentifier
definition: Relates a resource to a standard identifier preceded by its customary label.
domain: Resource

firstName
type: Property
type: DatatypeProperty
comment: The first name of a person.
domain: Person
range: Literal
term status: testing
range: Resource
domain: Thing
domain: Agent
domain: Resource
domain: SpatialThing

ICQ chat ID
sub property of: nickname
term status: testing
domain: Agent
range: Literal
comment: An ICQ chat ID
type: InverseFunctionalProperty
type: Property
type: DatatypeProperty
type: ObjectProperty
range: Resource
domain: Thing
domain: Resource

has pagination
domain: C2001
scope note: Includes notated music and cartographic resources as well as printed textual resources.
type: Property
name: hasPagination
scope note: Includes the numbering of leaves, columns, etc.
definition: Relates a resource that is a printed text to the sequential numbering of the pages.
status: Published
has unconstrained: P1054
domain: Resource

birthday
type: Property
type: FunctionalProperty
type: DatatypeProperty
comment: The birthday of this Agent, represented in mm-dd string form, eg. '12-31'.
domain: Agent
range: Literal
term status: unstable
range: Resource
domain: Thing
domain: Resource

Given name
type: Property
type: DatatypeProperty
comment: The given name of some person.
term status: archaic

has parallel title statement of series or multipart monographic resource
status: Published
name: hasParallelTitleStatementOfSeriesOrMultipartMonographicResource
definition: Relates a resource that is a series or multipart monographic resource to a statement of its parallel title.
type: Property
domain: C2001
has unconstrained: P1174
domain: Resource

has specific material designation
status: Published
name: hasSpecificMaterialDesignation
definition: Relates a resource to a term indicating the specific class of material (usually the class of physical object) to which it belongs, and the number of units.
type: Property
domain: C2001
has unconstrained: P1146
domain: Resource

Given name
type: Property
type: DatatypeProperty
comment: The given name of some person.
term status: testing

Skype ID
type: Property
type: DatatypeProperty
comment: A Skype ID
domain: Agent
range: Literal
sub property of: nickname
term status: testing
range: Resource
domain: Thing
domain: Resource

has title and statement of responsibility area
status: Published
name: hasTitleAndStatementOfResponsibilityArea
type: Property
domain: C2001
range: C2004
definition: Relates a resource to a statement including the title proper, parallel titles, other title information, and statements of responsibility.
has unconstrained: P1159
range: Resource
domain: Resource

has date of publication, production, distribution
status: Published
name: hasDateOfPublicationProductionDistribution
type: Property
definition: Relates a resource to the date on which it is officially offered for sale or distribution to the public, usually given in the form of a year.
domain: C2001
has unconstrained: P1018
domain: Resource

http://cultura.linkeddata.es/BNE/resource/C1003/F3343969
has statement of responsibility relating to title: E.C. Graf
has name of publisher, producer, distributor statement: Bucknell University Press
type: C1003
has place of publication, production, distribution: Lewisburg
has date of publication, production, distribution: [2007]
has publication, production, distribution, etc area: Lewisburg Bucknell University Press [2007]
has title proper: Cervantes and modernity
has specific material designation and extent: 222 p.
has specific material designation: 222 p.
has common title of title proper: Cervantes and modernity
has title and statement of responsibility area: Cervantes and modernity : four essays on Don Quijote E.C. Graf
has note on contents: Bibliografía: p. 195-209. Índice
has name of publisher, producer, distributor: Bucknell University Press
has standard identifier: 978-0-8387-5655-3
has resource identifier and terms of availability area: 978-0-8387-5655-3
has resource identifier: 978-0-8387-5655-3
has dimensions: 24 cm
has place of publication, production, distribution statement: Lewisburg
P1174: Cervantes and modernity
has material description area: 222 p. 24 cm
has pagination: 222 p.
type: C2001
P1045: Bibliografía: p. 195-209. Índice
P1012: Cervantes and modernity
type: Thing

lastName
type: Property
type: DatatypeProperty
comment: The last name of a person.
domain: Person
range: Literal
term status: testing
range: Resource
domain: Thing
domain: Agent
domain: Resource
domain: SpatialThing

Yahoo chat ID
domain: Agent
term status: testing
range: Literal
comment: A Yahoo chat ID
type: DatatypeProperty
sub property of: nickname
type: Property
type: InverseFunctionalProperty
type: ObjectProperty
range: Resource
domain: Thing
domain: Resource

membershipClass
type: Property
type: AnnotationProperty
comment: Indicates the class of individuals that are a member of a Group
term status: unstable

DNA checksum
type: Property
type: DatatypeProperty
comment: A checksum for the DNA of some thing. Joke.
range: Literal
term status: archaic
range: Resource

has resource identifier
has subproperty: has standard identifier
type: Property
has unconstrained: P1032
scope note: Includes any number or alphanumeric designation associated with and identifying a resource according to an international standard, such as an International Standard Book Number or an International Standard Serial Number, or a designation assigned by a publisher. Includes notes considered important to users of the catalogue.
name: hasResourceIdentifier
definition: Relates a resource to an identifier.
domain: C2001
has subproperty: P1075
has subproperty: P1076
status: Published
domain: Resource

has title proper
sub property of: P1012
scope note: The title proper includes any alternative title, but excludes parallel titles and other title information. In the case of a section or some supplements and some titles of subseries or parts, the title proper can consist of two or more components: the common title (or the title of the main series or of the multipart monographic resource), the dependent title and the dependent title designation. For resources containing several individual works the title proper is the collective title. Resources containing several individual works and lacking a collective title are considered not to have a title proper. A series or subseries also has its own title proper.
has unconstrained: P1004
definition: Relates a resource to the title proper (the chief name of a resource, i.e. the title of a resource in the form in which it appears on the preferred source of information for the resource).
status: Published
name: hasTitleProper
domain: C2001
type: Property
domain: Resource

gender
type: Property
type: FunctionalProperty
type: DatatypeProperty
comment: The gender of this Agent (typically but not necessarily 'male' or 'female').
domain: Agent
range: Literal
term status: testing
range: Resource
domain: Thing
domain: Resource

sha1sum of a personal mailbox URI name
type: Property
type: InverseFunctionalProperty
type: DatatypeProperty
comment: The sha1sum of the URI of an Internet mailbox associated with exactly one owner, the first owner of the mailbox.
domain: Agent
range: Literal
term status: testing
type: ObjectProperty
range: Resource
domain: Thing
domain: Resource

logo
type: Property
type: ObjectProperty
type: InverseFunctionalProperty
comment: A logo representing some thing.
domain: Thing
range: Thing
term status: testing
range: Resource
domain: Resource

has name of publisher, producer, distributor
status: Published
name: hasNameOfPublisherProducerDistributor
type: Property
definition: Relates a resource to the name of the person or corporate body appearing on the resource that effects respectively the publication, production and/or distribution or release activities for the resource.
domain: C2001
has unconstrained: P1017
domain: Resource

funded by
type: Property
type: ObjectProperty
comment: An organization funding a project or person.
domain: Thing
range: Thing
term status: archaic
range: Resource
domain: Resource

RDF description of F3343969
primary topic: http://cultura.linkeddata.es/BNE/resource/C1003/F3343969
type: Thing
type: Document
topic: http://cultura.linkeddata.es/BNE/resource/C1003/F3343969

has resource identifier and terms of availability area
status: Published
name: hasResourceIdentifierAndTermsOfAvailabilityArea
definition: Relates a resource to a statement including the resource identifier, the key title, and the terms of availability.
type: Property
domain: C2001
range: C2011
has unconstrained: P1165
range: Resource
domain: Resource

familyName
type: Property
type: DatatypeProperty
comment: The family name of some person.
domain: Person
range: Literal
term status: testing
range: Resource
domain: Thing
domain: Agent
domain: Resource
domain: SpatialThing

has common title of title proper
status: Published
name: hasCommonTitleOfTitleProper
definition: Relates a resource to that part of the title that is carried by a group of related resources in addition to their different section titles.
type: Property
scope note: The common title serves to indicate this relationship in a group of resources and together with the section title identifies a given resource. The common title may also be common to a main resource and its supplement or supplements and to a main series and its subseries when the supplement or supplements or subseries have a dependent title or titles.
domain: C2001
has unconstrained: P1137
domain: Resource

status
type: Property
type: DatatypeProperty
comment: A string expressing what the user is happy for the general public (normally) to know about their current activity.
domain: Agent
range: Literal
term status: unstable
range: Resource
domain: Thing
domain: Resource

has dimensions
status: Published
name: hasDimensions
type: Property
definition: Relates a resource to a note on its dimensions in centimetres (or millimetres if the gauge of a film or width of a tape) rounded up to the nearest whole.
scope note: Includes one or more dimensions. Includes the height of the resource, measured parallel to the spine, for printed textual and notated music resources. Includes the height by width of two-dimensional cartographic resources. Includes the height by width by depth of three-dimensional cartographic resources, excluding globes and sections of spheres. Includes the diameter for cartographic resources that are globes, sections of spheres, and two-dimensional circular forms. Includes additional dimensions such as the dimensions of a map when folded, or the dimensions of individual sheets of a collectively described group, or the individual dimensions of mounted sheets, of cartographic resources. Includes the height by width of two-dimensional multimedia resources, sound recordings, videorecordings, and still and moving images (wallcharts, microfiches, slides, transparencies, pictures, etc.). Includes the diameter, followed in parentheses by the abbreviation "diam." or its equivalent in another language, for circular forms of multimedia resources, sound recordings, videorecordings, and still and moving images. Includes the length of the vertical axis, followed in parentheses by "oval" or its equivalent, for oval forms of multimedia resources, sound recordings, videorecordings, and still and moving images. Includes two dimensions statements for the open and folded states of folded sheets of multimedia resources, sound recordings, videorecordings, and still and moving images. Includes height by width by depth (or height alone when appropriate) of three-dimensional multimedia resources, sound recordings, videorecordings, and still and moving images (dioramas, etc.). Includes the gauge of the film or width of the tape for multimedia resources, sound recordings, videorecordings, and still and moving images employing film or magnetic tape. Includes the dimensions of the physical carrier itself, irrespective of the external dimensions of any container, of electronic resources. Inclu…
domain: C2001
has unconstrained: P1024
domain: Resource

MSN chat ID
sub property of: nickname
type: InverseFunctionalProperty
comment: An MSN chat ID
domain: Agent
type: DatatypeProperty
term status: testing
type: Property
range: Literal
type: ObjectProperty
range: Resource
domain: Thing
domain: Resource

sha1sum (hex)
type: Property
type: DatatypeProperty
comment: A sha1sum hash, in hex.
domain: Document
term status: unstable
domain: Thing
domain: Resource

has place of publication, production, distribution
status: Published
name: hasPlaceOfPublicationProductionDistribution
type: Property
definition: Relates a resource to the name of the place associated on the prescribed source of information with the name of the publisher, producer or distributor.
scope note: Usually given on the preferred source of information as the name of a city. If no publisher, producer or distributor is named, it is the place from which the resource was issued or distributed.
domain: C2001
has unconstrained: P1016
domain: Resource

Friend of a Friend (FOAF) vocabulary
type: Ontology
description: The Friend of a Friend (FOAF) RDF vocabulary, described using W3C RDF Schema and the Web Ontology Language.

jabber ID
type: Property
type: DatatypeProperty
type: InverseFunctionalProperty
comment: A jabber ID for something.
domain: Agent
range: Literal
term status: testing
type: ObjectProperty
range: Resource
domain: Thing
domain: Resource

account name
type: Property
type: DatatypeProperty
comment: Indicates the name (identifier) associated with this online account.
domain: Online Account
range: Literal
term status: testing
range: Resource
domain: Thing
domain: Resource

name
type: Property
type: DatatypeProperty
comment: A name for some thing.
domain: Thing
range: Literal
sub property of: label
term status: testing
range: Resource
domain: Resource

has name of publisher, producer, distributor statement
status: Published
name: hasNameOfPublisherProducerDistributorStatement
definition: Relates a resource to a statement including the name of publisher, producer, distributor, and the parallel statement of publisher, producer, distributor.
type: Property
domain: C2001
range: C2019
has unconstrained: P1169
range: Resource
domain: Resource

age
type: Property
type: FunctionalProperty
type: DatatypeProperty
comment: The age in years of some agent.
domain: Agent
range: Literal
term status: unstable
range: Resource
domain: Thing
domain: Resource

myersBriggs
type: Property
type: DatatypeProperty
comment: A Myers Briggs (MBTI) personality classification.
domain: Person
range: Literal
term status: testing
range: Resource
domain: Thing
domain: Agent
domain: Resource
domain: SpatialThing

has material description area
definition: Relates a resource to a statement including the specific material designation and extent, other physical details, the dimensions, and the accompanying material statement.
type: Property
has unconstrained: P1163
domain: C2001
scope note: Restricted to the resource as issued by the publisher.
range: C2008
name: hasMaterialDescriptionArea
status: Published
range: Resource
domain: Resource

has specific material designation and extent
domain: C2001
type: Property
status: Published
name: hasSpecificMaterialDesignationAndExtent
has unconstrained: P1022
definition: Relates a resource to a statement including the specific material designation, the extent, the pagination statement (if a printed resource), and the playing time (if the resource has an inherent durational aspect).
range: C2015
definition: Relaciona un recurso con una mención incluyendo la designación específica de material, la extension, la mención de paginación (si es un recurso impreso) y la duración (si el recurso tiene un aspecto inherente de duración).
range: Resource
domain: Resource

has statement of responsibility relating to title
status: Published
name: hasStatementOfResponsibilityRelatingToTitle
type: Property
definition: Relates a resource to one or more names, phrases, or groups of characters relating to the identification and/or function of any persons or corporate bodies responsible for or contributing to the creation or realisation of the intellectual or artistic content of a work contained in the resource.
scope note: A statement of responsibility is not constructed when there is no such statement on the resource. A statement of responsibility can relate to such entities as: writers, composers, performers, graphic artists, choreographers, arrangers, cartographers, programmers, principal investigators, animators, etc., whose work is embodied in the resource, whether directly (e.g. author of text, editor, compiler, translator, illustrator, engraver, cartographer, composer, arranger, choreographer), or indirectly (e.g. author of the novel on which a film script is based, author of the work on which the software is based, adapters of an already existing work), whether in the same medium as the original or in another; collectors of various data, persons responsible for the direction of a performed work; organizations, or individuals or corporate bodies sponsoring the work of any of the above (with intellectual and not merely financial sponsorship), producers of a popular music recording;.production companies and individuals such as producers, directors, or others having some degree of overall responsibility for a work; individuals who have specific responsibilities when in the context of a particular film, or particular type of film, they have a major creative role (e.g. cinematographers, writers of screenplays or animators of animated films); developers and designers, whose work involves the creation of the content of a resource or its realisation (e.g. game designer); entities having specific responsibilities in the context of a particular resource or particular type of resource (e.g. project directors of survey data, video director).
domain: C2001
has unconstrained: P1007
domain: Resource

Published
type: Concept

title
type: Property
type: DatatypeProperty
comment: Title (Mr, Mrs, Ms, Dr. etc)
term status: testing

ISBD elements
note: This is a registration of classes and properties from International Standard Bibliographic Description (ISBD), consolidated edition, published by De Gruyter Saur in July 2011 (ISBN 978-3-11-026379-4).
type: Thing

nickname
type: Property
type: DatatypeProperty
comment: A short informal nickname characterising an agent (includes login identifiers, IRC and other chat nicknames).
term status: testing

has note on contents
status: Published
name: hasNoteOnContents
type: Property
scope note: Includes the list of contents and notes on otherinclusions, such as indexes, inserts, bibliographies, discographies, etc.
has unconstrained: P1042
sub property of: P1045
domain: C2001
definition: Relates a resource to a note relating to the contents.
domain: Resource

has place of publication, production, distribution statement
status: Published
name: hasPlaceOfPublicationProductionDistributionStatement
definition: Relates a resource to a statement including the place of publication, production, distribution, the additional place of publication statement, and the parallel statement of place of publication.
type: Property
domain: C2001
range: C2018
has unconstrained: P1168
range: Resource
domain: Resource

Surname
type: Property
type: DatatypeProperty
comment: The surname of some person.
domain: Person
range: Literal
term status: archaic
range: Resource
domain: Thing
domain: Agent
domain: Resource
domain: SpatialThing

plan
type: Property
type: DatatypeProperty
comment: Aplan comment, in the tradition of finger and '.plan' files.
domain: Person
range: Literal
term status: testing
range: Resource
domain: Thing
domain: Agent
domain: Resource
domain: SpatialThing

AIM chat ID
type: Property
type: DatatypeProperty
domain: Agent
comment: An AIM chat ID
type: InverseFunctionalProperty
term status: testing
range: Literal
sub property of: nickname
type: ObjectProperty
range: Resource
domain: Thing
domain: Resource

has publication, production, distribution, etc area
domain: C2001
scope note: Covers all types of publication, production, distribution, issuing and release activities connected with resources.
definition: Relates a resource to a statement including the place of publication, production and/or distribution; the name of publisher, producer, and/or distributor; the date of publication, production, and/or distribution; the place of printing or manufacture; the name of printer or manufacturer; and the date of printing or manufacture.
range: C2007
status: Published
type: Property
has unconstrained: P1162
name: hasPublicationProductionDistributionEtcArea
range: Resource
domain: Resource

geekcode
type: Property
type: DatatypeProperty
comment: A textual geekcode for this person, see http://www.geekcode.com/geek.html
domain: Person
range: Literal
term status: archaic
range: Resource
domain: Thing
domain: Agent
domain: Resource
domain: SpatialThing

family_name
type: Property
type: DatatypeProperty
comment: The family name of some person.
domain: Person
range: Literal
term status: archaic
range: Resource
domain: Thing
domain: Agent
domain: Resource
domain: SpatialThing

theme
type: Property
type: ObjectProperty
comment: A theme.
domain: Thing
range: Thing
term status: archaic
range: Resource
domain: Resource