tagged resource
range: Thing
domain: Thing
type: ObjectProperty
comment: The object is a resource which plays a role in the subject Tagging.
domain: tagging
term status: testing
type: Property
range: Resource
domain: Resource

related tag
range: Thing
domain: Thing
type: ObjectProperty
comment: The two tags are asserted as being related. This might be symmetric, but it certainly isn't transitive.
domain: Tag
range: Tag
sub property of: semanticRelation
term status: testing
type: Property
range: Resource
range: Concept
domain: Resource
domain: Concept

tag
range: Thing
domain: Thing
type: ObjectProperty
comment: The relationship between a resource and a Tagging. Note, of course, that this allows us to tag tags and taggings themselves...
range: tagging
type: Property
range: Resource
domain: Resource

http://lodlaundromat.org/.well-known/genid/7219595a8b4727ef3df778bcba82085f#2
type: Class
subclass of: Resource
subclass of: Thing
type: Restriction
cardinality: 1
on property: associated tag

Tag
subclass of: Thing
subclass of: Resource
type: Class
subclass of: Concept
definition: A natural-language concept which is used to annotate another resource.

associated tag
range: Thing
domain: Thing
type: ObjectProperty
comment: The object is a Tag which plays a role in the subject Tagging.
domain: tagging
range: Tag
term status: testing
type: Property
range: Resource
range: Concept
domain: Resource

http://lodlaundromat.org/.well-known/genid/7219595a8b4727ef3df778bcba82085f#1
subclass of: Resource
subclass of: Thing
type: Class
type: Restriction
cardinality: 1
on property: tagged resource

restricted tagging
subclass of: Thing
type: Class
subclass of: Resource
comment: A Tagging which has precisely one associated resource, and one associated tag.
subclass of: http://lodlaundromat.org/.well-known/genid/7219595a8b4727ef3df778bcba82085f#1
subclass of: http://lodlaundromat.org/.well-known/genid/7219595a8b4727ef3df778bcba82085f#2
subclass of: tagging

is tag of
range: Thing
domain: Thing
type: ObjectProperty
comment: Indicates that the subject tag applies to the object resource. This does not assert by who, when, or why the tagging occurred. For that information, use a reified Tagging resource.
domain: Tag
inverse of: tagged with tag
type: Property
range: Resource
domain: Resource
domain: Concept

tagged by
range: Thing
domain: Thing
type: ObjectProperty
comment: The object plays the role of the tagger in the subject Tagging.
domain: tagging
range: Agent
term status: testing
type: Property
range: Resource
domain: Resource

tagged with tag
range: Thing
domain: Thing
inverse of: is tag of
type: ObjectProperty
comment: Indicates that the subject has been tagged with the object tag. This does not assert by who, when, or why the tagging occurred. For that information, use a reified Tagging resource.
range: Tag
sub property of: subject
type: Property
range: Resource
range: Concept
domain: Resource

equivalent tag
range: Thing
domain: Thing
type: ObjectProperty
comment: The two tags are asserted to be equivalent --- that is, that whenever one is associated with a resource, the other tag can be logically inferred to also be associated. Be very careful with this. I'm not sure if this should be a subproperty of owl:sameAs.
domain: Tag
range: Tag
sub property of: sameAs
term status: testing
type: Property
range: Resource
range: Concept
domain: Resource
domain: Concept

tagging
subclass of: Thing
subclass of: Resource
type: Class
comment: A reified class which defines an instance of a tagging by an agent of a resource with one or more tags.
term status: testing

Tag ontology
creator: Richard Newman
contributor: Danny Ayers
maker: RichardNewman
type: Ontology
description: An ontology that describes tags, as used in the popular del.icio.us and Flickr systems, and allows for relationships between tags to be described.
modified: 2005-11-27
issued: 2005-03-23
label: An ontology for tags.
modified: 2005-05-19
modified: 2005-12-21
contributor: Seth Russell

tagged on
type: DatatypeProperty
comment: The subject Tagging occurred at the subject time and date.
domain: tagging
sub property of: date
term status: testing
type: Property
domain: Thing
domain: Resource

tag name
type: DatatypeProperty
comment: The name of a tag. Note that we can't relate this to skos:prefLabel because we cannot guarantee that tags have unique labels in a given conceptual scheme. Or can we?
domain: Tag
sub property of: title
sub property of: label
type: Property
domain: Concept
domain: Resource
domain: Thing

tag name
type: DatatypeProperty
comment: The name of a tag. Note that we can't relate this to skos:prefLabel because we cannot guarantee that tags have unique labels in a given conceptual scheme. Or can we? DEPRECATED 2005-05-19: redundant 'tag'.
domain: Tag
sub property of: title
sub property of: label
type: Property
domain: Concept
domain: Resource
domain: Thing