The LOCAH RDF Vocabulary
comment: The LOCAH RDF Vocabulary
produced in: LOCAH Project

LOCAH Project
type: Project

Finding Aid
type: Class
comment: A document describing an archival resource.
subclass of: Document
term status: unstable

EAD Document
type: Class
comment: A document conforming to the Encoded Archival Description standard.
subclass of: Document
term status: unstable

Biographical History
type: Class
comment: A narrative or chronology that places archival materials in context by providing information about their creator(s). A finding aid may contain several such narratives or chronologies pertaining to different archival materials and their creators.
subclass of: DocumentPart
subclass of: Document
term status: unstable

Repository
type: Class
comment: An institution or agency responsible for providing access to archival materials.
subclass of: Organization
subclass of: Agent
term status: unstable

Archival Resource
type: Class
comment: Recorded information in any form or medium, created or received and maintained, by an organization or person(s) in the transaction of business or the conduct of affairs, and maintained for its long-term research value. An archival resource may be an individual item, such as a letter or photograph, or (more commonly) some aggregation of such items managed and described as a unit.
term status: unstable

Level
type: Class
comment: An indicator of the part of an archival collection constituted by an archival resource, whether it is the whole collection or a sub-section of it.
subclass of: Concept
term status: unstable

Extent
type: Class
comment: The size of an archival resource.
subclass of: SizeOrDuration
term status: unstable

Creation
type: Class
comment: An event that resulted in the creation or accumulation of an archival resource.
subclass of: Event
term status: unstable

Floruit
type: Class
comment: An event corresponding to the activity of an agent.
subclass of: Event
term status: unstable

Family
type: Class
comment: A group of people affiliated by consanguinity, affinity, or co-residence.
subclass of: Group
subclass of: Agent
equivalent class: http://lodlaundromat.org/.well-known/genid/samples/pellet///predicate//708d932b2ae9d72a1ec86e54ec1cd843/98bf1db7c58eb16bb57ca596edc5a821#1
term status: unstable

Function
type: Class
comment: A sphere of activity or process.
subclass of: Concept
term status: unstable

Genre or Form
type: Class
comment: A category of archival material, defined either by style or technique of intellectual content, order of information or object function, or physical characteristics.
subclass of: Concept
term status: unstable

Maintenance Agency
type: Property
comment: A repository responsible for the maintenance of the archival finding aid.
domain: Finding Aid
range: Repository
inverse of: Is Maintenance Agency Of
term status: unstable

Is Maintenance Agency Of
type: Property
comment: An archival finding aid for which the repository is responsible for the maintenance.
domain: Repository
range: Finding Aid
inverse of: Maintenance Agency
term status: unstable

Encoded As
type: Property
comment: An EAD document that is an encoding of the archival finding aid.
domain: Finding Aid
range: EAD Document
inverse of: Encoding Of
term status: unstable

Encoding Of
type: Property
comment: An archival finding aid of which the EAD document is an encoding.
domain: EAD Document
range: Finding Aid
inverse of: Encoded As
term status: unstable

Administers
type: Property
comment: A resource which the agent manages.
domain: Agent
inverse of: Is Administered By
term status: unstable

Is Administered By
type: Property
comment: An agent that manages the resource.
range: Agent
inverse of: Administers
term status: unstable

Provides Access To
type: Property
comment: A resource to which the agent provides access.
domain: Agent
inverse of: Access Provided By
term status: unstable

Access Provided By
type: Property
comment: An agent that provides access to the resource.
range: Agent
inverse of: Provides Access To
term status: unstable

Is Publisher Of
type: Property
comment: A resource which the agent makes available.
domain: Agent
inverse of: publisher
term status: unstable

Level
type: Property
comment: An indicator of the part of an archival collection constituted by an archival resource.
domain: Archival Resource
range: Level
term status: unstable

Is Represented By
type: Property
comment: A resource which represents the archival resource, such as an image of a text page, a transcription of text, an audio or video clip, or an aggregation of such resources.
domain: Archival Resource
term status: unstable
comment: An archival resourcce represented by the resource.
range: Archival Resource

Origination
type: Property
comment: An agent responsible for the creation or accumulation of the archival resource.
domain: Archival Resource
range: Agent
inverse of: Is Origination Of
term status: unstable

Is Origination Of
type: Property
comment: An archival resource for which the agent is responsible for the creation or accumulation.
domain: Agent
range: Archival Resource
inverse of: Origination
term status: unstable

Has Biographical History
type: Property
comment: A narrative or chronology that places archival materials in context by providing information about their creator(s).
domain: Archival Resource
range: Biographical History
inverse of: Is Biographical History For
term status: unstable

Is Biographical History For
type: Property
comment: An archival resource that the narrative or chronology places in context by providing information about their creator(s).
domain: Biographical History
range: Archival Resource
inverse of: Has Biographical History
term status: unstable

Associated With
type: Property
comment: A concept adjudged by a cataloguer to have an association with an archival resource which they consider useful for the purposes of discovering that resource.
domain: Archival Resource
range: Concept
term status: unstable

Members
type: Property
comment: Members
domain: Archival Resource
term status: unstable

Country Code
type: Property
comment: The ISO 3166-1 code for the country of the repository.
domain: Repository
range: Literal
term status: unstable

Maintenance Agency Code
type: Property
comment: The ISO 15511 code for the repository.
domain: Repository
range: Literal
term status: unstable

Body
type: Property
comment: A literal representation of the content of the document.
domain: Document
range: Literal
term status: unstable

Date created or accumulated
type: Property
comment: The date, represented as a string, of a time interval during which the archival resource was created or accumulated.
range: Literal
term status: unstable

Date created or accumulated
type: Property
comment: The date, represented as a typed literal, of a time interval during which the archival resource was created or accumulated.
range: Literal
term status: unstable

Date created or accumulated (start)
type: Property
comment: The start date, represented as a typed literal, of a time interval during which the archival resource was created or accumulated.
range: Literal
term status: unstable

Date created or accumulated (end)
type: Property
comment: The end date, represented as a typed literal, of a time interval during which the archival resource was created or accumulated.
range: Literal
term status: unstable

Date of Birth
type: Property
comment: The date of birth of the person.
domain: Person
range: Literal
term status: unstable

Date of Death
type: Property
comment: The date of death of the person.
domain: Person
range: Literal
term status: unstable

Extent
type: Property
comment: The size of the archival resource.
domain: Archival Resource
range: Literal
term status: unstable

Custodial History
type: Property
comment: Custodial History
domain: Archival Resource
range: Literal
term status: unstable

Acquisitions
type: Property
comment: Acquisitions
domain: Archival Resource
range: Literal
term status: unstable

Scope and Content
type: Property
comment: Scope and Content
domain: Archival Resource
range: Literal
term status: unstable

Appraisal
type: Property
comment: Appraisal
domain: Archival Resource
range: Literal
term status: unstable

Accruals
type: Property
comment: Accruals
domain: Archival Resource
range: Literal
term status: unstable

Access Restrictions
type: Property
comment: Access Restrictions
domain: Archival Resource
range: Literal
term status: unstable

Use Restrictions
type: Property
comment: Use Restrictions
domain: Archival Resource
range: Literal
term status: unstable

Physical and Technical Requirements
type: Property
comment: Physical and Technical Requirements
domain: Archival Resource
range: Literal
term status: unstable

Other Finding Aids
type: Property
comment: Other Finding Aids
domain: Archival Resource
range: Literal
term status: unstable

Location of Originals
type: Property
comment: Location of Originals
domain: Archival Resource
range: Literal
term status: unstable

Alternate Forms Available
type: Property
comment: Alternate Forms Available
domain: Archival Resource
range: Literal
term status: unstable

Related Material
type: Property
comment: Related Material
domain: Archival Resource
range: Literal
term status: unstable

Bibliography
type: Property
comment: Bibliography
domain: Archival Resource
range: Literal
term status: unstable

Note
type: Property
comment: Note
domain: Archival Resource
range: Literal
term status: unstable

Processing
type: Property
comment: Processing
domain: Archival Resource
range: Literal
term status: unstable

Name
type: Property
comment: Name
range: Literal
term status: unstable

Dates
type: Property
comment: Dates
range: Literal
term status: unstable

Location
type: Property
comment: Location
range: Literal
term status: unstable

Other
type: Property
comment: Other
range: Literal
term status: unstable

Surname
type: Property
comment: The surname of a person who is the focus of the concept
range: Literal
term status: unstable

Forename
type: Property
comment: The forename of a person who is the focus of the concept
range: Literal
term status: unstable

Title
type: Property
comment: The title of a person who is the focus of the concept
range: Literal
term status: unstable

Epithet
type: Property
comment: Epithet
range: Literal
term status: unstable

Archival Box
type: Property
comment: A number of archival boxes
range: Literal
term status: unstable

Metre
type: Property
comment: A number of metres
range: Literal
term status: unstable

Cubic Metre
type: Property
comment: A number of cubic metres
range: Literal
term status: unstable

Folder
type: Property
comment: A number of folders
range: Literal
term status: unstable

Envelope
type: Property
comment: A number of envelopes
range: Literal
term status: unstable

Volume
type: Property
comment: A number of volumes
range: Literal
term status: unstable

File
type: Property
comment: A number of files
range: Literal
term status: unstable

Item
type: Property
comment: A number of items
range: Literal
term status: unstable

Page
type: Property
comment: A number of pages
range: Literal
term status: unstable

Paper
type: Property
comment: A number of papers
range: Literal
term status: unstable