Geographic feature
subclass of: Resource
type: Class
subclass of: Thing
is abstract: true
comment: In ISO 19156 the class GFI_Feature is defined as an instance of GF_FeatureType. In this OWL representation we do not have a specific class for GF_FeatureType because this would imply subclassing owl:Class which is inconsistent with OWL-DL restrictions.
disjoint with: Object
notation: com.hp.hpl.jena.datatypes.BaseDatatype$TypedValue@ff853aaa

OWL representation of ISO 19109 (General Feature Model)
type: Vocabulary
source: ISO 19109 Geographic Information - Rules for Application Schema
imports: geometry
creator: Simon J D Cox CSIRO
type: Ontology
prior version: feature
preferred namespace uri: http://def.seegrid.csiro.au/isotc211/iso19109/2005/feature#
type: com.hp.hpl.jena.datatypes.BaseDatatype$TypedValue@27307f32
license: http://creativecommons.org/licenses/by/3.0/
rights: Copyright © 2012-2013 CSIRO
comment: An OWL representation of part of the General Feature Model described in ISO 19109 and the General Feature Instance model described in Annex C of ISO 19156:2011. This vocabulary is provisional, pending finalization of ISO 19150-2. The URI stem http://def.seegrid.csiro.au/isotc211/ is temporary. The vocabulary is expected to be ultimately published in the domain http://def.isotc211.org/
imports: temporal
source: ISO 19156:2011 Geographic Information - Observations and Measurements
imports: basic
created: 2010-10-27T00:00:00
version IRI: feature.rdf
preferred namespace prefix: gf
description: An OWL representation of part of the General Feature Model described in ISO 19109 and the General Feature Instance model described in Annex C of ISO 19156:2011
modified: 2013-11-14T00:00:00
has part: Geographic feature