maker
range: Thing
sub property of: Contributor
sub property of: Creator
equivalent property: Creator
comment: An agent that made this thing.
term status: stable
domain: Thing
inverse of: made
type: Property
range: Agent
type: ObjectProperty
domain: Resource
range: Resource

Method of Instruction
subclass of: Resource
Has Version: MethodOfInstruction-001
issued: 2008-01-14
type: Class
comment: A process that is used to engender knowledge, attitudes, and skills.
Relation: MethodOfInstruction-001
date: 2008-01-14

depiction
range: Thing
type: Property
type: ObjectProperty
comment: A depiction of some thing.
domain: Thing
range: Image
inverse of: depicts
term status: testing
range: Resource
range: Document
domain: Resource

has license
sub property of: Rights
equivalent property: has license
sub property of: has license
equivalent property: license
sub property of: license
type: Property
domain: Work
range: License
sub property of: License
domain: Resource
range: License Document
range: Resource
range: Rights Statement
type: Thing

License
subclass of: Resource
subclass of: License
type: Class
comment: a set of requests/permissions to users of a Work, e.g. a copyright license, the public domain, information for distributors
subclass of: License Document
equivalent class: License

knows
range: Thing
domain: Thing
type: Property
type: ObjectProperty
comment: A person known by this person (indicating some level of reciprocated interaction between the parties).
domain: Person
range: Person
term status: stable
range: Resource
range: SpatialThing
range: Agent
domain: Agent
domain: Resource
domain: SpatialThing

Attribution
subclass of: Attribution
type: Requirement
comment: credit be given to copyright holder and/or author
type: Class
equivalent class: Attribution

Rights Statement
subclass of: Resource
Has Version: RightsStatement-001
issued: 2008-01-14
type: Class
comment: A statement about the intellectual property rights (IPR) held in or over a Resource, a legal document giving official permission to do something with a resource, or a statement about access rights.
Relation: RightsStatement-001
date: 2008-01-14

Online Account
subclass of: Resource
type: Class
comment: An online account.
subclass of: Thing
term status: testing

generalizes
range: Thing
domain: Thing
sub property of: Relation
sub property of: vocabulary
sub property of: References
term status: stable
comment: Indicates that the subject vocabulary generalizes by some superclasses or superproperties the object vocabulary.
label: généralise @fr
range: Vocabulary
type: ObjectProperty
sub property of: relies on
description: PREFIX rdf:<http://www.w3.org/1999/02/22-rdf-syntax-ns#> PREFIX rdfs:<http://www.w3.org/2000/01/rdf-schema#> PREFIX owl:<http://www.w3.org/2002/07/owl#> PREFIX voaf:<http://purl.org/vocommons/voaf#> PREFIX skos:<http://www.w3.org/2004/02/skos/core#> CONSTRUCT{ ?vocab1 voaf:generalizes ?vocab2 } WHERE{ {?elem1 skos:narrowMatch ?elem2. FILTER(!isBlank(?elem2))} UNION{?elem2 rdfs:subPropertyOf ?elem1.} UNION{?elem1 a owl:Class. ?elem1 owl:unionOf ?union. ?union rdf:first ?elem2.} UNION{?elem1 a owl:Class. ?elem1 owl:unionOf ?union. ?union rdf:rest ?union2. ?union2 rdf:first ?elem2.} UNION{?elem1 a owl:Class. ?elem1 owl:unionOf ?union. ?union rdf:rest ?union2. ?union2 rdf:rest ?union3. ?union3 rdf:first ?elem2.} UNION{?elem1 a owl:Class. ?elem1 owl:unionOf ?union. ?union rdf:rest ?union2. ?union2 rdf:rest ?union3. ?union3 rdf:rest ?union4. ?union4 rdf:first ?elem2.} UNION{?elem1 a owl:Class. ?elem1 owl:unionOf ?union. ?union rdf:rest ?union2. ?union2 rdf:rest ?union3. ?union3 rdf:rest ?union4. ?union4 rdf:rest ?union5. ?union5 rdf:first ?elem2.} FILTER(!isBlank(?elem2)) ?elem1 rdfs:isDefinedBy ?vocab1. ?vocab1 a voaf:Vocabulary. ?elem2 rdfs:isDefinedBy ?vocab2. ?vocab2 a voaf:Vocabulary. FILTER(?vocab1!=?vocab2) }
comment: Indique que le vocabulaire sujet définit des super-classes ou super-propriétés du vocabulaire objet @fr
domain: Vocabulary
type: Property
domain: Dataset
domain: Resource
domain: Work
range: Resource
range: Work
range: Dataset

Linguistic System
subclass of: Resource
description: Examples include written, spoken, sign, and computer languages.
Has Version: LinguisticSystem-001
issued: 2008-01-14
type: Class
comment: A system of signs, symbols, sounds, gestures, or rules used in communication.
Relation: LinguisticSystem-001
date: 2008-01-14

http://lodlaundromat.org/.well-known/genid/samples/jena///predicate//6e7094a1eebe511cc0a924ab29428d96/08f918ba28f018796137367d7b0b9764#2
subclass of: Resource
subclass of: Thing
type: Class
subclass of: Vocabulary
type: Restriction
min cardinality: 1
on property: relies on
subclass of: Dataset
subclass of: Work

Prohibition
subclass of: Resource
subclass of: Prohibition
type: Class
comment: something you may be asked not to do
equivalent class: Prohibition

Source Code
subclass of: SourceCode
type: Requirement
comment: source code (the preferred form for making modifications) must be provided when exercising some rights granted by the license.
type: Class
equivalent class: SourceCode

Agent Class
subclass of: Resource
description: Examples of Agent Class include groups seen as classes, such as students, women, charities, lecturers.
Has Version: AgentClass-003
issued: 2008-01-14
Date Modified: 2012-06-14
type: Class
comment: A group of agents.
subclass of: Class
Relation: AgentClass-003
date: 2012-06-14
date: 2008-01-14

Work
subclass of: Resource
subclass of: Work
type: Class
comment: a potentially copyrightable work
equivalent class: Work

Online Chat Account
subclass of: Resource
subclass of: Thing
type: Class
comment: An online chat account.
subclass of: Online Account
term status: unstable

Policy
subclass of: Resource
Has Version: Policy-001
issued: 2008-01-14
type: Class
comment: A plan or course of action by an authority, intended to influence and determine decisions, actions, and other matters.
Relation: Policy-001
date: 2008-01-14

thumbnail
range: Thing
domain: Thing
type: Property
type: ObjectProperty
comment: A derived thumbnail image.
domain: Image
range: Image
term status: testing
range: Resource
range: Document
domain: Resource
domain: Document

has equivalences with
range: Thing
domain: Thing
sub property of: Relation
sub property of: vocabulary
sub property of: References
description: PREFIX rdfs:<http://www.w3.org/2000/01/rdf-schema#> PREFIX owl:<http://www.w3.org/2002/07/owl#> PREFIX voaf:<http://purl.org/vocommons/voaf#> PREFIX skos:<http://www.w3.org/2004/02/skos/core#> CONSTRUCT{ ?vocab1 voaf:hasEquivalencesWith ?vocab2 } WHERE{ {?elem1 owl:equivalentProperty ?elem2.} UNION{?elem1 owl:sameAs ?elem2.} UNION{?elem1 owl:equivalentClass ?elem2.} UNION{?elem2 owl:equivalentProperty ?elem1.} UNION{?elem2 owl:equivalentClass ?elem1.} UNION{?elem1 skos:exactMatch ?elem2.} UNION{?elem2 skos:exactMatch ?elem1.} FILTER(!isBlank(?elem2)) ?elem1 rdfs:isDefinedBy ?vocab1. ?vocab1 a voaf:Vocabulary. ?elem2 rdfs:isDefinedBy ?vocab2. ?vocab2 a voaf:Vocabulary. FILTER(?vocab1!=?vocab2) }
comment: Indique que le vocabulaire sujet déclare des équivalences de classes ou de propriétés avec le vocabulaire objet @fr
range: Vocabulary
domain: Vocabulary
type: ObjectProperty
sub property of: relies on
term status: testing
label: a des équivalences avec @fr
comment: Indicates that the subject vocabulary declares some equivalent classes or properties with the object vocabulary.
type: Property
domain: Dataset
domain: Resource
domain: Work
range: Resource
range: Work
range: Dataset

Method of Accrual
subclass of: Resource
Has Version: MethodOfAccrual-001
issued: 2008-01-14
type: Class
comment: A method by which resources are added to a collection.
Relation: MethodOfAccrual-001
date: 2008-01-14

Provenance Statement
subclass of: Resource
Has Version: ProvenanceStatement-001
issued: 2008-01-14
type: Class
comment: A statement of any changes in ownership and custody of a resource since its creation that are significant for its authenticity, integrity, and interpretation.
Relation: ProvenanceStatement-001
date: 2008-01-14

requires
equivalent property: requires
sub property of: requires
type: Property
domain: License
range: Requirement
domain: Resource
domain: License Document
domain: Rights Statement
range: Resource

Period of Time
subclass of: Resource
Has Version: PeriodOfTime-001
issued: 2008-01-14
type: Class
comment: An interval of time that is named or defined by its start and end dates.
subclass of: Location, Period, or Jurisdiction
Relation: PeriodOfTime-001
date: 2008-01-14

Standard
subclass of: Resource
Has Version: Standard-001
issued: 2008-01-14
type: Class
comment: A basis for comparison; a reference point against which other things can be evaluated.
Relation: Standard-001
date: 2008-01-14

interest
range: Thing
domain: Thing
type: Property
type: ObjectProperty
comment: A page about a topic of interest to this person.
domain: Agent
range: Document
term status: testing
range: Resource
domain: Resource

depicts
domain: Thing
type: Property
type: ObjectProperty
comment: A thing depicted in this representation.
domain: Image
range: Thing
inverse of: depiction
term status: testing
range: Resource
domain: Resource
domain: Document

account
range: Thing
domain: Thing
type: Property
type: ObjectProperty
comment: Indicates an account held by this agent.
domain: Agent
range: Online Account
term status: testing
range: Resource
domain: Resource

Dataset occurrences
subclass of: Thing
subclass of: Resource
type: Class
label: Occurrences dans un jeu de données @fr
comment: Class used to store the number of occurences of a vocabulary in a particular dataset
comment: Classe utilisée pour stocker l'information d'occurences d'un vocabulaire dans un jeu de données @fr
term status: testing

Location
subclass of: Resource
Has Version: Location-001
issued: 2008-01-14
type: Class
comment: A spatial region or named place.
subclass of: Location, Period, or Jurisdiction
Relation: Location-001
date: 2008-01-14

Bibliographic Resource
subclass of: Resource
Has Version: BibliographicResource-001
issued: 2008-01-14
type: Class
comment: A book, article, or other documentary resource.
Relation: BibliographicResource-001
date: 2008-01-14

schoolHomepage
range: Thing
domain: Thing
type: Property
type: ObjectProperty
comment: A homepage of a school attended by the person.
domain: Person
range: Document
term status: testing
range: Resource
domain: Agent
domain: Resource
domain: SpatialThing

Person
subclass of: Resource
subclass of: Thing
subclass of: Agent
comment: A person.
term status: stable
subclass of: SpatialThing
disjoint with: Project
type: Class
subclass of: Person
disjoint with: Organization

similar
range: Thing
domain: Thing
label: similaire @fr
type: ObjectProperty
type: SymmetricProperty
term status: testing
range: Vocabulary
domain: Vocabulary
comment: Used to assert that two vocabularies are similar in scope and objectives, independently of the fact that they otherwise refer to each other.
comment: Indique que deux vocabulaires sont similaires dans leur domaine et/ou leurs objectifs, sans être nécessairement reliés par des références. @fr
type: Property
range: Resource
range: Dataset
range: Work
domain: Dataset
domain: Resource
domain: Work

has license
sub property of: License
equivalent property: license
sub property of: Rights
equivalent property: has license
sub property of: license
sub property of: has license
type: Property
domain: Work
range: License
domain: Resource
range: Resource
range: License Document
range: Rights Statement
type: Thing

Physical Medium
subclass of: Resource
description: Examples include paper, canvas, or DVD.
Has Version: PhysicalMedium-001
issued: 2008-01-14
type: Class
comment: A physical material or carrier.
subclass of: Media Type
Relation: PhysicalMedium-001
date: 2008-01-14

topic
domain: Thing
type: Property
type: ObjectProperty
comment: A topic of some page or document.
domain: Document
range: Thing
inverse of: page
term status: testing
range: Resource
domain: Resource

member
range: Thing
domain: Thing
type: Property
type: ObjectProperty
comment: Indicates a member of a Group
domain: Group
range: Agent
term status: stable
range: Resource
domain: Agent
domain: Resource

Project
subclass of: Resource
subclass of: Thing
type: Class
comment: A project (a collective endeavour of some kind).
disjoint with: Person
disjoint with: Document
term status: testing

Media Type or Extent
subclass of: Resource
Has Version: MediaTypeOrExtent-001
issued: 2008-01-14
type: Class
comment: A media type or extent.
Relation: MediaTypeOrExtent-001
date: 2008-01-14

current project
domain: Thing
type: Property
type: ObjectProperty
comment: A current project this person works on.
domain: Person
range: Thing
term status: testing
range: Resource
domain: Agent
domain: Resource
domain: SpatialThing

homepage
range: Thing
comment: A homepage for some thing.
range: Document
type: Property
term status: stable
sub property of: page
sub property of: is primary topic of
domain: Thing
type: ObjectProperty
type: InverseFunctionalProperty
domain: Resource
range: Resource

Source
sub property of: Relation
description: The described resource may be derived from the related resource in whole or in part. Recommended best practice is to identify the related resource by means of a string conforming to a formal identification system.
note: This term is intended to be used with non-literal values as defined in the DCMI Abstract Model (http://dublincore.org/documents/abstract-model/). As of December 2007, the DCMI Usage Board is seeking a way to express this intention with a formal range declaration.
comment: A related resource from which the described resource is derived.
type: Property
sub property of: Source
issued: 2008-01-14
Date Modified: 2008-01-14
Has Version: sourceT-001
Relation: sourceT-001
date: 2008-01-14

weblog
range: Thing
domain: Thing
sub property of: page
type: Property
range: Document
term status: testing
comment: A weblog of some thing (whether person, group, company etc.).
domain: Agent
type: InverseFunctionalProperty
type: ObjectProperty
domain: Resource
range: Resource

phone
range: Thing
domain: Thing
type: Property
type: ObjectProperty
comment: A phone, specified using fully qualified tel: URI scheme (refs: http://www.w3.org/Addressing/schemes.html#tel).
term status: testing
range: Resource
domain: Resource

in dataset
range: Thing
domain: Thing
type: ObjectProperty
domain: Dataset occurrences
label: dans le jeu de données @fr
comment: dataset in which a vocabulary occurred
comment: jeu de données dans lequel un vocabulaire apparait @fr
range: Dataset
term status: testing
type: Property
range: Resource
domain: Resource

Image
subclass of: Resource
subclass of: Thing
type: Class
comment: An image.
subclass of: Document
term status: testing

made
domain: Thing
type: Property
type: ObjectProperty
comment: Something that was made by this agent.
domain: Agent
range: Thing
inverse of: maker
term status: stable
range: Resource
domain: Resource

is primary topic of
range: Thing
comment: A document that this thing is the primary topic of.
domain: Thing
sub property of: page
type: InverseFunctionalProperty
range: Document
type: Property
term status: stable
inverse of: primary topic
type: ObjectProperty
domain: Resource
range: Resource

Jurisdiction
subclass of: Resource
Has Version: Jurisdiction-001
issued: 2008-01-14
type: Class
comment: The extent or range of judicial, law enforcement, or other authority.
subclass of: Location, Period, or Jurisdiction
Relation: Jurisdiction-001
date: 2008-01-14

License Document
subclass of: Resource
Has Version: LicenseDocument-001
issued: 2008-01-14
type: Class
comment: A legal document giving official permission to do something with a Resource.
subclass of: Rights Statement
Relation: LicenseDocument-001
date: 2008-01-14

Document
subclass of: Resource
subclass of: Thing
type: Class
comment: A document.
disjoint with: Organization
disjoint with: Project
term status: testing

Derivative Works
subclass of: DerivativeWorks
type: Permission
comment: distribution of derivative works
type: Class
equivalent class: DerivativeWorks

Online Gaming Account
subclass of: Resource
subclass of: Thing
type: Class
comment: An online gaming account.
subclass of: Online Account
term status: unstable

has disjunctions with
sub property of: Relation
sub property of: vocabulary
sub property of: References
range: Thing
domain: Thing
sub property of: relies on
comment: Indicates that the subject vocabulary contains some declaration of disjoint classes with the object vocabulary.
label: a des disjonctions avec @fr
type: ObjectProperty
description: PREFIX rdfs:<http://www.w3.org/2000/01/rdf-schema#> PREFIX owl:<http://www.w3.org/2002/07/owl#> PREFIX voaf:<http://purl.org/vocommons/voaf#> CONSTRUCT{ ?vocab1 voaf:hasDisjunctionsWith ?vocab2 } WHERE{ ?elem1 owl:disjointWith ?elem2. FILTER(!isBlank(?elem2)) ?elem1 rdfs:isDefinedBy ?vocab1. ?vocab1 a voaf:Vocabulary. ?elem2 rdfs:isDefinedBy ?vocab2. ?vocab2 a voaf:Vocabulary. FILTER(?vocab1!=?vocab2) }
term status: testing
domain: Vocabulary
range: Vocabulary
comment: Indique que le vocabulaire sujet contient des déclarations de classes disjointes avec le vocabulaire objet @fr
type: Property
domain: Dataset
domain: Resource
domain: Work
range: Resource
range: Work
range: Dataset

extends
range: Thing
domain: Thing
sub property of: Relation
sub property of: vocabulary
sub property of: References
domain: Vocabulary
term status: stable
type: ObjectProperty
label: étend @fr
range: Vocabulary
description: PREFIX rdfs:<http://www.w3.org/2000/01/rdf-schema#> PREFIX owl:<http://www.w3.org/2002/07/owl#> PREFIX voaf:<http://purl.org/vocommons/voaf#> CONSTRUCT{ ?vocab1 voaf:extends ?vocab2 } WHERE{ {?elem1 owl:inverseOf ?elem2. FILTER(!isBlank(?elem2))} UNION{?elem1 rdfs:domain ?elem2. FILTER(!isBlank(?elem2))} UNION{?elem1 rdfs:range ?elem2. FILTER(!isBlank(?elem2))} UNION{?elem2 rdfs:domain ?elem1. FILTER(!isBlank(?elem1))} UNION{?elem2 rdfs:range ?elem1. FILTER(!isBlank(?elem1))} ?elem1 rdfs:isDefinedBy ?vocab1. ?vocab1 a voaf:Vocabulary. ?elem2 rdfs:isDefinedBy ?vocab2. ?vocab2 a voaf:Vocabulary. FILTER(?vocab1!=?vocab2) }
comment: Indique que le vocabulaire sujet étend l'expressivité du vocabulaire objet en déclarant des relations de subsomption avec ce dernier, ou en utilisant ses classes comme domaine ou co-domaine d'un propriété du vocabulaire sujet, ou en définissant des contraintes locales etc. @fr
sub property of: relies on
comment: Indicates that the subject vocabulary extends the expressivity of the object vocabulary by declaring subsumption relationships, using object vocabulary class as domain or range of a subject vocabulary property, defining local restrictions etc..
type: Property
domain: Dataset
domain: Resource
domain: Work
range: Resource
range: Work
range: Dataset

Requirement
subclass of: Resource
subclass of: Requirement
type: Class
comment: an action that may or may not be requested of you
equivalent class: Requirement

metadata vocabulary
sub property of: Relation
sub property of: vocabulary
sub property of: References
range: Thing
domain: Thing
range: Vocabulary
description: PREFIX rdfs:<http://www.w3.org/2000/01/rdf-schema#> PREFIX owl:<http://www.w3.org/2002/07/owl#> PREFIX voaf:<http://purl.org/vocommons/voaf#> CONSTRUCT{ ?vocab1 voaf:metadataVoc ?vocab2 } WHERE{ ?elem1 ?elem2 ?o. ?elem1 rdfs:isDefinedBy ?vocab1. ?vocab1 a voaf:Vocabulary. ?elem2 rdfs:isDefinedBy ?vocab2. ?vocab2 a voaf:Vocabulary. FILTER(?vocab1!=?vocab2) }
sub property of: relies on
domain: Vocabulary
label: vocabulaire de métadonnées @fr
comment: Indique que le vocabulaire sujet utilise le vocabulaire objet pour décrire ses métadonnées, au niveau global du vocabulaire ou au niveau des éléments @fr
term status: stable
comment: Indicates that the subject vocabulary uses the object vocabulary in metadata at global vocabulary level or at element level
type: ObjectProperty
type: Property
domain: Dataset
domain: Resource
domain: Work
range: Resource
range: Work
range: Dataset

used by
range: Thing
domain: Thing
range: Vocabulary
term status: stable
label: utilisé par @fr
domain: Vocabulary
type: ObjectProperty
inverse of: relies on
comment: Indicates that the subject vocabulary is used by the object vocabulary
comment: Indique que le vocabulaire sujet est utilisé par le vocabulaire objet @fr
type: Property
range: Resource
range: Dataset
range: Work
domain: Dataset
domain: Resource
domain: Work

Agent
subclass of: Resource
subclass of: Agent
description: Examples of Agent include person, organization, and software agent.
Has Version: Agent-001
issued: 2008-01-14
type: Agent Class
type: Class
comment: A resource that acts or has the power to act.
Relation: Agent-001
date: 2008-01-14
equivalent class: Agent

example dataset
type: Property
range: Thing
domain: Thing
type: ObjectProperty
label: exemple de jeu de données @fr
comment: Deprecated since v1.1
comment: Déprécié depuis la v1.1 @fr
term status: deprecated
Is Replaced By: dataset
Relation: dataset
range: Resource
domain: Resource

File Format
subclass of: Resource
description: Examples include the formats defined by the list of Internet Media Types.
Has Version: FileFormat-001
issued: 2008-01-14
type: Class
comment: A digital resource format.
subclass of: Media Type
Relation: FileFormat-001
date: 2008-01-14

Commercial Use
subclass of: CommercialUse
type: Prohibition
comment: exercising rights for commercial purposes
type: Class
equivalent class: CommercialUse

usage in dataset
range: Thing
domain: Thing
type: ObjectProperty
domain: Vocabulary
label: utilisation dans un jeu de données @fr
comment: usage statistics in a dataset
comment: statistiques d'utilisation dans un jeu de données @fr
range: Dataset occurrences
term status: testing
type: Property
range: Resource
domain: Dataset
domain: Resource
domain: Work

workplace homepage
range: Thing
domain: Thing
type: Property
type: ObjectProperty
comment: A workplace homepage of some person; the homepage of an organization they work for.
domain: Person
range: Document
term status: testing
range: Resource
domain: Agent
domain: Resource
domain: SpatialThing

Size or Duration
subclass of: Resource
description: Examples include a number of pages, a specification of length, width, and breadth, or a period in hours, minutes, and seconds.
Has Version: SizeOrDuration-001
issued: 2008-01-14
type: Class
comment: A dimension or extent, or a time taken to play or execute.
subclass of: Media Type or Extent
Relation: SizeOrDuration-001
date: 2008-01-14

to-do list
range: Thing
domain: Thing
type: ObjectProperty
label: liste des choses à faire @fr
comment: Describes future tasks planned by a resource curator. This property is primarily intended to be used for vocabularies or datasets, but the domain is left open, it can be used for any resource. Use iCalendar Vtodo class and its properties to further describe the task calendar, priorities etc.
comment: Liste des tâches prévues par le gestionnaire d'une ressource. Cette propriété est destinée à l'usage des gestionnaires de vocabulaires ou de jeu de données mais son doamine est ouvert, elle peut être utilisée pour n'importe quelle ressource. Utiliser la classe ical:Vtodo pour une description fine des tâches : calendrier, priorités etc @fr
range: Vtodo
term status: stable
type: Property
range: Resource
domain: Resource

personal mailbox
domain: Thing
type: Property
type: InverseFunctionalProperty
type: ObjectProperty
comment: A personal mailbox, ie. an Internet mailbox associated with exactly one owner, the first owner of this mailbox. This is a 'static inverse functional property', in that there is (across time and change) at most one individual that ever has any particular value for foaf:mbox.
domain: Agent
range: Thing
term status: stable
range: Resource
domain: Resource

Reproduction
subclass of: Reproduction
type: Permission
comment: making multiple copies
type: Class
equivalent class: Reproduction

focus
domain: Thing
type: Property
type: ObjectProperty
comment: The underlying or 'focal' entity associated with some SKOS-described concept.
domain: Concept
range: Thing
term status: testing
range: Resource
domain: Resource

openid
sub property of: page
range: Thing
domain: Thing
range: Document
type: ObjectProperty
term status: testing
type: Property
domain: Agent
type: InverseFunctionalProperty
sub property of: is primary topic of
comment: An OpenID for an Agent.
domain: Resource
range: Resource

prohibits
equivalent property: prohibits
sub property of: prohibits
type: Property
domain: License
range: Prohibition
domain: Resource
domain: License Document
domain: Rights Statement
range: Resource

Distribution
subclass of: Distribution
type: Permission
comment: distribution, public display, and publicly performance
type: Class
equivalent class: Distribution

relies on
inverse of: used by
range: Thing
domain: Thing
sub property of: Relation
type: ObjectProperty
label: réutilise @fr
domain: Vocabulary
sub property of: vocabulary
range: Vocabulary
comment: Indique que le vocabulaire sujet utilise ou étend au moins une classe ou propriété du vocabulaire objet @fr
sub property of: References
term status: stable
comment: Indicates that the subject vocabulary uses or extends some class or property of the object vocabulary
type: Property
domain: Dataset
domain: Resource
range: Resource
range: Work
range: Dataset
domain: Work

Online E-commerce Account
subclass of: Resource
subclass of: Thing
type: Class
comment: An online e-commerce account.
subclass of: Online Account
term status: unstable

Group
subclass of: Resource
subclass of: Thing
subclass of: Agent
type: Class
comment: A class of Agents.
term status: stable

permits
equivalent property: permits
sub property of: permits
type: Property
domain: License
range: Permission
domain: Resource
domain: License Document
domain: Rights Statement
range: Resource

Share Alike
subclass of: ShareAlike
type: Requirement
comment: derivative works be licensed under the same terms or compatible terms as the original work
type: Class
equivalent class: ShareAlike

Creator
sub property of: maker
sub property of: Contributor
Date Modified: 2010-10-11
comment: An entity primarily responsible for making the resource.
Has Version: creatorT-002
equivalent property: maker
issued: 2008-01-14
sub property of: Creator
type: Property
description: Examples of a Creator include a person, an organization, or a service.
range: Agent
Relation: creatorT-002
date: 2010-10-11
date: 2008-01-14
domain: Thing
domain: Resource
range: Thing
range: Resource

Permission
subclass of: Permission
subclass of: Resource
type: Class
comment: an action that may or may not be allowed or desired
equivalent class: Permission

specializes
sub property of: vocabulary
sub property of: Relation
sub property of: References
range: Thing
domain: Thing
description: PREFIX rdfs:<http://www.w3.org/2000/01/rdf-schema#> PREFIX voaf:<http://purl.org/vocommons/voaf#> PREFIX skos:<http://www.w3.org/2004/02/skos/core#> CONSTRUCT{ ?vocab1 voaf:specializes ?vocab2 } WHERE{ {?elem1 rdfs:subPropertyOf ?elem2. FILTER(!isBlank(?elem2))} UNION{?elem1 rdfs:subClassOf ?elem2. FILTER(!isBlank(?elem2))} UNION{?elem1 skos:broadMatch ?elem2. FILTER(!isBlank(?elem2))} ?elem1 rdfs:isDefinedBy ?vocab1. ?vocab1 a voaf:Vocabulary. ?elem2 rdfs:isDefinedBy ?vocab2. ?vocab2 a voaf:Vocabulary. FILTER(?vocab1!=?vocab2) }
comment: Indicates that the subject vocabulary defines some subclasses or subproperties of the object vocabulary, or local restrictions on those.
comment: Indique que le vocabulaire sujet définit des sous-classes ou sous-propriétés du vocabulaire objet @fr
label: spécialise @fr
range: Vocabulary
sub property of: relies on
domain: Vocabulary
type: ObjectProperty
term status: stable
type: Property
domain: Dataset
domain: Resource
domain: Work
range: Resource
range: Work
range: Dataset

Agent
subclass of: Thing
subclass of: Resource
subclass of: Agent
type: Class
comment: An agent (eg. person, group, software or physical artifact).
equivalent class: Agent
term status: stable

Notice
subclass of: Notice
type: Requirement
comment: copyright and license notices be kept intact
type: Class
equivalent class: Notice

Label Property
subclass of: Resource
subclass of: Thing
type: Class
comment: A foaf:LabelProperty is any RDF property with texual values that serve as labels.
term status: unstable

Organization
subclass of: Agent
subclass of: Resource
subclass of: Thing
type: Class
comment: An organization.
disjoint with: Person
disjoint with: Document
term status: stable

publications
range: Thing
domain: Thing
type: Property
type: ObjectProperty
comment: A link to the publications of this person.
domain: Person
range: Document
term status: testing
range: Resource
domain: Agent
domain: Resource
domain: SpatialThing

dataset
range: Thing
domain: Thing
range: Dataset
Is Replaced By: Dataset occurrences
comment: Déprécié depuis la v2.4 @fr
domain: Vocabulary
type: ObjectProperty
label: jeu de données @fr
inverse of: vocabulary
term status: deprecated
comment: Deprecated since v2.4
Relation: Dataset occurrences
type: Property
range: Resource
domain: Dataset
domain: Resource
domain: Work

image
range: Thing
domain: Thing
type: Property
type: ObjectProperty
comment: An image that can be used to represent some thing (ie. those depictions which are particularly representative of something, eg. one's photo on a homepage).
domain: Person
range: Image
sub property of: depiction
term status: testing
domain: Resource
range: Resource
range: Document
domain: Agent
domain: SpatialThing

work info homepage
range: Thing
domain: Thing
type: Property
type: ObjectProperty
comment: A work info homepage of some person; a page about their work for some organization.
domain: Person
range: Document
term status: testing
range: Resource
domain: Agent
domain: Resource
domain: SpatialThing

PersonalProfileDocument
subclass of: Resource
subclass of: Thing
type: Class
comment: A personal profile RDF document.
subclass of: Document
term status: testing

Media Type
subclass of: Resource
Has Version: MediaType-001
issued: 2008-01-14
type: Class
comment: A file format or physical medium.
subclass of: Media Type or Extent
Relation: MediaType-001
date: 2008-01-14

primary topic
domain: Thing
domain: Document
type: FunctionalProperty
range: Thing
type: Property
term status: stable
type: ObjectProperty
comment: The primary topic of some page or document.
inverse of: is primary topic of
range: Resource
domain: Resource

based near
range: Thing
domain: Thing
type: Property
type: ObjectProperty
comment: A location that something is based near, for some broadly human notion of near.
domain: SpatialThing
range: SpatialThing
term status: testing
range: Resource
domain: Resource

account service homepage
range: Thing
domain: Thing
type: Property
type: ObjectProperty
comment: Indicates a homepage of the service provide for this online account.
domain: Online Account
range: Document
term status: testing
range: Resource
domain: Resource

page
range: Thing
type: Property
type: ObjectProperty
comment: A page or document about this thing.
domain: Thing
range: Document
inverse of: topic
term status: testing
range: Resource
domain: Resource

Vocabulary
subclass of: Resource
subclass of: Thing
type: Class
subclass of: Work
label: Vocabulaire @fr
term status: stable
subclass of: Dataset
comment: A vocabulary used in the linked data cloud. An instance of voaf:Vocabulary relies on or is used by at least another instance of voaf:Vocabulary
comment: Un vocabulaire utilisé ou utilisable dans le Web des données. Une instance de voaf:Vocabulary s'appuie at/ou est utilisée par au moins une autre instance of voaf:Vocabulary @fr
union of: http://lodlaundromat.org/.well-known/genid/samples/jena///predicate//6e7094a1eebe511cc0a924ab29428d96/08f918ba28f018796137367d7b0b9764#1

occurrences
range: Thing
domain: Thing
type: ObjectProperty
domain: Dataset occurrences
comment: Number of occurrences of a vocabulary in a dataset
comment: nombre d'occurrences d'un vocabulaire dans un dataset @fr
range: integer
term status: testing
type: Property
range: decimal
range: Resource
domain: Resource

topic_interest
domain: Thing
type: Property
type: ObjectProperty
comment: A thing of interest to this person.
domain: Agent
range: Thing
term status: testing
range: Resource
domain: Resource

Location, Period, or Jurisdiction
subclass of: Resource
Has Version: LocationPeriodOrJurisdiction-001
issued: 2008-01-14
type: Class
comment: A location, period of time, or jurisdiction.
Relation: LocationPeriodOrJurisdiction-001
date: 2008-01-14

http://lodlaundromat.org/.well-known/genid/samples/jena///predicate//6e7094a1eebe511cc0a924ab29428d96/08f918ba28f018796137367d7b0b9764#4
subclass of: Vocabulary
subclass of: Resource
subclass of: Thing
type: Class
type: Restriction
min cardinality: 1
on property: used by
subclass of: Work
subclass of: Dataset

account
range: Thing
domain: Thing
type: Property
type: ObjectProperty
comment: Indicates an account held by this agent.
domain: Agent
range: Online Account
term status: archaic
range: Resource
domain: Resource

Physical Resource
subclass of: Resource
Has Version: PhysicalResource-001
issued: 2008-01-14
type: Class
comment: A material thing.
Relation: PhysicalResource-001
date: 2008-01-14

Vocabulary Space
subclass of: Resource
subclass of: Thing
type: Class
label: Espace de vocabulaires @fr
comment: A vocabulary space defines any relevant grouping of vocabularies e.g., designed for similar purposes or domains, or designed by the same publisher or the same project, etc. A vocabulary can belong to zero, one or more vocabulary spaces.Dublin Core properties isPartOf and hasPart are used to link a vocabulary to a vocabulary space.
comment: Un Espace de vocabulaires définit un regroupement pertinent de vocabulaires, par exemple construits pour des domaines ou objectifs similaires, ou par le même déditeur ou le même projet, etc. Un Vocabulaire peut appartenir à zéro, un ou plusieurs Espace de vocabulaires. Les propriétés Dublin Core isPartOf et hasPart sont utilisées pour relier un Vocabulaire à un Espace de vocabulaires. @fr
term status: testing

Frequency
subclass of: Resource
Has Version: Frequency-001
issued: 2008-01-14
type: Class
comment: A rate at which something recurs.
Relation: Frequency-001
date: 2008-01-14

Jurisdiction
subclass of: Resource
type: Class
comment: the legal jurisdiction of a license

tipjar
range: Thing
domain: Thing
type: Property
type: ObjectProperty
comment: A tipjar document for this agent, describing means for payment and reward.
domain: Agent
range: Document
sub property of: page
term status: testing
domain: Resource
range: Resource

past project
domain: Thing
type: Property
type: ObjectProperty
comment: A project this person has previously worked on.
domain: Person
range: Thing
term status: testing
range: Resource
domain: Agent
domain: Resource
domain: SpatialThing

Instructional Method
description: Instructional Method will typically include ways of presenting instructional materials or conducting instructional activities, patterns of learner-to-learner and learner-to-instructor interactions, and mechanisms by which group and individual levels of learning are measured. Instructional methods include all aspects of the instruction and learning processes from planning and implementation through evaluation and feedback.
Has Version: instructionalMethod-002
issued: 2005-06-13
Date Modified: 2008-01-14
type: Property
comment: A process, used to engender knowledge, attitudes and skills, that the described resource is designed to support.
range: Method of Instruction
Relation: instructionalMethod-002
date: 2008-01-14
date: 2005-06-13
range: Resource

Lesser Copyleft
type: Requirement
comment: derivative works must be licensed under specified terms, with at least the same conditions as the original work; combinations with the work may be licensed under different terms

age
type: Property
type: FunctionalProperty
type: DatatypeProperty
comment: The age in years of some agent.
domain: Agent
range: Literal
term status: unstable
range: Resource
domain: Thing
domain: Resource

Surname
type: Property
type: DatatypeProperty
comment: The surname of some person.
domain: Person
range: Literal
term status: archaic
range: Resource
domain: Agent
domain: Resource
domain: SpatialThing
domain: Thing

v2.1
type: Expression
version info: 2.1
date: 2012-10-15
comment: Added desrciption of queries used to infer a particular VOAF relation between two vocabularies
comment: Ajout des requêtes pour générer des relations VOAF entre deux vocabulaires @fr
creator: pierre-yves-vandenbussche
embodiment: voaf v2.1.rdf
maker: pierre-yves-vandenbussche
type: Thing
Contributor: pierre-yves-vandenbussche

Date Accepted
Date Modified: 2008-01-14
range: Literal
sub property of: Date
comment: Date of acceptance of the resource.
type: Property
description: Examples of resources to which a Date Accepted may be relevant are a thesis (accepted by a university department) or an article (accepted by a journal).
Has Version: dateAccepted-002
issued: 2002-07-13
Relation: dateAccepted-002
date: 2008-01-14
date: 2002-07-13
range: Resource

Access Rights
range: Rights Statement
type: Property
issued: 2003-02-15
comment: Information about who can access the resource or an indication of its security status.
description: Access Rights may include information regarding access or restrictions based on privacy, security, or other policies.
sub property of: Rights
Date Modified: 2008-01-14
Has Version: accessRights-002
Relation: accessRights-002
date: 2008-01-14
date: 2003-02-15
range: Resource

Publisher
description: Examples of a Publisher include a person, an organization, or a service. Typically, the name of a Publisher should be used to indicate the entity.
Has Version: publisher-006
issued: 1999-07-02
Date Modified: 2008-01-14
type: Property
comment: An entity responsible for making the resource available.
note: A second property with the same name as this property has been declared in the dcterms: namespace (http://purl.org/dc/terms/). See the Introduction to the document "DCMI Metadata Terms" (http://dublincore.org/documents/dcmi-terms/) for an explanation.
Relation: publisher-006
date: 2008-01-14
date: 1999-07-02

UDC
Has Version: UDC-003
issued: 2000-07-11
Date Modified: 2008-01-14
type: VocabularyEncodingScheme
comment: The set of conceptual resources specified by the Universal Decimal Classification.
Relation: UDC-003
date: 2008-01-14
date: 2000-07-11

geekcode
type: Property
type: DatatypeProperty
comment: A textual geekcode for this person, see http://www.geekcode.com/geek.html
domain: Person
range: Literal
term status: archaic
range: Resource
domain: Agent
domain: Resource
domain: SpatialThing
domain: Thing

LCC
Has Version: LCC-003
issued: 2000-07-11
Date Modified: 2008-01-14
type: VocabularyEncodingScheme
comment: The set of conceptual resources specified by the Library of Congress Classification.
Relation: LCC-003
date: 2008-01-14
date: 2000-07-11

Bibliographic Citation
Has Version: bibliographicCitation-002
description: Recommended practice is to include sufficient bibliographic detail to identify the resource as unambiguously as possible.
range: Literal
domain: Bibliographic Resource
comment: A bibliographic reference for the resource.
type: Property
sub property of: Identifier
issued: 2003-02-15
Date Modified: 2008-01-14
Relation: bibliographicCitation-002
date: 2008-01-14
date: 2003-02-15
range: Resource
domain: Resource

number of properties
comment: The number of properties defined in the vocabulary namespace. Properties imported from other namespaces are not taken into account.
domain: Vocabulary
term status: stable
type: DatatypeProperty
description: PREFIX rdf:<http://www.w3.org/1999/02/22-rdf-syntax-ns#> PREFIX rdfs:<http://www.w3.org/2000/01/rdf-schema#> PREFIX owl:<http://www.w3.org/2002/07/owl#> PREFIX voaf:<http://purl.org/vocommons/voaf#> CONSTRUCT{ ?vocab voaf:propertyNumber ?nbProp } WHERE{ SELECT (COUNT(distinct ?prop) AS ?nbProp) ?vocab WHERE{ {?prop a rdf:Property.} UNION{?prop a owl:ObjectProperty.} UNION{?prop a owl:DatatypeProperty.} UNION{?prop a owl:AnnotationProperty.} UNION{?prop a owl:FunctionalProperty.} UNION{?prop a owl:OntologyProperty.} UNION{?prop a owl:AsymmetricProperty.} UNION{?prop a owl:InverseFunctionalProperty.} UNION{?prop a owl:IrreflexiveProperty.} UNION{?prop a owl:ReflexiveProperty.} UNION{?prop a owl:SymmetricProperty.} UNION{?prop a owl:TransitiveProperty.} ?prop a ?type. FILTER(?type!=owl:DeprecatedProperty) ?prop rdfs:isDefinedBy ?vocab. ?vocab a voaf:Vocabulary. }GROUP BY ?vocab }
comment: Le nombre de propriétés définies dans l'espace de noms du Vocabulaire. Les propriétés importées d'autres vocabulaires ne sont pas comptabilisées. @fr
range: integer
label: nombre de propriétés @fr
type: Property
range: decimal
range: Resource
domain: Dataset
domain: Resource
domain: Work
domain: Thing

Coverage
description: Spatial topic and spatial applicability may be a named place or a location specified by its geographic coordinates. Temporal topic may be a named period, date, or date range. A jurisdiction may be a named administrative entity or a geographic place to which the resource applies. Recommended best practice is to use a controlled vocabulary such as the Thesaurus of Geographic Names [TGN]. Where appropriate, named places or time periods can be used in preference to numeric identifiers such as sets of coordinates or date ranges.
Has Version: coverage-006
issued: 1999-07-02
Date Modified: 2008-01-14
type: Property
comment: The spatial or temporal topic of the resource, the spatial applicability of the resource, or the jurisdiction under which the resource is relevant.
note: A second property with the same name as this property has been declared in the dcterms: namespace (http://purl.org/dc/terms/). See the Introduction to the document "DCMI Metadata Terms" (http://dublincore.org/documents/dcmi-terms/) for an explanation.
Relation: coverage-006
date: 2008-01-14
date: 1999-07-02

ISO 3166
Has Version: ISO3166-004
issued: 2000-07-11
Date Modified: 2008-01-14
type: Datatype
comment: The set of codes listed in ISO 3166-1 for the representation of names of countries.
Relation: ISO3166-004
date: 2008-01-14
date: 2000-07-11
type: Class

W3C-DTF
Has Version: W3CDTF-003
issued: 2000-07-11
Date Modified: 2008-01-14
type: Datatype
comment: The set of dates and times constructed according to the W3C Date and Time Formats Specification.
Relation: W3CDTF-003
date: 2008-01-14
date: 2000-07-11
type: Class

MSN chat ID
sub property of: nickname
type: InverseFunctionalProperty
comment: An MSN chat ID
domain: Agent
type: DatatypeProperty
term status: testing
type: Property
range: Literal
type: ObjectProperty
range: Resource
domain: Thing
domain: Resource

Yahoo chat ID
domain: Agent
term status: testing
range: Literal
comment: A Yahoo chat ID
type: DatatypeProperty
sub property of: nickname
type: Property
type: InverseFunctionalProperty
type: ObjectProperty
range: Resource
domain: Thing
domain: Resource

Audience
Has Version: audience-003
issued: 2001-05-21
Date Modified: 2008-01-14
type: Property
comment: A class of entity for whom the resource is intended or useful.
range: Agent Class
Relation: audience-003
date: 2008-01-14
date: 2001-05-21
range: Resource
range: Class

Rights Holder
Has Version: rightsHolder-002
issued: 2004-06-14
Date Modified: 2008-01-14
type: Property
comment: A person or organization owning or managing rights over the resource.
range: Agent
Relation: rightsHolder-002
date: 2008-01-14
date: 2004-06-14
range: Resource
range: Thing

reused by datasets
type: DatatypeProperty
label: réutilisé par des jeux de données @fr
comment: Distinct number of datasets reusing a resource.
comment: Nombre distinct de jeux de données reutilisant une resource. @fr
range: integer
term status: testing
type: Property
range: decimal
range: Resource

License
comment: A legal document giving official permission to do something with the resource.
type: Property
range: License Document
sub property of: Rights
issued: 2004-06-14
Date Modified: 2008-01-14
Has Version: license-002
Relation: license-002
date: 2008-01-14
date: 2004-06-14
range: Rights Statement
range: Resource

Mediator
type: Property
range: Agent Class
issued: 2001-05-21
Has Version: mediator-003
Date Modified: 2008-01-14
comment: An entity that mediates access to the resource and for whom the resource is intended or useful.
description: In an educational context, a mediator might be a parent, teacher, teaching assistant, or care-giver.
sub property of: Audience
Relation: mediator-003
date: 2008-01-14
date: 2001-05-21
range: Resource
range: Class

Has Version
Has Version: hasVersion-003
sub property of: Relation
comment: A related resource that is a version, edition, or adaptation of the described resource.
Date Modified: 2008-01-14
note: This term is intended to be used with non-literal values as defined in the DCMI Abstract Model (http://dublincore.org/documents/abstract-model/). As of December 2007, the DCMI Usage Board is seeking a way to express this intention with a formal range declaration.
issued: 2000-07-11
type: Property
Relation: hasVersion-003
date: 2008-01-14
date: 2000-07-11

Given name
type: Property
type: DatatypeProperty
comment: The given name of some person.
term status: testing

NLM
Has Version: NLM-002
issued: 2005-06-13
Date Modified: 2008-01-14
type: VocabularyEncodingScheme
comment: The set of conceptual resources specified by the National Library of Medicine Classification.
Relation: NLM-002
date: 2008-01-14
date: 2005-06-13

funded by
type: Property
type: ObjectProperty
comment: An organization funding a project or person.
domain: Thing
range: Thing
term status: archaic
range: Resource
domain: Resource

account name
type: Property
type: DatatypeProperty
comment: Indicates the name (identifier) associated with this online account.
domain: Online Account
range: Literal
term status: testing
range: Resource
domain: Thing
domain: Resource

Date Valid
type: Property
range: Literal
issued: 2000-07-11
sub property of: Date
comment: Date (often a range) of validity of a resource.
Date Modified: 2008-01-14
Has Version: valid-003
Relation: valid-003
date: 2008-01-14
date: 2000-07-11
range: Resource

Identifier
description: Recommended best practice is to identify the resource by means of a string conforming to a formal identification system.
Has Version: identifier-006
issued: 1999-07-02
Date Modified: 2008-01-14
type: Property
comment: An unambiguous reference to the resource within a given context.
note: A second property with the same name as this property has been declared in the dcterms: namespace (http://purl.org/dc/terms/). See the Introduction to the document "DCMI Metadata Terms" (http://dublincore.org/documents/dcmi-terms/) for an explanation.
Relation: identifier-006
date: 2008-01-14
date: 1999-07-02

Language
issued: 1999-07-02
note: A second property with the same name as this property has been declared in the dcterms: namespace (http://purl.org/dc/terms/). See the Introduction to the document "DCMI Metadata Terms" (http://dublincore.org/documents/dcmi-terms/) for an explanation.
Has Version: language-007
description: Recommended best practice is to use a controlled vocabulary such as RFC 4646 [RFC4646].
type: Property
comment: A language of the resource.
Date Modified: 2008-01-14
Relation: language-007
date: 2008-01-14
date: 1999-07-02

Requires
Has Version: requires-003
type: Property
comment: A related resource that is required by the described resource to support its function, delivery, or coherence.
issued: 2000-07-11
sub property of: Relation
note: This term is intended to be used with non-literal values as defined in the DCMI Abstract Model (http://dublincore.org/documents/abstract-model/). As of December 2007, the DCMI Usage Board is seeking a way to express this intention with a formal range declaration.
Date Modified: 2008-01-14
Relation: requires-003
date: 2008-01-14
date: 2000-07-11

Replaces
Has Version: replaces-003
note: This term is intended to be used with non-literal values as defined in the DCMI Abstract Model (http://dublincore.org/documents/abstract-model/). As of December 2007, the DCMI Usage Board is seeking a way to express this intention with a formal range declaration.
Date Modified: 2008-01-14
comment: A related resource that is supplanted, displaced, or superseded by the described resource.
sub property of: Relation
type: Property
issued: 2000-07-11
Relation: replaces-003
date: 2008-01-14
date: 2000-07-11

MeSH
Has Version: MESH-003
issued: 2000-07-11
Date Modified: 2008-01-14
type: VocabularyEncodingScheme
comment: The set of labeled concepts specified by the Medical Subject Headings.
Relation: MESH-003
date: 2008-01-14
date: 2000-07-11

Is Version Of
note: This term is intended to be used with non-literal values as defined in the DCMI Abstract Model (http://dublincore.org/documents/abstract-model/). As of December 2007, the DCMI Usage Board is seeking a way to express this intention with a formal range declaration.
Has Version: isVersionOf-003
sub property of: Relation
type: Property
comment: A related resource of which the described resource is a version, edition, or adaptation.
issued: 2000-07-11
description: Changes in version imply substantive changes in content rather than differences in format.
Date Modified: 2008-01-14
Relation: isVersionOf-003
date: 2008-01-14
date: 2000-07-11

Audience Education Level
Has Version: educationLevel-002
issued: 2002-07-13
Date Modified: 2008-01-14
type: Property
comment: A class of entity, defined in terms of progression through an educational or training context, for which the described resource is intended.
range: Agent Class
sub property of: Audience
Relation: educationLevel-002
date: 2008-01-14
date: 2002-07-13
range: Resource
range: Class

Coverage
issued: 2008-01-14
comment: The spatial or temporal topic of the resource, the spatial applicability of the resource, or the jurisdiction under which the resource is relevant.
Has Version: coverageT-001
Date Modified: 2008-01-14
sub property of: Coverage
type: Property
range: Location, Period, or Jurisdiction
description: Spatial topic and spatial applicability may be a named place or a location specified by its geographic coordinates. Temporal topic may be a named period, date, or date range. A jurisdiction may be a named administrative entity or a geographic place to which the resource applies. Recommended best practice is to use a controlled vocabulary such as the Thesaurus of Geographic Names [TGN]. Where appropriate, named places or time periods can be used in preference to numeric identifiers such as sets of coordinates or date ranges.
Relation: coverageT-001
date: 2008-01-14
range: Resource

DCMI Point
Has Version: Point-003
issued: 2000-07-11
Date Modified: 2008-01-14
type: Datatype
comment: The set of points in space defined by their geographic coordinates according to the DCMI Point Encoding Scheme.
Relation: Point-003
date: 2008-01-14
date: 2000-07-11
type: Class

status
type: Property
type: DatatypeProperty
comment: A string expressing what the user is happy for the general public (normally) to know about their current activity.
domain: Agent
range: Literal
term status: unstable
range: Resource
domain: Thing
domain: Resource

DNA checksum
type: Property
type: DatatypeProperty
comment: A checksum for the DNA of some thing. Joke.
range: Literal
term status: archaic
range: Resource

Identifier
sub property of: Identifier
range: Literal
Has Version: identifierT-001
description: Recommended best practice is to identify the resource by means of a string conforming to a formal identification system.
issued: 2008-01-14
type: Property
comment: An unambiguous reference to the resource within a given context.
Date Modified: 2008-01-14
Relation: identifierT-001
date: 2008-01-14
range: Resource

Date Created
sub property of: Date
range: Literal
Date Modified: 2008-01-14
comment: Date of creation of the resource.
type: Property
Has Version: created-003
issued: 2000-07-11
Relation: created-003
date: 2008-01-14
date: 2000-07-11
range: Resource

deprecated on
type: Property
domain: License
range: date
range: Resource
domain: Resource
domain: Rights Statement
domain: License Document

Provenance
description: The statement may include a description of any changes successive custodians made to the resource.
Has Version: provenance-002
issued: 2004-09-20
Date Modified: 2008-01-14
type: Property
comment: A statement of any changes in ownership and custody of the resource since its creation that are significant for its authenticity, integrity, and interpretation.
range: Provenance Statement
Relation: provenance-002
date: 2008-01-14
date: 2004-09-20
range: Resource

DCMI Metadata Terms - other
Date Modified: 2012-06-14
publisher: DCMI
date: 2012-06-14

sha1sum (hex)
type: Property
type: DatatypeProperty
comment: A sha1sum hash, in hex.
domain: Document
term status: unstable
domain: Resource
domain: Thing

Subject
description: Typically, the subject will be represented using keywords, key phrases, or classification codes. Recommended best practice is to use a controlled vocabulary.
Has Version: subject-007
issued: 1999-07-02
Date Modified: 2012-06-14
type: Property
comment: The topic of the resource.
note: A second property with the same name as this property has been declared in the dcterms: namespace (http://purl.org/dc/terms/). See the Introduction to the document "DCMI Metadata Terms" (http://dublincore.org/documents/dcmi-terms/) for an explanation.
Relation: subject-007
date: 2012-06-14
date: 1999-07-02

Copyleft
type: Requirement
comment: derivative and combined works must be licensed under specified terms, similar to those on the original work

myersBriggs
type: Property
type: DatatypeProperty
comment: A Myers Briggs (MBTI) personality classification.
domain: Person
range: Literal
term status: testing
range: Resource
domain: Agent
domain: Resource
domain: SpatialThing
domain: Thing

Format
Has Version: formatT-001
type: Property
description: Examples of dimensions include size and duration. Recommended best practice is to use a controlled vocabulary such as the list of Internet Media Types [MIME].
Date Modified: 2008-01-14
comment: The file format, physical medium, or dimensions of the resource.
issued: 2008-01-14
sub property of: Format
range: Media Type or Extent
Relation: formatT-001
date: 2008-01-14
range: Resource

logo
type: Property
type: ObjectProperty
type: InverseFunctionalProperty
comment: A logo representing some thing.
domain: Thing
range: Thing
term status: testing
range: Resource
domain: Resource

Spatial Coverage
type: Property
range: Location
comment: Spatial characteristics of the resource.
issued: 2000-07-11
Date Modified: 2008-01-14
Has Version: spatial-003
sub property of: Coverage
Relation: spatial-003
date: 2008-01-14
date: 2000-07-11
range: Location, Period, or Jurisdiction
range: Resource

ISO 639-2
Has Version: ISO639-2-003
issued: 2000-07-11
Date Modified: 2008-01-14
type: Datatype
comment: The three-letter alphabetic codes listed in ISO639-2 for the representation of names of languages.
Relation: ISO639-2-003
date: 2008-01-14
date: 2000-07-11
type: Class

Is Format Of
Has Version: isFormatOf-003
Date Modified: 2008-01-14
issued: 2000-07-11
sub property of: Relation
type: Property
note: This term is intended to be used with non-literal values as defined in the DCMI Abstract Model (http://dublincore.org/documents/abstract-model/). As of December 2007, the DCMI Usage Board is seeking a way to express this intention with a formal range declaration.
comment: A related resource that is substantially the same as the described resource, but in another format.
Relation: isFormatOf-003
date: 2008-01-14
date: 2000-07-11

Alternative Title
sub property of: Title
type: Property
Date Modified: 2010-10-11
range: Literal
issued: 2000-07-11
description: The distinction between titles and alternative titles is application-specific.
Has Version: alternative-003
comment: An alternative name for the resource.
Relation: alternative-003
date: 2010-10-11
date: 2000-07-11
range: Resource

reused by vocabularies
type: DatatypeProperty
label: réutilisé par des vocabulaires @fr
comment: Distinct number of vocabularies reusing a resource.
comment: Nombre distinct de vocabulaires reutilisant une resource. @fr
range: integer
term status: testing
type: Property
range: decimal
range: Resource

Language
Date Modified: 2008-01-14
type: Property
Has Version: languageT-001
sub property of: Language
description: Recommended best practice is to use a controlled vocabulary such as RFC 4646 [RFC4646].
issued: 2008-01-14
comment: A language of the resource.
range: Linguistic System
Relation: languageT-001
date: 2008-01-14
range: Resource

Relation
description: Recommended best practice is to identify the related resource by means of a string conforming to a formal identification system.
Has Version: relation-006
issued: 1999-07-02
Date Modified: 2008-01-14
type: Property
comment: A related resource.
note: A second property with the same name as this property has been declared in the dcterms: namespace (http://purl.org/dc/terms/). See the Introduction to the document "DCMI Metadata Terms" (http://dublincore.org/documents/dcmi-terms/) for an explanation.
Relation: relation-006
date: 2008-01-14
date: 1999-07-02

ICQ chat ID
sub property of: nickname
term status: testing
domain: Agent
range: Literal
comment: An ICQ chat ID
type: InverseFunctionalProperty
type: Property
type: DatatypeProperty
type: ObjectProperty
range: Resource
domain: Thing
domain: Resource

name
type: Property
type: DatatypeProperty
comment: A name for some thing.
domain: Thing
range: Literal
sub property of: label
term status: testing
range: Resource
domain: Resource

family_name
type: Property
type: DatatypeProperty
comment: The family name of some person.
domain: Person
range: Literal
term status: archaic
range: Resource
domain: Agent
domain: Resource
domain: SpatialThing
domain: Thing

Creator
description: Examples of a Creator include a person, an organization, or a service. Typically, the name of a Creator should be used to indicate the entity.
Has Version: creator-006
issued: 1999-07-02
Date Modified: 2008-01-14
type: Property
comment: An entity primarily responsible for making the resource.
note: A second property with the same name as this property has been declared in the dcterms: namespace (http://purl.org/dc/terms/). See the Introduction to the document "DCMI Metadata Terms" (http://dublincore.org/documents/dcmi-terms/) for an explanation.
Relation: creator-006
date: 2008-01-14
date: 1999-07-02

number of classes
comment: The number of classes defined in the vocabulary namespace. Classes imported from other namespaces are not taken into account.
label: nombre de classes @fr
description: PREFIX rdfs:<http://www.w3.org/2000/01/rdf-schema#> PREFIX owl:<http://www.w3.org/2002/07/owl#> PREFIX voaf:<http://purl.org/vocommons/voaf#> CONSTRUCT{ ?vocab voaf:classNumber ?nbClass } WHERE{ SELECT (COUNT(distinct ?class) AS ?nbClass) ?vocab WHERE{ {?class a rdfs:Class.} UNION{?class a owl:Class.} ?class a ?type. FILTER(?type!=owl:DeprecatedClass) ?class rdfs:isDefinedBy ?vocab. ?vocab a voaf:Vocabulary. }GROUP BY ?vocab }
comment: Le nombre de classes définies dans l'espace de noms du Vocabulaire. Les classes importées d'autres vocabulaires ne sont pas comptabilisées. @fr
type: DatatypeProperty
term status: stable
domain: Vocabulary
range: integer
type: Property
range: decimal
range: Resource
domain: Dataset
domain: Resource
domain: Work
domain: Thing

Format
description: Examples of dimensions include size and duration. Recommended best practice is to use a controlled vocabulary such as the list of Internet Media Types [MIME].
Has Version: format-007
issued: 1999-07-02
Date Modified: 2008-01-14
type: Property
comment: The file format, physical medium, or dimensions of the resource.
note: A second property with the same name as this property has been declared in the dcterms: namespace (http://purl.org/dc/terms/). See the Introduction to the document "DCMI Metadata Terms" (http://dublincore.org/documents/dcmi-terms/) for an explanation.
Relation: format-007
date: 2008-01-14
date: 1999-07-02

v2.2
type: Expression
version info: 2.2
date: 2013-04-24
comment: Added properties to represent metrics of vocabulary elements usage in LOV and LOD
comment: Ajout de propriétés pour représenter les métriques d'usage d'éléments de vocabulaire dans le LOV et le LOD @fr
creator: pierre-yves-vandenbussche
embodiment: voaf v2.2.rdf
maker: pierre-yves-vandenbussche
type: Thing
Contributor: pierre-yves-vandenbussche

Date
issued: 2008-01-14
comment: A point or period of time associated with an event in the lifecycle of the resource.
description: Date may be used to express temporal information at any level of granularity. Recommended best practice is to use an encoding scheme, such as the W3CDTF profile of ISO 8601 [W3CDTF].
Has Version: dateT-001
Date Modified: 2008-01-14
type: Property
range: Literal
sub property of: Date
Relation: dateT-001
date: 2008-01-14
range: Resource

jurisdiction
type: Property
domain: License
range: Jurisdiction
range: Resource
domain: Resource
domain: Rights Statement
domain: License Document

Temporal Coverage
sub property of: Coverage
Has Version: temporal-003
type: Property
issued: 2000-07-11
Date Modified: 2008-01-14
range: Period of Time
comment: Temporal characteristics of the resource.
Relation: temporal-003
date: 2008-01-14
date: 2000-07-11
range: Location, Period, or Jurisdiction
range: Resource

Abstract
Has Version: abstract-003
issued: 2000-07-11
Date Modified: 2008-01-14
type: Property
comment: A summary of the resource.
sub property of: Description
Relation: abstract-003
date: 2008-01-14
date: 2000-07-11

Is Part Of
issued: 2000-07-11
type: Property
sub property of: Relation
Date Modified: 2008-01-14
note: This term is intended to be used with non-literal values as defined in the DCMI Abstract Model (http://dublincore.org/documents/abstract-model/). As of December 2007, the DCMI Usage Board is seeking a way to express this intention with a formal range declaration.
Has Version: isPartOf-003
comment: A related resource in which the described resource is physically or logically included.
Relation: isPartOf-003
date: 2008-01-14
date: 2000-07-11

RFC 5646
description: RFC 5646 obsoletes RFC 4646.
Has Version: RFC5646-001
issued: 2010-10-11
type: Datatype
comment: The set of tags constructed according to RFC 5646 for the identification of languages.
Relation: RFC5646-001
date: 2010-10-11
type: Class

Source
description: The described resource may be derived from the related resource in whole or in part. Recommended best practice is to identify the related resource by means of a string conforming to a formal identification system.
Has Version: source-006
issued: 1999-07-02
Date Modified: 2008-01-14
type: Property
comment: A related resource from which the described resource is derived.
note: A second property with the same name as this property has been declared in the dcterms: namespace (http://purl.org/dc/terms/). See the Introduction to the document "DCMI Metadata Terms" (http://dublincore.org/documents/dcmi-terms/) for an explanation.
Relation: source-006
date: 2008-01-14
date: 1999-07-02

Description
description: Description may include but is not limited to: an abstract, a table of contents, a graphical representation, or a free-text account of the resource.
Has Version: description-006
issued: 1999-07-02
Date Modified: 2008-01-14
type: Property
comment: An account of the resource.
note: A second property with the same name as this property has been declared in the dcterms: namespace (http://purl.org/dc/terms/). See the Introduction to the document "DCMI Metadata Terms" (http://dublincore.org/documents/dcmi-terms/) for an explanation.
Relation: description-006
date: 2008-01-14
date: 1999-07-02

RFC 1766
Has Version: RFC1766-003
issued: 2000-07-11
Date Modified: 2008-01-14
type: Datatype
comment: The set of tags, constructed according to RFC 1766, for the identification of languages.
Relation: RFC1766-003
date: 2008-01-14
date: 2000-07-11
type: Class

lastName
type: Property
type: DatatypeProperty
comment: The last name of a person.
domain: Person
range: Literal
term status: testing
range: Resource
domain: Agent
domain: Resource
domain: SpatialThing
domain: Thing

Date Submitted
sub property of: Date
type: Property
range: Literal
comment: Date of submission of the resource.
Date Modified: 2008-01-14
issued: 2002-07-13
description: Examples of resources to which a Date Submitted may be relevant are a thesis (submitted to a university department) or an article (submitted to a journal).
Has Version: dateSubmitted-002
Relation: dateSubmitted-002
date: 2008-01-14
date: 2002-07-13
range: Resource

LCSH
Has Version: LCSH-003
issued: 2000-07-11
Date Modified: 2008-01-14
type: VocabularyEncodingScheme
comment: The set of labeled concepts specified by the Library of Congress Subject Headings.
Relation: LCSH-003
date: 2008-01-14
date: 2000-07-11

gender
type: Property
type: FunctionalProperty
type: DatatypeProperty
comment: The gender of this Agent (typically but not necessarily 'male' or 'female').
domain: Agent
range: Literal
term status: testing
range: Resource
domain: Thing
domain: Resource

Vocabulary of a Friend
Date Modified: 2013-05-24
realization: v1.0
type: Ontology
preferred namespace prefix: voaf
has license: http://creativecommons.org/licenses/by/3.0/
example dataset: lov.rdf
Contributor: lise-rozat
realization: v2.0
preferred namespace uri: http://purl.org/vocommons/voaf#
type: Vocabulary
realization: v2.2
description: A vocabulary to describe linked data vocabularies and their relations.
Contributor: pierre-yves-vandenbussche
creator: bernard-vatant
issued: 2011-03-11
publisher: Open Knowledge Foundation
description: Un vocabulaire de description des vocabulaires RDF et de leurs relations mutuelles @fr
title: Vocabulaire d'un ami @fr
realization: v2.1
realization: v1.1
realization: v2.3
type: Thing
date: 2013-05-24
maker: bernard-vatant
Contributor: bernard-vatant
type: Work
Rights: http://creativecommons.org/licenses/by/3.0/
license: http://creativecommons.org/licenses/by/3.0/
License: http://creativecommons.org/licenses/by/3.0/
type: Dataset
date: 2011-03-11

theme
type: Property
type: ObjectProperty
comment: A theme.
domain: Thing
range: Thing
term status: archaic
range: Resource
domain: Resource

Relation
note: This term is intended to be used with non-literal values as defined in the DCMI Abstract Model (http://dublincore.org/documents/abstract-model/). As of December 2007, the DCMI Usage Board is seeking a way to express this intention with a formal range declaration.
comment: A related resource.
description: Recommended best practice is to identify the related resource by means of a string conforming to a formal identification system.
Has Version: relationT-001
type: Property
sub property of: Relation
issued: 2008-01-14
Date Modified: 2008-01-14
Relation: relationT-001
date: 2008-01-14

IMT
Has Version: IMT-004
issued: 2000-07-11
Date Modified: 2008-01-14
type: VocabularyEncodingScheme
comment: The set of media types specified by the Internet Assigned Numbers Authority.
Relation: IMT-004
date: 2008-01-14
date: 2000-07-11

Title
Has Version: titleT-002
issued: 2008-01-14
Date Modified: 2010-10-11
type: Property
comment: A name given to the resource.
range: Literal
sub property of: Title
Relation: titleT-002
date: 2010-10-11
date: 2008-01-14
range: Resource

DCMI Box
Has Version: Box-003
issued: 2000-07-11
Date Modified: 2008-01-14
type: Datatype
comment: The set of regions in space defined by their geographic coordinates according to the DCMI Box Encoding Scheme.
Relation: Box-003
date: 2008-01-14
date: 2000-07-11
type: Class

jabber ID
type: Property
type: DatatypeProperty
type: InverseFunctionalProperty
comment: A jabber ID for something.
domain: Agent
range: Literal
term status: testing
type: ObjectProperty
range: Resource
domain: Thing
domain: Resource

AIM chat ID
type: Property
type: DatatypeProperty
domain: Agent
comment: An AIM chat ID
type: InverseFunctionalProperty
term status: testing
range: Literal
sub property of: nickname
type: ObjectProperty
range: Resource
domain: Thing
domain: Resource

Medium
range: Physical Medium
comment: The material or physical carrier of the resource.
domain: Physical Resource
issued: 2000-07-11
type: Property
Has Version: medium-003
sub property of: Format
Date Modified: 2008-01-14
Relation: medium-003
date: 2008-01-14
date: 2000-07-11
range: Media Type or Extent
range: Resource
range: Media Type
domain: Resource

Subject
Has Version: subjectT-002
Date Modified: 2012-06-14
description: Typically, the subject will be represented using keywords, key phrases, or classification codes. Recommended best practice is to use a controlled vocabulary.
issued: 2008-01-14
sub property of: Subject
type: Property
note: This term is intended to be used with non-literal values as defined in the DCMI Abstract Model (http://dublincore.org/documents/abstract-model/). As of December 2007, the DCMI Usage Board is seeking a way to express this intention with a formal range declaration.
comment: The topic of the resource.
Relation: subjectT-002
date: 2012-06-14
date: 2008-01-14

Type
Has Version: typeT-001
sub property of: Type
description: Recommended best practice is to use a controlled vocabulary such as the DCMI Type Vocabulary [DCMITYPE]. To describe the file format, physical medium, or dimensions of the resource, use the Format element.
Date Modified: 2008-01-14
range: Class
type: Property
comment: The nature or genre of the resource.
issued: 2008-01-14
Relation: typeT-001
date: 2008-01-14
range: Resource

occurrences in vocabularies
type: DatatypeProperty
label: occurences dans des vocabulaires @fr
comment: Number of vocabularies using a resource
comment: Nombre de vocabulaires utilisant une ressource. @fr
range: integer
term status: testing
type: Property
range: decimal
range: Resource

v1.0
type: Expression
version info: 1.0
date: 2011-03-11
comment: First published version
comment: Première publication @fr
embodiment: voaf v1.0.rdf

Date Modified
Date Modified: 2008-01-14
sub property of: Date
type: Property
range: Literal
issued: 2000-07-11
comment: Date on which the resource was changed.
Has Version: modified-003
Relation: modified-003
date: 2008-01-14
date: 2000-07-11
range: Resource

v2.0
type: Expression
version info: 2.0
date: 2012-07-03
comment: Namespace moved to purl. Introduction of versions using FRBR. voaf:Vocabulary rdfs:subClassOf frbr:Work. Added labels and comments in French
comment: Namespace migré sous purl. Introduction des versions avec FRBR. voaf:Vocabulary rdfs:subClassOf frbr:Work. Ajout des traductions françaises @fr
creator: bernard-vatant
embodiment: voaf v2.0.rdf
maker: bernard-vatant
type: Thing
Contributor: bernard-vatant

Contributor
description: Examples of a Contributor include a person, an organization, or a service. Typically, the name of a Contributor should be used to indicate the entity.
Has Version: contributor-006
issued: 1999-07-02
Date Modified: 2008-01-14
type: Property
comment: An entity responsible for making contributions to the resource.
note: A second property with the same name as this property has been declared in the dcterms: namespace (http://purl.org/dc/terms/). See the Introduction to the document "DCMI Metadata Terms" (http://dublincore.org/documents/dcmi-terms/) for an explanation.
Relation: contributor-006
date: 2008-01-14
date: 1999-07-02

URI
Has Version: URI-003
issued: 2000-07-11
Date Modified: 2008-01-14
type: Datatype
comment: The set of identifiers constructed according to the generic syntax for Uniform Resource Identifiers as specified by the Internet Engineering Task Force.
Relation: URI-003
date: 2008-01-14
date: 2000-07-11
type: Class

TGN
Has Version: TGN-003
issued: 2000-07-11
Date Modified: 2008-01-14
type: VocabularyEncodingScheme
comment: The set of places specified by the Getty Thesaurus of Geographic Names.
Relation: TGN-003
date: 2008-01-14
date: 2000-07-11

Conforms To
issued: 2001-05-21
Date Modified: 2008-01-14
range: Standard
sub property of: Relation
comment: An established standard to which the described resource conforms.
Has Version: conformsTo-003
type: Property
Relation: conformsTo-003
date: 2008-01-14
date: 2001-05-21
range: Resource

Rights
range: Rights Statement
issued: 2008-01-14
description: Typically, rights information includes a statement about various property rights associated with the resource, including intellectual property rights.
comment: Information about rights held in and over the resource.
Date Modified: 2008-01-14
type: Property
Has Version: rightsT-001
sub property of: Rights
Relation: rightsT-001
date: 2008-01-14
range: Resource

RFC 3066
description: RFC 3066 has been obsoleted by RFC 4646.
Has Version: RFC3066-002
issued: 2002-07-13
Date Modified: 2008-01-14
type: Datatype
comment: The set of tags constructed according to RFC 3066 for the identification of languages.
Relation: RFC3066-002
date: 2008-01-14
date: 2002-07-13
type: Class

plan
type: Property
type: DatatypeProperty
comment: Aplan comment, in the tradition of finger and '.plan' files.
domain: Person
range: Literal
term status: testing
range: Resource
domain: Agent
domain: Resource
domain: SpatialThing
domain: Thing

Accrual Policy
Has Version: accrualPolicy-003
issued: 2005-06-13
Date Modified: 2010-10-11
type: Property
comment: The policy governing the addition of items to a collection.
domain: Collection
range: Policy
Relation: accrualPolicy-003
date: 2010-10-11
date: 2005-06-13
range: Resource
domain: Resource

DCMI Period
Has Version: Period-003
issued: 2000-07-11
Date Modified: 2008-01-14
type: Datatype
comment: The set of time intervals defined by their limits according to the DCMI Period Encoding Scheme.
Relation: Period-003
date: 2008-01-14
date: 2000-07-11
type: Class

membershipClass
type: Property
type: AnnotationProperty
comment: Indicates the class of individuals that are a member of a Group
term status: unstable

DDC
Has Version: DDC-003
issued: 2000-07-11
Date Modified: 2008-01-14
type: VocabularyEncodingScheme
comment: The set of conceptual resources specified by the Dewey Decimal Classification.
Relation: DDC-003
date: 2008-01-14
date: 2000-07-11

Has Part
type: Property
Date Modified: 2008-01-14
issued: 2000-07-11
comment: A related resource that is included either physically or logically in the described resource.
note: This term is intended to be used with non-literal values as defined in the DCMI Abstract Model (http://dublincore.org/documents/abstract-model/). As of December 2007, the DCMI Usage Board is seeking a way to express this intention with a formal range declaration.
sub property of: Relation
Has Version: hasPart-003
Relation: hasPart-003
date: 2008-01-14
date: 2000-07-11

Date
description: Date may be used to express temporal information at any level of granularity. Recommended best practice is to use an encoding scheme, such as the W3CDTF profile of ISO 8601 [W3CDTF].
Has Version: date-006
issued: 1999-07-02
Date Modified: 2008-01-14
type: Property
comment: A point or period of time associated with an event in the lifecycle of the resource.
note: A second property with the same name as this property has been declared in the dcterms: namespace (http://purl.org/dc/terms/). See the Introduction to the document "DCMI Metadata Terms" (http://dublincore.org/documents/dcmi-terms/) for an explanation.
Relation: date-006
date: 2008-01-14
date: 1999-07-02

title
type: Property
type: DatatypeProperty
comment: Title (Mr, Mrs, Ms, Dr. etc)
term status: testing

Accrual Periodicity
Has Version: accrualPeriodicity-003
issued: 2005-06-13
Date Modified: 2010-10-11
type: Property
comment: The frequency with which items are added to a collection.
domain: Collection
range: Frequency
Relation: accrualPeriodicity-003
date: 2010-10-11
date: 2005-06-13
range: Resource
domain: Resource

ISO 639-3
Has Version: ISO639-3-001
issued: 2008-01-14
type: Datatype
comment: The set of three-letter codes listed in ISO 639-3 for the representation of names of languages.
Relation: ISO639-3-001
date: 2008-01-14
type: Class

Rights
description: Typically, rights information includes a statement about various property rights associated with the resource, including intellectual property rights.
Has Version: rights-006
issued: 1999-07-02
Date Modified: 2008-01-14
type: Property
comment: Information about rights held in and over the resource.
note: A second property with the same name as this property has been declared in the dcterms: namespace (http://purl.org/dc/terms/). See the Introduction to the document "DCMI Metadata Terms" (http://dublincore.org/documents/dcmi-terms/) for an explanation.
Relation: rights-006
date: 2008-01-14
date: 1999-07-02

Is Required By
comment: A related resource that requires the described resource to support its function, delivery, or coherence.
type: Property
Date Modified: 2008-01-14
sub property of: Relation
note: This term is intended to be used with non-literal values as defined in the DCMI Abstract Model (http://dublincore.org/documents/abstract-model/). As of December 2007, the DCMI Usage Board is seeking a way to express this intention with a formal range declaration.
Has Version: isRequiredBy-003
issued: 2000-07-11
Relation: isRequiredBy-003
date: 2008-01-14
date: 2000-07-11

birthday
type: Property
type: FunctionalProperty
type: DatatypeProperty
comment: The birthday of this Agent, represented in mm-dd string form, eg. '12-31'.
domain: Agent
range: Literal
term status: unstable
range: Resource
domain: Thing
domain: Resource

sha1sum of a personal mailbox URI name
type: Property
type: InverseFunctionalProperty
type: DatatypeProperty
comment: The sha1sum of the URI of an Internet mailbox associated with exactly one owner, the first owner of the mailbox.
domain: Agent
range: Literal
term status: testing
type: ObjectProperty
range: Resource
domain: Thing
domain: Resource

Description
description: Description may include but is not limited to: an abstract, a table of contents, a graphical representation, or a free-text account of the resource.
Has Version: descriptionT-001
issued: 2008-01-14
Date Modified: 2008-01-14
type: Property
comment: An account of the resource.
sub property of: Description
Relation: descriptionT-001
date: 2008-01-14

nickname
type: Property
type: DatatypeProperty
comment: A short informal nickname characterising an agent (includes login identifiers, IRC and other chat nicknames).
term status: testing

Has Format
issued: 2000-07-11
Date Modified: 2008-01-14
type: Property
comment: A related resource that is substantially the same as the pre-existing described resource, but in another format.
Has Version: hasFormat-003
sub property of: Relation
note: This term is intended to be used with non-literal values as defined in the DCMI Abstract Model (http://dublincore.org/documents/abstract-model/). As of December 2007, the DCMI Usage Board is seeking a way to express this intention with a formal range declaration.
Relation: hasFormat-003
date: 2008-01-14
date: 2000-07-11

v2.3
type: Expression
version info: 2.3
date: 2013-05-24
comment: Refined the voaf:dataset to a more complex element with occurrences information and added extra properties to represent metrics of vocabulary elements usage in LOV and LOD
comment: Remplacement de voaf:dataset par un objet permettant d'attacher la notion d'occurrenceet ajout supplémentaire de propriétés pour représenter les métriques d'usage d'éléments de vocabulaire dans le LOV et le LOD @fr
creator: pierre-yves-vandenbussche
embodiment: voaf v2.3.rdf
maker: pierre-yves-vandenbussche
type: Thing
Contributor: pierre-yves-vandenbussche

Skype ID
type: Property
type: DatatypeProperty
comment: A Skype ID
domain: Agent
range: Literal
sub property of: nickname
term status: testing
range: Resource
domain: Thing
domain: Resource

Date Available
comment: Date (often a range) that the resource became or will become available.
issued: 2000-07-11
Has Version: available-003
sub property of: Date
Date Modified: 2008-01-14
type: Property
range: Literal
Relation: available-003
date: 2008-01-14
date: 2000-07-11
range: Resource

RFC 4646
description: RFC 4646 obsoletes RFC 3066.
Has Version: RFC4646-001
issued: 2008-01-14
type: Datatype
comment: The set of tags constructed according to RFC 4646 for the identification of languages.
Relation: RFC4646-001
date: 2008-01-14
type: Class

Is Replaced By
type: Property
sub property of: Relation
note: This term is intended to be used with non-literal values as defined in the DCMI Abstract Model (http://dublincore.org/documents/abstract-model/). As of December 2007, the DCMI Usage Board is seeking a way to express this intention with a formal range declaration.
Date Modified: 2008-01-14
issued: 2000-07-11
Has Version: isReplacedBy-003
comment: A related resource that supplants, displaces, or supersedes the described resource.
Relation: isReplacedBy-003
date: 2008-01-14
date: 2000-07-11

occurrences in datasets
type: DatatypeProperty
label: occurences dans des datasets @fr
comment: Number of datasets using a resource.
comment: Nombre de jeux de données utilisant une ressource. @fr
range: integer
term status: testing
type: Property
range: decimal
range: Resource

Table Of Contents
Has Version: tableOfContents-003
issued: 2000-07-11
Date Modified: 2008-01-14
type: Property
comment: A list of subunits of the resource.
sub property of: Description
Relation: tableOfContents-003
date: 2008-01-14
date: 2000-07-11

Dublin Core Metadata Element Set, Version 1.1
Date Modified: 2012-06-14
publisher: DCMI
date: 2012-06-14

Title
Has Version: title-006
issued: 1999-07-02
Date Modified: 2008-01-14
type: Property
comment: A name given to the resource.
note: A second property with the same name as this property has been declared in the dcterms: namespace (http://purl.org/dc/terms/). See the Introduction to the document "DCMI Metadata Terms" (http://dublincore.org/documents/dcmi-terms/) for an explanation.
Relation: title-006
date: 2008-01-14
date: 1999-07-02

High Income Nation Use
type: Prohibition
comment: use in a non-developing country

Publisher
Date Modified: 2010-10-11
issued: 2008-01-14
range: Agent
comment: An entity responsible for making the resource available.
Has Version: publisherT-001
type: Property
description: Examples of a Publisher include a person, an organization, or a service.
sub property of: Publisher
Relation: publisherT-001
date: 2010-10-11
date: 2008-01-14
range: Resource
range: Thing

Type
description: Recommended best practice is to use a controlled vocabulary such as the DCMI Type Vocabulary [DCMITYPE]. To describe the file format, physical medium, or dimensions of the resource, use the Format element.
Has Version: type-006
issued: 1999-07-02
Date Modified: 2008-01-14
type: Property
comment: The nature or genre of the resource.
note: A second property with the same name as this property has been declared in the dcterms: namespace (http://purl.org/dc/terms/). See the Introduction to the document "DCMI Metadata Terms" (http://dublincore.org/documents/dcmi-terms/) for an explanation.
Relation: type-006
date: 2008-01-14
date: 1999-07-02

Friend of a Friend (FOAF) vocabulary
type: Ontology
description: The Friend of a Friend (FOAF) RDF vocabulary, described using W3C RDF Schema and the Web Ontology Language.

DCMI Type Vocabulary
Has Version: DCMIType-005
issued: 2000-07-11
Date Modified: 2012-06-14
type: VocabularyEncodingScheme
comment: The set of classes specified by the DCMI Type Vocabulary, used to categorize the nature or genre of the resource.
Relation: DCMIType-005
date: 2012-06-14
date: 2000-07-11

Extent
type: Property
comment: The size or duration of the resource.
issued: 2000-07-11
range: Size or Duration
Has Version: extent-003
Date Modified: 2008-01-14
sub property of: Format
Relation: extent-003
date: 2008-01-14
date: 2000-07-11
range: Media Type or Extent
range: Resource

Accrual Method
Has Version: accrualMethod-003
issued: 2005-06-13
Date Modified: 2010-10-11
type: Property
comment: The method by which items are added to a collection.
domain: Collection
range: Method of Accrual
Relation: accrualMethod-003
date: 2010-10-11
date: 2005-06-13
range: Resource
domain: Resource

References
type: Property
note: This term is intended to be used with non-literal values as defined in the DCMI Abstract Model (http://dublincore.org/documents/abstract-model/). As of December 2007, the DCMI Usage Board is seeking a way to express this intention with a formal range declaration.
issued: 2000-07-11
Date Modified: 2008-01-14
sub property of: Relation
Has Version: references-003
comment: A related resource that is referenced, cited, or otherwise pointed to by the described resource.
Relation: references-003
date: 2008-01-14
date: 2000-07-11

firstName
type: Property
type: DatatypeProperty
comment: The first name of a person.
domain: Person
range: Literal
term status: testing
range: Resource
domain: Agent
domain: Resource
domain: SpatialThing
domain: Thing

Contributor
comment: An entity responsible for making contributions to the resource.
description: Examples of a Contributor include a person, an organization, or a service.
type: Property
Date Modified: 2010-10-11
issued: 2008-01-14
sub property of: Contributor
range: Agent
Has Version: contributorT-001
Relation: contributorT-001
date: 2010-10-11
date: 2008-01-14
range: Resource
range: Thing

Sharing
type: Permission
comment: permits commercial derivatives, but only non-commercial distribution

Date Copyrighted
range: Literal
type: Property
sub property of: Date
comment: Date of copyright.
issued: 2002-07-13
Date Modified: 2008-01-14
Has Version: dateCopyrighted-002
Relation: dateCopyrighted-002
date: 2008-01-14
date: 2002-07-13
range: Resource

Date Issued
range: Literal
sub property of: Date
comment: Date of formal issuance (e.g., publication) of the resource.
Has Version: issued-003
Date Modified: 2008-01-14
type: Property
issued: 2000-07-11
Relation: issued-003
date: 2008-01-14
date: 2000-07-11
range: Resource

Given name
type: Property
type: DatatypeProperty
comment: The given name of some person.
term status: archaic

Is Referenced By
Date Modified: 2008-01-14
issued: 2000-07-11
sub property of: Relation
note: This term is intended to be used with non-literal values as defined in the DCMI Abstract Model (http://dublincore.org/documents/abstract-model/). As of December 2007, the DCMI Usage Board is seeking a way to express this intention with a formal range declaration.
comment: A related resource that references, cites, or otherwise points to the described resource.
type: Property
Has Version: isReferencedBy-003
Relation: isReferencedBy-003
date: 2008-01-14
date: 2000-07-11

familyName
type: Property
type: DatatypeProperty
comment: The family name of some person.
domain: Person
range: Literal
term status: testing
range: Resource
domain: Agent
domain: Resource
domain: SpatialThing
domain: Thing

v1.1
type: Expression
version info: 1.1
date: 2011-11-16
comment: Depreciation of voaf:exampleDataset, replaced by voaf:dataset
comment: Dépréciation de voaf:exampleDataset, remplacé par voaf:dataset @fr
embodiment: voaf v1.1.rdf