Artifact
subclass of: Resource
subclass of: Thing
type: Class
type: DeprecatedClass
comment: This class is deprecated and will be removed from the Provenance Vocabulary in the next revision. prv:Artifact was deprecated in the process of making the Provenance Vocabulary a specialization of W3C's PROV-O. Hence, use prov:Entity (or the more specific prv:Immutable) instead.

Non-Human Agent
subclass of: Thing
subclass of: Resource
type: Class
comment: NonHumanAgent is a general class that represents agents who are not social beings.
disjoint with: Human Agent
subclass of: Agent

Graph Collection
subclass of: Resource
type: Class
comment: An instance of sd:GraphCollection represents a collection of zero or more named graph descriptions. Each named graph description belonging to an sd:GraphCollection MUST be linked with the sd:namedGraph predicate.

http://lodlaundromat.org/.well-known/genid/samples/jena///predicate//68f2f4d3a20f91e8d84e8c5383181feb/d3e700bc1857a8001f8ca87e5b965b3a#3
subclass of: Resource
subclass of: Thing
type: Class
type: Restriction
on property: accessed
max cardinality: 1

Creation Guideline
subclass of: Thing
subclass of: Resource
type: Class
comment: CreationGuideline is a concept that represents a guideline used to guide the execution of a data creation. Examples for creation guidelines are transformation rules, mapping definitions, entailment rules, and database queries.
subclass of: Plan
subclass of: Data Item
subclass of: http://lodlaundromat.org/.well-known/genid/samples/jena///predicate//68f2f4d3a20f91e8d84e8c5383181feb/d3e700bc1857a8001f8ca87e5b965b3a#7
subclass of: InformationRealization
subclass of: http://lodlaundromat.org/.well-known/genid/samples/jena///predicate//68f2f4d3a20f91e8d84e8c5383181feb/d3e700bc1857a8001f8ca87e5b965b3a#4
subclass of: Entity

Version
subclass of: Resource
comment: Información sobre la versión de un release del proyecto. @es
comment: リリースのバーション情報 @jp
comment: Détails sur une version d'une realease d'un projet. @fr
comment: Informace o uvolněné verzi projektu. @cs
type: Class
label: バーション @ja
comment: Version information of a project release.
label: Verze @cs
comment: Versionsinformation eines Projekt Releases. @de
label: Versión @es

technical feature
subclass of: Resource
subclass of: Thing
type: Class
comment: A technical feature of a void:Dataset, such as a supported RDF serialization format.

Data Item
subclass of: Thing
subclass of: http://lodlaundromat.org/.well-known/genid/samples/jena///predicate//68f2f4d3a20f91e8d84e8c5383181feb/d3e700bc1857a8001f8ca87e5b965b3a#4
subclass of: http://lodlaundromat.org/.well-known/genid/samples/jena///predicate//68f2f4d3a20f91e8d84e8c5383181feb/d3e700bc1857a8001f8ca87e5b965b3a#7
subclass of: Resource
type: Class
comment: DataItem is a general concept that represents data items of any kind.
disjoint with: File
subclass of: Entity
subclass of: InformationRealization

Graph
subclass of: Resource
type: Class
comment: An instance of sd:Graph represents the description of an RDF graph.

Named Graph
subclass of: Resource
type: Class
comment: An instance of sd:NamedGraph represents a named graph having a name (via sd:name) and an optional graph description (via sd:graph).

guided by
range: Thing
domain: Thing
type: ObjectProperty
comment: This property refers to a creation guideline which guided the execution of a data creation. Examples for creation guidelines are transformation rules, mapping definitions, entailment rules, and database queries. Notice, all creation guidelines have provenance; we strongly encourage to describe this provenance as well, at least as far as available information permits.
domain: Data Creation
range: Creation Guideline
sub property of: used
type: Property
domain: Resource
range: Resource
range: Data Item
range: Plan
range: Entity
range: InformationRealization
range: http://lodlaundromat.org/.well-known/genid/samples/jena///predicate//68f2f4d3a20f91e8d84e8c5383181feb/d3e700bc1857a8001f8ca87e5b965b3a#4
range: http://lodlaundromat.org/.well-known/genid/samples/jena///predicate//68f2f4d3a20f91e8d84e8c5383181feb/d3e700bc1857a8001f8ca87e5b965b3a#7
domain: Activity

dataset description
subclass of: Resource
subclass of: Thing
type: Class
comment: A web resource whose foaf:primaryTopic or foaf:topics include void:Datasets.
subclass of: Document

Actor
subclass of: Resource
subclass of: Thing
type: Class
type: DeprecatedClass
comment: This class is deprecated and will be removed from the Provenance Vocabulary in the next revision. prv:Actor was deprecated in the process of making the Provenance Vocabulary a specialization of W3C's PROV-O. Hence, use one of the more specific classes prv:HumanAgent and prv:NonHumanAgent instead; or, if such a specialization is unsuitable for the use case at hand, directly use the general class prov:Agent as defined by PROV-O.

Repository
subclass of: Resource
label: Úložiště @cs
comment: ソースコードのリポジトリ @ja
label: リポジトリ @ja
comment: Source code repository.
comment: Dépôt du code source. @fr
label: Dépôt @fr
label: Repositorio @es
comment: Quellcode-Versionierungssystem. @de
type: Class
comment: Úložiště zdrojových kódů. @cs
comment: Repositorio del código fuente. @es

Data Access
subclass of: Thing
subclass of: Resource
type: Class
comment: DataAccess is a concept that represents the completed execution of an activity by which an immutable data item has been retrieved from the Web.
disjoint with: Data Creation
subclass of: http://lodlaundromat.org/.well-known/genid/samples/jena///predicate//68f2f4d3a20f91e8d84e8c5383181feb/d3e700bc1857a8001f8ca87e5b965b3a#2
subclass of: http://lodlaundromat.org/.well-known/genid/samples/jena///predicate//68f2f4d3a20f91e8d84e8c5383181feb/d3e700bc1857a8001f8ca87e5b965b3a#3
subclass of: Activity

GNU Arch repository
subclass of: http://lodlaundromat.org/.well-known/genid/samples/jena///predicate//68f2f4d3a20f91e8d84e8c5383181feb/bf83860cd7dab8f53104c5f50b382094#2
subclass of: Resource
subclass of: Thing
label: GNU Archのリポジトリ @ja
label: Dépôt GNU Arch @fr
type: Class
subclass of: Repository
comment: GNU Arch source code repository.
comment: Úložiště zdrojových kódů GNU Arch. @cs
label: Repositorio GNU Arch @es
comment: Dépôt GNU Arch du code source. @fr
label: Úložiště GNU Arch @cs
comment: ソースコードのGNU Archのリポジトリ @ja
comment: Repositorio GNU Arch del código fuente. @es
comment: GNU Arch Quellcode-Versionierungssystem. @de

involved
range: Thing
domain: Thing
type: ObjectProperty
comment: This property is deprecated and will be removed from the Provenance Vocabulary in the next revision. prv:involvedActor was deprecated in the process of making the Provenance Vocabulary a specialization of W3C's PROV-O. Hence, use prov:wasAssociatedWith instead.
type: DeprecatedProperty
type: Property
range: Resource
domain: Resource

linkset
subclass of: Resource
subclass of: Thing
type: Class
comment: A collection of RDF links between two void:Datasets.
subclass of: dataset

operated by
range: Thing
domain: Thing
type: ObjectProperty
comment: This property refers to a human agent who was operating a non-human agent. For instance, a service provider operates a data providing service (see concept prv:DataProvidingService). Another example is a human agent who operates a non-human data creating agent.
domain: Non-Human Agent
range: Human Agent
sub property of: actedOnBehalfOf
type: Property
domain: Resource
range: Resource
range: Agent
domain: Agent

CVS Repository
subclass of: http://lodlaundromat.org/.well-known/genid/samples/jena///predicate//68f2f4d3a20f91e8d84e8c5383181feb/bf83860cd7dab8f53104c5f50b382094#2
subclass of: Resource
subclass of: Thing
comment: Dépôt CVS du code source. @fr
comment: Úložiště zdrojových kódů CVS. @cs
label: Úložiště CVS @cs
comment: CVS Quellcode-Versionierungssystem. @de
comment: CVS source code repository.
subclass of: Repository
comment: ソースコードのCVSのリポジトリ @ja
label: Dépôt CVS @fr
label: CVSのリポジトリ @ja
comment: Repositorio CVS del código fuente. @es
label: Repositorio CVS @es
type: Class

dataset
subclass of: Resource
subclass of: Thing
type: Class
comment: A set of RDF triples that are published, maintained or aggregated by a single provider.

contained in
range: Thing
domain: Thing
type: ObjectProperty
comment: This property refers to a data item that contained a data item. Hence, this property refers to another data item of a larger granularity (e.g. an RDF triple is usually contained in an RDF graph).
domain: Data Item
range: Data Item
type: Property
range: Resource
range: Entity
range: InformationRealization
range: http://lodlaundromat.org/.well-known/genid/samples/jena///predicate//68f2f4d3a20f91e8d84e8c5383181feb/d3e700bc1857a8001f8ca87e5b965b3a#4
range: http://lodlaundromat.org/.well-known/genid/samples/jena///predicate//68f2f4d3a20f91e8d84e8c5383181feb/d3e700bc1857a8001f8ca87e5b965b3a#7
domain: Resource
domain: http://lodlaundromat.org/.well-known/genid/samples/jena///predicate//68f2f4d3a20f91e8d84e8c5383181feb/d3e700bc1857a8001f8ca87e5b965b3a#7
domain: http://lodlaundromat.org/.well-known/genid/samples/jena///predicate//68f2f4d3a20f91e8d84e8c5383181feb/d3e700bc1857a8001f8ca87e5b965b3a#4
domain: Entity
domain: InformationRealization

Dataset
subclass of: Resource
type: Class
subclass of: Graph Collection
comment: An instance of sd:Dataset represents a RDF Dataset comprised of a default graph and zero or more named graphs.

Entailment Regime
subclass of: Resource
type: Class
subclass of: Feature
comment: An instance of sd:EntailmentRegime represents an entailment regime used in basic graph pattern matching (as described by SPARQL 1.1 Query Language).

accessed
range: Thing
domain: Thing
type: ObjectProperty
comment: This property refers to the service that provided the Web representation during the execution of a data access.
domain: Data Access
range: Data Providing Service
sub property of: wasAssociatedWith
type: Property
domain: Resource
range: Resource
range: Non-Human Agent
range: Agent
domain: http://lodlaundromat.org/.well-known/genid/samples/jena///predicate//68f2f4d3a20f91e8d84e8c5383181feb/d3e700bc1857a8001f8ca87e5b965b3a#2
domain: http://lodlaundromat.org/.well-known/genid/samples/jena///predicate//68f2f4d3a20f91e8d84e8c5383181feb/d3e700bc1857a8001f8ca87e5b965b3a#3
domain: Activity

Entailment Profile
subclass of: Resource
type: Class
subclass of: Feature
comment: An instance of sd:EntailmentProfile represents a profile of an entailment regime. An entailment profile MAY impose restrictions on what constitutes valid RDF with respect to entailment.

Data Publisher
subclass of: Thing
subclass of: Resource
type: Class
comment: DataPublisher is a concept that represents entities such as persons, groups, or organizations who use a data providing service (see concept prv:DataProvidingService) to publish data on the Web.
subclass of: Human Agent
subclass of: Agent

Project
subclass of: Resource
type: Class
label: Proyecto @es
subclass of: Project
comment: プログラミングのプロジェクト @ja
comment: Projekt. @cs
label: Projet @fr
comment: Un proyecto. @es
label: Projekt @cs
comment: Ein Projekt. @de
label: Prijekt @de
comment: Un projet. @fr
comment: A project.
label: プロジェクト @ja

Language
subclass of: Resource
type: Class
subclass of: Feature
comment: An instance of sd:Language represents one of the SPARQL languages, including specific configurations providing particular features or extensions. This document defines three instances of sd:Language: sd:SPARQL10Query, sd:SPARQL11Query, and sd:SPARQL11Update.

yielded by
range: Thing
domain: Thing
type: ObjectProperty
comment: This property is deprecated and will be removed from the Provenance Vocabulary in the next revision. prv:yieldedBy was deprecated in the process of making the Provenance Vocabulary a specialization of W3C's PROV-O. Hence, use prov:wasGeneratedBy instead.
type: DeprecatedProperty
type: Property
range: Resource
domain: Resource

Feature
subclass of: Resource
type: Class
comment: An instance of sd:Feature represents a feature of a SPARQL service. Specific types of features include functions, aggregates, languages, and entailment regimes and profiles. This document defines five instances of sd:Feature: sd:DereferencesURIs, sd:UnionDefaultGraph, sd:RequiresDataset, sd:EmptyGraphs, and sd:BasicFederatedQuery.

completed at
sub property of: endedAtTime
type: FunctionalProperty
comment: This property refers to the time an activity has been completed.
type: DatatypeProperty
equivalent property: endedAtTime
type: Property

Subversion Repository
subclass of: Resource
label: Dépôt Subversion @fr
comment: Subversion source code repository.
subclass of: Repository
label: Úložiště Subversion @cs
comment: Úložiště zdrojových kódů Subversion. @cs
type: Class
comment: Dépôt Subversion du code source. @fr
label: Subversionのリポジトリ @ja
comment: ソースコードのSubversionのリポジトリ @ja
label: Repositorio Subversion @es
comment: Subversion Quellcode-Versionierungssystem. @de
comment: Repositorio Subversion del código fuente. @es

Human Actor
subclass of: Resource
subclass of: Thing
type: Class
type: DeprecatedClass
comment: This class is deprecated and will be removed from the Provenance Vocabulary in the next revision. prv:HumanActor was renamed to prv:HumanAgent in the process of making the Provenance Vocabulary a specialization of W3C's PROV-O. Hence, use prv:HumanAgent instead.

Specification
type: Class
label: 明細書じ @ja
comment: A specification of a system's aspects, technical or otherwise.
comment: あるシステムの詳しく書いた明細書。多分技術的なもの。 @ja
subclass of: Resource

used
range: Thing
domain: Thing
type: ObjectProperty
comment: This property is deprecated and will be removed from the Provenance Vocabulary in the next revision. prv:employedArtifact was deprecated in the process of making the Provenance Vocabulary a specialization of W3C's PROV-O. Hence, use prov:used instead.
type: DeprecatedProperty
type: Property
range: Resource
domain: Resource

Function
subclass of: Resource
type: Class
subclass of: Feature
comment: An instance of sd:Function represents a function that may be used in a SPARQL SELECT expression or a FILTER, HAVING, GROUP BY, ORDER BY, or BIND clause.

Git Repository
subclass of: Resource
label: Dépôt Git @fr
comment: Repositorio Git del código fuente. @es
type: Class
label: Úložiště Git @cs
comment: Dépôt Git du code source. @fr
comment: Úložiště zdrojových kódů Git. @cs
label: Gitのリポジトリ @ja
label: Repositorio Git @es
label: Git repository @de
comment: ソースコードのGitのリポジトリ @ja
subclass of: Repository
comment: Git source code repository.
comment: Git Quellcode-Versionierungssystem. @de

Data Item
subclass of: Thing
subclass of: Resource
type: Class
comment: Immutable is a concept that represents entities which are immutable.
subclass of: Entity

http://lodlaundromat.org/.well-known/genid/samples/jena///predicate//68f2f4d3a20f91e8d84e8c5383181feb/d3e700bc1857a8001f8ca87e5b965b3a#2
subclass of: Resource
subclass of: Thing
type: Class
type: Restriction
on property: accessed
max cardinality: 1

Service
subclass of: Resource
type: Class
comment: An instance of sd:Service represents a SPARQL service made available via the SPARQL Protocol.

accessed
range: Thing
domain: Thing
type: ObjectProperty
comment: This property refers to the Web resource that has been accessed during the execution of a data access. More precisely, the request of the referenced Web resource resulted in retrieving the representation that has been retrieved by the corresponding prv:DataAccess execution.
domain: Data Access
range: WebResource
type: Property
range: Resource
domain: Resource
domain: http://lodlaundromat.org/.well-known/genid/samples/jena///predicate//68f2f4d3a20f91e8d84e8c5383181feb/d3e700bc1857a8001f8ca87e5b965b3a#2
domain: http://lodlaundromat.org/.well-known/genid/samples/jena///predicate//68f2f4d3a20f91e8d84e8c5383181feb/d3e700bc1857a8001f8ca87e5b965b3a#3
domain: Activity

runs
type: Property
range: Thing
domain: Thing
type: ObjectProperty
comment: This property refers to the software that was run by a non-human actor (usually a service).
domain: Non-Human Agent
range: Resource
domain: Agent
domain: Resource

Aggregate
subclass of: Resource
type: Class
subclass of: Feature
comment: An instance of sd:Aggregate represents an aggregate that may be used in a SPARQL aggregate query (for instance in a HAVING clause or SELECT expression) besides the standard list of supported aggregates COUNT, SUM, MIN, MAX, AVG, GROUP_CONCAT, and SAMPLE.

Mercurial Repository
subclass of: Resource
type: Class
label: Mercurialのリポジトリ @ja
comment: Mercurial source code repository.
comment: ソースコードのMercurialのリポジトリ @ja
subclass of: Repository

serialized by
range: Thing
domain: Thing
type: ObjectProperty
comment: This property refers to a file that serialized a data item.
domain: Data Item
range: File
type: Property
range: Resource
range: http://lodlaundromat.org/.well-known/genid/samples/jena///predicate//68f2f4d3a20f91e8d84e8c5383181feb/d3e700bc1857a8001f8ca87e5b965b3a#4
range: Entity
range: http://lodlaundromat.org/.well-known/genid/samples/jena///predicate//68f2f4d3a20f91e8d84e8c5383181feb/d3e700bc1857a8001f8ca87e5b965b3a#7
domain: Resource
domain: http://lodlaundromat.org/.well-known/genid/samples/jena///predicate//68f2f4d3a20f91e8d84e8c5383181feb/d3e700bc1857a8001f8ca87e5b965b3a#7
domain: http://lodlaundromat.org/.well-known/genid/samples/jena///predicate//68f2f4d3a20f91e8d84e8c5383181feb/d3e700bc1857a8001f8ca87e5b965b3a#4
domain: Entity
domain: InformationRealization

Non-Human Actor
subclass of: Resource
subclass of: Thing
type: Class
type: DeprecatedClass
comment: This class is deprecated and will be removed from the Provenance Vocabulary in the next revision. prv:NonHumanActor was renamed to prv:NonHumanAgent in the process of making the Provenance Vocabulary a specialization of W3C's PROV-O. Hence, use prv:NonHumanAgent instead.

Bazaar Branch
subclass of: Resource
type: Class
label: Bazzarのリポジトリ @ja
comment: Bazaar source code branch.
comment: ソースコードのBazzarのリポジトリ @ja
subclass of: Repository

Data Providing Service
subclass of: Thing
subclass of: Resource
type: Class
comment: DataProvidingService is a concept that represents a non-human agent - usually a Web service or a server - that processes data access requests and actually sends the requested Web representations over the Web.
subclass of: Non-Human Agent
subclass of: Agent

retrieved by
range: Thing
domain: Thing
type: ObjectProperty
comment: This property refers to the data access by which an immutable entity has been retrieved from the Web. Each entity that has this property is a Web representation.
type: FunctionalProperty
domain: Data Item
domain: http://lodlaundromat.org/.well-known/genid/samples/jena///predicate//68f2f4d3a20f91e8d84e8c5383181feb/d3e700bc1857a8001f8ca87e5b965b3a#4
range: Data Access
sub property of: wasGeneratedBy
type: Property
domain: Resource
range: Resource
range: Activity
range: http://lodlaundromat.org/.well-known/genid/samples/jena///predicate//68f2f4d3a20f91e8d84e8c5383181feb/d3e700bc1857a8001f8ca87e5b965b3a#2
range: http://lodlaundromat.org/.well-known/genid/samples/jena///predicate//68f2f4d3a20f91e8d84e8c5383181feb/d3e700bc1857a8001f8ca87e5b965b3a#3
domain: Entity

created by
type: Property
range: Thing
domain: Thing
type: ObjectProperty
comment: This property refers to the creation of a data item (or a file that serializes data items).
domain: http://lodlaundromat.org/.well-known/genid/samples/jena///predicate//68f2f4d3a20f91e8d84e8c5383181feb/d3e700bc1857a8001f8ca87e5b965b3a#7
range: Data Creation
sub property of: wasGeneratedBy
property chain axiom: http://lodlaundromat.org/.well-known/genid/samples/jena///predicate//68f2f4d3a20f91e8d84e8c5383181feb/d3e700bc1857a8001f8ca87e5b965b3a#10
domain: Resource
range: Resource
range: Activity

Human Agent
subclass of: Resource
subclass of: Thing
type: Class
comment: HumanAgent is a general class that represents agents who are social beings such as persons, organizations, companies.
disjoint with: Non-Human Agent
subclass of: Agent

used by
range: Thing
domain: Thing
type: ObjectProperty
comment: This property refers to a data publisher who used a data providing services at the time the provenance description refers to.
domain: Data Providing Service
range: Data Publisher
sub property of: actedOnBehalfOf
type: Property
domain: Resource
range: Resource
range: Human Agent
range: Agent
domain: Agent
domain: Non-Human Agent

performed by
type: Property
range: Thing
domain: Thing
type: ObjectProperty
comment: This property refers to an agent that/who performed an activity.
sub property of: wasAssociatedWith
domain: Resource
range: Resource

Execution
subclass of: Resource
subclass of: Thing
type: Class
type: DeprecatedClass
comment: This class is deprecated and will be removed from the Provenance Vocabulary in the next revision. prv:Execution was deprecated in the process of making the Provenance Vocabulary a specialization of W3C's PROV-O. Hence, use prov:Activity instead.

immediately preceded by
range: Thing
domain: Thing
type: ObjectProperty
comment: This property may be used to make the relationship between different version of a data item explicit. More precisely, this property refers to an immediately preceding version of a data item; hence, the new version (i.e. the subject) has been created using the old version (i.e. the object). We strongly encourage to also describe this creation of the new version explicitly.
domain: Data Item
range: Data Item
sub property of: http://lodlaundromat.org/.well-known/genid/samples/jena///predicate//68f2f4d3a20f91e8d84e8c5383181feb/d3e700bc1857a8001f8ca87e5b965b3a#1
sub property of: replaces
type: Property
domain: Resource
range: Resource
range: Entity
range: InformationRealization
range: http://lodlaundromat.org/.well-known/genid/samples/jena///predicate//68f2f4d3a20f91e8d84e8c5383181feb/d3e700bc1857a8001f8ca87e5b965b3a#4
range: http://lodlaundromat.org/.well-known/genid/samples/jena///predicate//68f2f4d3a20f91e8d84e8c5383181feb/d3e700bc1857a8001f8ca87e5b965b3a#7
domain: http://lodlaundromat.org/.well-known/genid/samples/jena///predicate//68f2f4d3a20f91e8d84e8c5383181feb/d3e700bc1857a8001f8ca87e5b965b3a#7
domain: http://lodlaundromat.org/.well-known/genid/samples/jena///predicate//68f2f4d3a20f91e8d84e8c5383181feb/d3e700bc1857a8001f8ca87e5b965b3a#4
domain: Entity
domain: InformationRealization

File
subclass of: http://lodlaundromat.org/.well-known/genid/samples/jena///predicate//68f2f4d3a20f91e8d84e8c5383181feb/d3e700bc1857a8001f8ca87e5b965b3a#4
subclass of: http://lodlaundromat.org/.well-known/genid/samples/jena///predicate//68f2f4d3a20f91e8d84e8c5383181feb/d3e700bc1857a8001f8ca87e5b965b3a#7
subclass of: Resource
subclass of: Thing
type: Class
comment: File is a general class that represents computer files/documents of any kind.
disjoint with: Data Item
subclass of: Entity

BitKeeper Repository
subclass of: http://lodlaundromat.org/.well-known/genid/samples/jena///predicate//68f2f4d3a20f91e8d84e8c5383181feb/bf83860cd7dab8f53104c5f50b382094#2
subclass of: Resource
subclass of: Thing
comment: Dépôt BitKeeper du code source. @fr
label: BitKeeperのリポジトリ @ja
type: Class
comment: Úložiště zdrojových kódů BitKeeper. @cs
label: Dépôt BitKeeper @fr
comment: BitKeeper Quellcode-Versionierungssystem. @de
comment: Repositorio BitKeeper del código fuente. @es
comment: ソースコードのBitKeeperのリポジトリ @ja
label: Úložiště BitKeeper @cs
comment: BitKeeper source code repository.
subclass of: Repository
label: Repositorio BitKeeper @es

Data Creation
subclass of: Thing
subclass of: Resource
type: Class
comment: DataCreation is a concept that represents the execution of an activity by which data items have been created.
disjoint with: Data Access
subclass of: Activity

darcs Repository
subclass of: Resource
label: Dépôt darcs @fr
subclass of: Repository
comment: Dépôt darcs du code source. @fr
comment: Repositorio darcs del código fuente. @es
type: Class
comment: darcs source code repository.
label: darcsのリポジトリ @ja
label: Repositorio darcs @es
comment: ソースコードのdarcsのリポジトリ @ja

used
range: Thing
domain: Thing
type: ObjectProperty
comment: This property refers to a source data item that has been used during the creation of a data item. Examples for source data are the content of a document used for machine learning, the statements in a knowledge base used to entail a new statement, and the entries in a database used to answer a query. Notice, all source data has provenance; we strongly encourage to describe this provenance as well, at least as far as available information permits.
domain: Data Creation
range: Data Item
sub property of: used
type: Property
domain: Resource
range: Resource
range: Entity
range: InformationRealization
range: http://lodlaundromat.org/.well-known/genid/samples/jena///predicate//68f2f4d3a20f91e8d84e8c5383181feb/d3e700bc1857a8001f8ca87e5b965b3a#4
range: http://lodlaundromat.org/.well-known/genid/samples/jena///predicate//68f2f4d3a20f91e8d84e8c5383181feb/d3e700bc1857a8001f8ca87e5b965b3a#7
domain: Activity

revision
comment: Revision identifier of a software release.
comment: Indentificador de la versión de un release de software. @es
label: Version @de
comment: Identifikátor zpřístupněné revize softwaru. @cs
domain: Version
type: Property
label: リビジョンコート @ja
comment: Versionsidentifikator eines Software-Releases. @de
label: révision @fr
label: versión @es
comment: Identifiant de révision d'une release du programme. @fr
comment: このリリースのリビジョン識別子 @ja
range: Literal
label: verze @cs
range: Resource
domain: Resource

default supported entailment profile
type: Property
sub property of: feature
domain: Service
range: Entailment Profile
comment: Relates an instance of sd:Service with a resource representing a supported profile of the default entailment regime (as declared by sd:defaultEntailmentRegime).
domain: Resource
range: Feature
range: Resource

feature
type: Property
domain: Service
range: Feature
comment: Relates an instance of sd:Service with a resource representing a supported feature.
range: Resource
domain: Resource

Description of a Project (DOAP) vocabulary
Rights: Copyright © 2004-2009 Edd Dumbill
description: Slovník Description of a Project (DOAP, Popis projektu), popsaný použitím W3C RDF Schema a Web Ontology Language. @cs
type: Ontology
description: Das Vokabular "Description of a Project (DOAP)", beschrieben durch W3C RDF Schema and the Web Ontology Language. @de
maker: Edd Dumbill
description: Le vocabulaire Description Of A Project (DOAP, Description D'Un Projet), décrit en utilisant RDF Schema du W3C et OWL. @fr
Format: application/rdf+xml
description: El vocabulario Description of a Project (DOAP, Descripción de un Proyecto), descrito usando RDF Schema de W3C y Web Ontology Language. @es
creator: Edd Dumbill
description: The Description of a Project (DOAP) vocabulary, described using W3C RDF Schema and the Web Ontology Language.
imports: index.rdf
description: プロジェクトの説明の語彙(DOAP)。W3C RDF SchemaとWeb Ontology Languageで作られた。 @ja

Publisher
description: Examples of a Publisher include a person, an organization, or a service. Typically, the name of a Publisher should be used to indicate the entity.
has version: publisher-006
issued: 1999-07-02
modified: 2008-01-14
type: Property
comment: An entity responsible for making the resource available.
note: A second property with the same name as this property has been declared in the dcterms: namespace (http://purl.org/dc/terms/). See the Introduction to the document "DCMI Metadata Terms" (http://dublincore.org/documents/dcmi-terms/) for an explanation.

documenter
comment: Proveedor de documentación para el proyecto. @es
type: Property
comment: Collaborateur à la documentation du projet. @fr
comment: このプロジェクトのドキュメントの貢献者 @ja
label: dokumentarista @cs
label: Dokumentator @de
range: Person
label: escritor de ayuda @es
domain: Project
comment: Spoluautor dokumentace projektu. @cs
label: 文章制作者 @ja
comment: Contributor of documentation to the project.
label: rédacteur de l'aide @fr
comment: Mitarbeiter an der Dokumentation eines Projektes. @de
range: Thing
range: Human Agent
range: Resource
range: Agent
domain: Resource

download mirror
label: zrcadlo stránky pro stažení @cs
label: miroir pour le téléchargement @fr
domain: Project
label: ダウンロードミラー @ja
comment: Mirror of software download web page.
comment: Spiegel der Seite von die Projekt-Software heruntergeladen werden kann. @de
type: Property
comment: Zrcadlo stránky pro stažení softwaru. @cs
comment: Miroir de la page de téléchargement du programme. @fr
comment: Mirror de la página web de descarga. @es
label: mirror de descarga @es
label: Spiegel der Seite zum Herunterladen @de
comment: このプロジェクトのダウンロードミラー @ja
domain: Resource

Vocabulary of Interlinked Datasets (VoID)
created: 2010-01-26
preferred namespace uri: http://rdfs.org/ns/void#
preferred namespace prefix: void
type: SemanticAsset
part of: vocab.deri.ie
type: Ontology
creator: Michael Hausenblas
creator: Jun Zhao
description: The Vocabulary of Interlinked Datasets (VoID) is an RDF Schema vocabulary for expressing metadata about RDF datasets. It is intended as a bridge between the publishers and users of RDF data, with applications ranging from data discovery to cataloging and archiving of datasets. This document provides a formal definition of the new RDF classes and properties introduced for VoID. It is a companion to the main specification document for VoID, Describing Linked Datasets with the VoID Vocabulary.
status: UnderDevelopment
publisher: Digital Enterprise Research Institute, NUI Galway
creator: Keith Alexander
creator: Richard Cyganiak
modified: 2011-03-06
type: Thing

homepage
label: page web @fr
sub property of: homepage
label: Homepage @de
label: página web @es
comment: El URL de la página de un proyecto, asociada con exactamente un proyecto. @es
label: ホームページ @ja
comment: URL of a project's homepage, associated with exactly one project.
domain: Project
comment: URL der Projekt-Homepage, verbunden mit genau einem Projekt. @de
comment: このプロジェクトのホームページのURL。このホームページは他のプロジェクトのホームページじゃないこと。 @ja
label: domovská stránka @cs
comment: L'URL de la page web d'un projet, associée avec un unique projet. @fr
type: InverseFunctionalProperty
type: Property
comment: URL adresa domovské stránky projektu asociované s právě jedním projektem. @cs
type: ObjectProperty
domain: Thing
domain: Resource
range: Thing
range: Resource

Coverage
description: Spatial topic and spatial applicability may be a named place or a location specified by its geographic coordinates. Temporal topic may be a named period, date, or date range. A jurisdiction may be a named administrative entity or a geographic place to which the resource applies. Recommended best practice is to use a controlled vocabulary such as the Thesaurus of Geographic Names [TGN]. Where appropriate, named places or time periods can be used in preference to numeric identifiers such as sets of coordinates or date ranges.
has version: coverage-006
issued: 1999-07-02
modified: 2008-01-14
type: Property
comment: The spatial or temporal topic of the resource, the spatial applicability of the resource, or the jurisdiction under which the resource is relevant.
note: A second property with the same name as this property has been declared in the dcterms: namespace (http://purl.org/dc/terms/). See the Introduction to the document "DCMI Metadata Terms" (http://dublincore.org/documents/dcmi-terms/) for an explanation.

helper
type: Property
range: Person
comment: Spoluautor projektu. @cs
label: 貢献者 @ja
comment: Projekt-Mitarbeiter. @de
comment: Collaborateur au projet. @fr
comment: このプロジェクトの貢献者 @ja
label: collaborateur @fr
domain: Project
label: colaborador @es
comment: Project contributor.
label: Helfer @de
label: spoluautor @cs
comment: Colaborador del proyecto. @es
range: Thing
range: Human Agent
range: Resource
range: Agent
domain: Resource

Dereferences URIs
type: Feature
comment: sd:DereferencesURIs, when used as the object of the sd:feature property, indicates that a SPARQL service will dereference URIs used in FROM/FROM NAMED and USING/USING NAMED clauses and use the resulting RDF in the dataset during query evaluation.

screenshots
comment: スクリーンショットのあるウェブページ @ja
domain: Project
label: スクリーンショット @ja
label: snímek obrazovky @cs
comment: Web page with screenshots of project.
type: Property
comment: Página web con capturas de pantalla del proyecto. @es
comment: Page web avec des captures d'écran du projet. @fr
label: Screenshots @de
comment: Webová stránka projektu se snímky obrazovky. @cs
comment: Web-Seite mit Screenshots eines Projektes. @de
label: captures d'écran @fr
label: capturas de pantalla @es
domain: Resource

browse
comment: Webové rozhraní pro prohlížení úložiště. @cs
comment: Web browser interface to repository.
comment: Interface web au dépôt. @fr
label: ウェブのユーザインタフェース @ja
comment: Interface web del repositorio. @es
label: navegar @es
comment: Web-Browser Interface für das Repository. @de
label: visualiser @fr
type: Property
domain: Repository
label: prohlížeč @cs
comment: このリポジトリのウェブのウェブのユーザインタフェース @ja
domain: Resource

language
type: Property
label: 言語 @ja
comment: ISO language code a project has been translated into
comment: このプロジェクトの翻訳された言語のISO言語コート
domain: Project
range: Literal
range: Resource
domain: Resource

wiki
comment: L'URL du Wiki pour la discussion collaborative sur le projet. @fr
comment: このプロジェクトの討論用ウィキ @ja
label: ウィキ @ja
label: Wiki @de
comment: URL of Wiki for collaborative discussion of project.
comment: Wiki-URL für die kollaborative Dikussion eines Projektes. @de
comment: URL adresa wiki projektu pro společné diskuse. @cs
type: Property
domain: Project
comment: URL del Wiki para discusión colaborativa del proyecto. @es
domain: Resource

number of properties
type: Property
type: DatatypeProperty
comment: The total number of distinct properties in a void:Dataset. In other words, the number of distinct resources that occur in the predicate position of triples in the dataset.
domain: dataset
range: integer
range: Resource
range: decimal
domain: Resource
domain: Thing

Target
type: Property
comment: One of the two datasets linked by the Linkset.
domain: linkset
range: dataset
range: Thing
range: Resource
domain: dataset
domain: Thing
domain: Resource

translator
label: traductor @es
range: Person
label: 翻訳者 @ja
type: Property
comment: Proveedor de traducciones al proyecto. @es
comment: Mitarbeiter an den Übersetzungen eines Projektes. @de
domain: Project
label: Übersetzer @de
comment: Contributor of translations to the project.
comment: Collaborateur à la traduction du projet. @fr
label: traducteur @fr
comment: Spoluautor překladu projektu. @cs
comment: このプロジェクトを翻訳する貢献者 @ja
label: překladatel @cs
range: Thing
range: Human Agent
range: Resource
range: Agent
domain: Resource

name
label: nombre @es
type: Property
comment: A name of something.
label: nom @fr
label: Name @de
sub property of: label
range: Literal
comment: El nombre de algo. @es
comment: Der Name von Irgendwas @de
comment: Jméno něčeho. @cs
comment: 何かの名前 @ja
label: 名前 @ja
label: jméno @cs
comment: Le nom de quelque chose. @fr
range: Resource

executed at
type: DeprecatedProperty
comment: This property has been renamed to prv:completedAt. Hence, prv:performedAt is deprecated and will be removed from the Provenance Vocabulary in the next revision.
type: DatatypeProperty
type: Property

class
type: Property
type: FunctionalProperty
comment: The rdfs:Class that is the rdf:type of all entities in a class-based partition.
domain: dataset
range: Class
range: Resource
domain: Resource
domain: Thing

http://lodlaundromat.org/.well-known/genid/68f2f4d3a20f91e8d84e8c5383181feb#3
runs: D2R Server
type: Data Providing Service
type: Non-Human Agent
type: DataCreatingService
comment: This service runs D2R Server.
type: Thing
type: Agent
different from: Edd Dumbill
different from: Michael Hausenblas
different from: Keith Alexander
different from: Richard Cyganiak
different from: Jun Zhao
different from: Olaf Hartig

number of triples
type: Property
type: DatatypeProperty
comment: The total number of triples contained in a void:Dataset.
domain: dataset
range: integer
range: Resource
range: decimal
domain: Resource
domain: Thing

Identifier
description: Recommended best practice is to identify the resource by means of a string conforming to a formal identification system.
has version: identifier-006
issued: 1999-07-02
modified: 2008-01-14
type: Property
comment: An unambiguous reference to the resource within a given context.
note: A second property with the same name as this property has been declared in the dcterms: namespace (http://purl.org/dc/terms/). See the Introduction to the document "DCMI Metadata Terms" (http://dublincore.org/documents/dcmi-terms/) for an explanation.

Language
issued: 1999-07-02
note: A second property with the same name as this property has been declared in the dcterms: namespace (http://purl.org/dc/terms/). See the Introduction to the document "DCMI Metadata Terms" (http://dublincore.org/documents/dcmi-terms/) for an explanation.
has version: language-007
description: Recommended best practice is to use a controlled vocabulary such as RFC 4646 [RFC4646].
type: Property
comment: A language of the resource.
modified: 2008-01-14

SPARQL 1.0 Query
type: Language
comment: sd:SPARQL10Query is an sd:Language representing the SPARQL 1.0 Query language.
type: Feature

property partition
type: Property
comment: A subset of a void:Dataset that contains only the triples of a certain rdf:Property.
domain: dataset
range: dataset
sub property of: has subset
domain: Resource
domain: Thing
range: Resource
range: Thing

Provenance Vocabulary Core Ontology namespace
type: Ontology
description: The Provenance Vocabulary provides classes and properties for describing provenance of Web data. The vocabulary focuses on two main use cases: 1.) It enables consumers of Web data to describe provenance of data retrieved from the Web and of data derived from such Web data. 2.) It enables providers of Web data to publish provenance-related metadata about their data. Notice, the vocabulary is not intended for describing provenance of other kinds of Web content. The Provenance Vocabulary is designed as a Web data specific specialization of the W3C PROV Ontology (PROV-O); classes and properties provided by the vocabulary are domain specific extensions of the more general concepts introduced in PROV-O. As a consequence, any Provenance Vocabulary based description of provenance can be easily interpreted and exchanged according to the W3C PROV family of standards.
created: 2009-08-25T12:00:00Z
modified: 2012-03-14T12:00:00Z
creator: Jun Zhao
creator: Olaf Hartig
type: Thing

SPARQL 1.1 Query
type: Language
comment: sd:SPARQL11Query is an sd:Language representing the SPARQL 1.1 Query language.
type: Feature

input format
type: Property
domain: Service
range: Format
comment: Relates an instance of sd:Service to a format that is supported for parsing RDF input; for example, via a SPARQL 1.1 Update LOAD statement, or when URIs are dereferenced in FROM/FROM NAMED/USING/USING NAMED clauses.
range: Resource
domain: Resource

name
type: Property
domain: Named Graph
comment: Relates a named graph to the name by which it may be referenced in a FROM/FROM NAMED clause. The object of the sd:name property is an IRI.
domain: Resource

category
label: 分類 @ja
comment: Eine Kategorie eines Projektes. @de
comment: Kategorie projektu. @cs
comment: このプロジェクトの分類。 @ja
comment: A category of project.
label: categoría @es
domain: Project
label: kategorie @cs
comment: Una categoría de proyecto. @es
label: Kategorie @de
type: Property
comment: Une catégorie de projet. @fr
label: catégorie @fr
domain: Resource

property feature
type: Property
sub property of: feature
domain: Service
range: Feature
comment: Relates an instance of sd:Service to a resource representing an implemented feature that extends the SPARQL Query or Update language and that is accessed by using the named property.
domain: Resource
range: Resource

created
comment: Erstellungsdatum von Irgendwas, angegeben im YYYY-MM-DD Format, z.B. 2004-04-05. @de
label: erstellt @de
label: vytvořeno @cs
comment: Datum, kdy bylo něco vytvořeno ve formátu RRRR-MM-DD, např. 2004-04-05 @cs
comment: Fecha en la que algo fue creado, en formato AAAA-MM-DD. e.g. 2004-04-05 @es
label: 作成日付 @ja
range: Literal
type: Property
label: creado @es
comment: 何かが作成された日付、AAAA-MM-JJの型、例えば2004-04-05。 @ja
label: créé @fr
comment: Date when something was created, in YYYY-MM-DD form. e.g. 2004-04-05
comment: Date à laquelle a été créé quelque chose, au format AAAA-MM-JJ (par ex. 2004-04-05) @fr
range: Resource

number of documents
type: Property
type: DatatypeProperty
comment: The total number of documents, for datasets that are published as a set of individual documents, such as RDF/XML documents or RDFa-annotated web pages. Non-RDF documents, such as web pages in HTML or images, are usually not included in this count. This property is intended for datasets where the total number of triples or entities is hard to determine. void:triples or void:entities should be preferred where practical.
domain: dataset
range: integer
range: Resource
range: decimal
domain: Resource
domain: Thing

open search description
type: Property
comment: An OpenSearch description document for a free-text search service over a void:Dataset.
domain: dataset
range: Document
range: Thing
range: Resource
domain: Resource
domain: Thing

Subject
description: Typically, the subject will be represented using keywords, key phrases, or classification codes. Recommended best practice is to use a controlled vocabulary.
has version: subject-007
issued: 1999-07-02
modified: 2012-06-14
type: Property
comment: The topic of the resource.
note: A second property with the same name as this property has been declared in the dcterms: namespace (http://purl.org/dc/terms/). See the Introduction to the document "DCMI Metadata Terms" (http://dublincore.org/documents/dcmi-terms/) for an explanation.

vocabulary
type: Property
comment: A vocabulary that is used in the dataset.
domain: dataset
domain: Resource
domain: Thing

developer
comment: プロジェクトのソフトウェアの開発者 @ja
label: Entwickler @de
comment: Vývojář softwaru projektu. @cs
comment: Desarrollador de software para el proyecto. @es
comment: Développeur pour le projet. @fr
label: vývojář @cs
type: Property
comment: Developer of software for the project.
label: développeur @fr
domain: Project
label: 開発者 @ja
range: Person
comment: Software-Entwickler für eine Projekt. @de
label: desarrollador @es
range: Thing
range: Human Agent
range: Resource
range: Agent
domain: Resource

example resource of dataset
type: Property
domain: dataset
range: Resource
domain: Resource
domain: Thing

Jun Zhao
type: Person
type: Thing
type: Human Agent
type: Agent
different from: http://lodlaundromat.org/.well-known/genid/68f2f4d3a20f91e8d84e8c5383181feb#3

named graph
type: Property
domain: Graph Collection
range: Named Graph
comment: Relates an instance of sd:GraphCollection (or its subclass sd:Dataset) to the description of one of its named graphs. The description of such a named graph MUST include the sd:name property and MAY include the sd:graph property.
range: Resource
domain: Resource

graph
type: Property
domain: Named Graph
range: Graph
comment: Relates a named graph to its graph description.
range: Resource
domain: Resource

has an URI look-up endpoint at
type: Property
comment: Defines a simple URI look-up protocol for accessing a dataset.
domain: dataset
domain: Resource
domain: Thing

vendor
type: Property
label: 提供組織 @ja
comment: Vendor organization: commercial, free or otherwise
comment: 提供組織、商業の組織や自由の組織。 @ja
domain: Project
range: Organization
range: Thing
range: Human Agent
range: Resource
range: Agent
domain: Resource

number of entities
type: Property
type: DatatypeProperty
comment: The total number of entities that are described in a void:Dataset.
domain: dataset
range: integer
range: Resource
range: decimal
domain: Resource
domain: Thing

repository
comment: Repositorio del código fuente. @es
type: Property
label: repositorio @es
comment: Source code repository.
comment: Úložiště zdrojových kódů. @cs
label: dépôt @fr
range: Repository
label: Repository @de
label: リポジトリ @ja
comment: このプロジェクトのソースコードのリポジトリ @ja
label: úložiště @cs
domain: Project
comment: Dépôt du code source. @fr
comment: Quellcode-Versionierungssystem. @de
range: Resource
domain: Resource

default dataset description
type: Property
type: InverseFunctionalProperty
domain: Service
range: Dataset
comment: Relates an instance of sd:Service to a description of the default dataset available when no explicit dataset is specified in the query, update request or via protocol parameters.
type: ObjectProperty
range: Resource
range: Graph Collection
domain: Resource

Relation
description: Recommended best practice is to identify the related resource by means of a string conforming to a formal identification system.
has version: relation-006
issued: 1999-07-02
modified: 2008-01-14
type: Property
comment: A related resource.
note: A second property with the same name as this property has been declared in the dcterms: namespace (http://purl.org/dc/terms/). See the Introduction to the document "DCMI Metadata Terms" (http://dublincore.org/documents/dcmi-terms/) for an explanation.

Creator
description: Examples of a Creator include a person, an organization, or a service. Typically, the name of a Creator should be used to indicate the entity.
has version: creator-006
issued: 1999-07-02
modified: 2008-01-14
type: Property
comment: An entity primarily responsible for making the resource.
note: A second property with the same name as this property has been declared in the dcterms: namespace (http://purl.org/dc/terms/). See the Introduction to the document "DCMI Metadata Terms" (http://dublincore.org/documents/dcmi-terms/) for an explanation.

Union Default Graph
type: Feature
comment: sd:UnionDefaultGraph, when used as the object of the sd:feature property, indicates that the default graph of the dataset used during query and update evaluation (when an explicit dataset is not specified) is comprised of the union of all the named graphs in that dataset.

Requires Dataset
type: Feature
comment: sd:RequiresDataset, when used as the object of the sd:feature property, indicates that the SPARQL service requires an explicit dataset declaration (based on either FROM/FROM NAMED clauses in a query, USING/USING NAMED clauses in an update, or the appropriate SPARQL Protocol parameters).

Format
description: Examples of dimensions include size and duration. Recommended best practice is to use a controlled vocabulary such as the list of Internet Media Types [MIME].
has version: format-007
issued: 1999-07-02
modified: 2008-01-14
type: Property
comment: The file format, physical medium, or dimensions of the resource.
note: A second property with the same name as this property has been declared in the dcterms: namespace (http://purl.org/dc/terms/). See the Introduction to the document "DCMI Metadata Terms" (http://dublincore.org/documents/dcmi-terms/) for an explanation.

mailing list
label: lista de correo @es
label: メーリングリスト @ja
type: Property
comment: メーリングリストのホームページやメールアドレス @ja
label: liste de diffusion @fr
comment: Domovská stránka nebo e–mailová adresa e–mailové diskuse. @cs
comment: Page web de la liste de diffusion, ou adresse de courriel. @fr
comment: Homepage der Mailing Liste oder E-Mail Adresse. @de
comment: Mailing list home page or email address.
label: Mailing Liste @de
label: e–mailová diskuse @cs
comment: Página web de la lista de correo o dirección de correo. @es
domain: Project
domain: Resource

old homepage
label: stará domovská stránka @cs
label: 前のホームページ @ja
type: InverseFunctionalProperty
sub property of: homepage
label: ancienne page web @fr
domain: Project
type: Property
comment: URL adresa předešlé domovské stránky projektu asociované s právě jedním projektem. @cs
comment: URL of a project's past homepage, associated with exactly one project.
label: Alte Homepage @de
comment: L'URL d'une ancienne page web d'un projet, associée avec un unique projet. @fr
comment: URL der letzten Projekt-Homepage, verbunden mit genau einem Projekt. @de
comment: El URL de la antigua página de un proyecto, asociada con exactamente un proyecto. @es
comment: このプロジェクトの前のホームページ。他のプロジェクトの前のホームページじゃないこと。 @ja
label: página web antigua @es
type: ObjectProperty
domain: Thing
domain: Resource
range: Thing
range: Resource

in dataset
type: Property
comment: Points to the void:Dataset that a document is a part of.
domain: Document
range: dataset
range: Thing
range: Resource
domain: Thing
domain: Resource

feature
type: Property
domain: dataset
range: technical feature
range: Thing
range: Resource
domain: Resource
domain: Thing

extension aggregate
type: Property
sub property of: feature
domain: Service
range: Aggregate
comment: Relates an instance of sd:Service to an aggregate that may be used in a SPARQL aggregate query (for instance in a HAVING clause or SELECT expression) besides the standard list of supported aggregates COUNT, SUM, MIN, MAX, AVG, GROUP_CONCAT, and SAMPLE
domain: Resource
range: Feature
range: Resource

Subjects Target
type: Property
type: FunctionalProperty
comment: The dataset describing the subjects of triples contained in the Linkset.
domain: linkset
range: dataset
sub property of: Target
domain: Resource
domain: Thing
domain: dataset
range: Resource
range: Thing

Empty Graphs
type: Feature
comment: sd:EmptyGraphs, when used as the object of the sd:feature property, indicates that the underlying graph store supports empty graphs. A graph store that supports empty graphs MUST NOT remove graphs that are left empty after triples are removed from them.

root resource
type: Property
comment: A top concept or entry point for a void:Dataset that is structured in a tree-like fashion. All resources in a dataset can be reached by following links from its root resources in a small number of steps.
domain: dataset
domain: Resource
domain: Thing

blog
type: Property
label: ブログ @ja
comment: URI of a blog related to a project
comment: このプロジェクトに関するブログのURI @ja
domain: Project
range: Resource
domain: Resource

Source
description: The described resource may be derived from the related resource in whole or in part. Recommended best practice is to identify the related resource by means of a string conforming to a formal identification system.
has version: source-006
issued: 1999-07-02
modified: 2008-01-14
type: Property
comment: A related resource from which the described resource is derived.
note: A second property with the same name as this property has been declared in the dcterms: namespace (http://purl.org/dc/terms/). See the Introduction to the document "DCMI Metadata Terms" (http://dublincore.org/documents/dcmi-terms/) for an explanation.

Description
description: Description may include but is not limited to: an abstract, a table of contents, a graphical representation, or a free-text account of the resource.
has version: description-006
issued: 1999-07-02
modified: 2008-01-14
type: Property
comment: An account of the resource.
note: A second property with the same name as this property has been declared in the dcterms: namespace (http://purl.org/dc/terms/). See the Introduction to the document "DCMI Metadata Terms" (http://dublincore.org/documents/dcmi-terms/) for an explanation.

property
type: Property
type: FunctionalProperty
comment: The rdf:Property that is the predicate of all triples in a property-based partition.
domain: dataset
range: Property
range: Resource
domain: Resource
domain: Thing

available graph descriptions
type: Property
domain: Service
range: Graph Collection
comment: Relates an instance of sd:Service to a description of the graphs which are allowed in the construction of a dataset either via the SPARQL Protocol, with FROM/FROM NAMED clauses in a query, or with USING/USING NAMED in an update request, if the service limits the scope of dataset construction.
range: Resource
domain: Resource

SPARQL 1.1 Update
type: Language
comment: sd:SPARQLUpdate is an sd:Language representing the SPARQL 1.1 Update language.
type: Feature

a link predicate
type: Property
domain: linkset
range: Property
range: Resource
domain: dataset
domain: Thing
domain: Resource

result format
type: Property
domain: Service
range: Format
comment: Relates an instance of sd:Service to a format that is supported for serializing query results.
range: Resource
domain: Resource

Talis
type: Agent
member: Keith Alexander
type: Thing

Data Dump
type: Property
comment: An RDF dump, partial or complete, of a void:Dataset.
domain: dataset
range: Resource
domain: Resource
domain: Thing

Digital Enterprise Research Institute, NUI Galway
type: Agent
member: Richard Cyganiak
type: Thing

Basic Federated Query
type: Feature
comment: sd:BasicFederatedQuery, when used as the object of the sd:feature property, indicates that the SPARQL service supports basic federated query using the SERVICE keyword as defined by SPARQL 1.1 Federation Extensions.

distinct objects
type: Property
type: DatatypeProperty
comment: The total number of distinct objects in a void:Dataset. In other words, the number of distinct resources that occur in the object position of triples in the dataset. Literals are included in this count.
domain: dataset
range: integer
range: Resource
range: decimal
domain: Resource
domain: Thing

D2R Server
homepage: http://d2rq.org/d2r-server
name: D2R Server
release: http://lodlaundromat.org/.well-known/genid/68f2f4d3a20f91e8d84e8c5383181feb#5
type: Project
type: Thing

operating system
label: operační systém @cs
comment: Système d'exploitation auquel est limité le projet. Omettez cette propriété si le projet n'est pas limité à un système d'exploitation. @fr
type: Property
comment: Sistema opertivo al cuál está limitado el proyecto. Omita esta propiedad si el proyecto no es específico de un sistema opertaivo en particular. @es
label: système d'exploitation @fr
comment: Betriebssystem auf dem das Projekt eingesetzt werden kann. Diese Eigenschaft kann ausgelassen werden, wenn das Projekt nicht BS-spezifisch ist. @de
range: Literal
label: Betriebssystem @de
comment: このプロジェクトの限られたオペレーティングシステム。もし、プロジェクトはどのOSも大丈夫なら、このプロパティを書き落としていい。 @ja
label: sistema operativo @es
comment: Operační systém, na jehož použití je projekt limitován. Vynechejte tuto vlastnost, pokud je projekt nezávislý na operačním systému. @cs
domain: Project
comment: Operating system that a project is limited to. Omit this property if the project is not OS-specific.
label: オペレーティングシステム @ja
domain: Version
range: Resource
domain: Resource

endpoint
type: Property
type: InverseFunctionalProperty
domain: Service
comment: The SPARQL endpoint of an sd:Service that implements the SPARQL Protocol service. The object of the sd:endpoint property is an IRI.
type: ObjectProperty
domain: Resource

has URI regular expression pattern
type: Property
comment: Defines a regular expression pattern matching URIs in the dataset.
domain: dataset
domain: Resource
domain: Thing

license
comment: L'URI d'une description RDF de la licence sous laquelle le programme est distribué. @fr
type: Property
comment: El URI de una descripción RDF de la licencia bajo la cuál se distribuye el software. @es
comment: Die URI einer RDF-Beschreibung einer Lizenz unter der die Software herausgegeben wird. @de
label: Lizenz @de
comment: URI adresa RDF popisu licence, pod kterou je software distribuován. @cs
comment: このプロジェクトの散布ライセンスのRDF説明のURI @ja
label: licence @fr
label: licencia @es
comment: The URI of an RDF description of the license the software is distributed under.
label: ライセンス @ja

Olaf Hartig
type: Person
type: Thing
type: Human Agent
type: Agent
different from: http://lodlaundromat.org/.well-known/genid/68f2f4d3a20f91e8d84e8c5383181feb#3

Edd Dumbill
type: Person
type: Thing
type: Human Agent
type: Agent
different from: http://lodlaundromat.org/.well-known/genid/68f2f4d3a20f91e8d84e8c5383181feb#3

distinct subjects
type: Property
type: DatatypeProperty
comment: The total number of distinct subjects in a void:Dataset. In other words, the number of distinct resources that occur in the subject position of triples in the dataset.
domain: dataset
range: integer
range: Resource
range: decimal
domain: Resource
domain: Thing

Keith Alexander
type: Person
type: Thing
type: Human Agent
type: Agent
different from: http://lodlaundromat.org/.well-known/genid/68f2f4d3a20f91e8d84e8c5383181feb#3

Implements specification
type: Property
label: 実装した明細書 @ja
comment: A specification that a project implements. Could be a standard, API or legally defined level of conformance.
comment: このプロジェクトが実装したシステムの明細書。標準やAPIや明細書のようなもの。 @ja
domain: Project
range: Specification
range: Resource
domain: Resource

short description
label: Kurzbeschreibung @de
comment: Descripción corta (8 o 9 palabras) en texto plano de un proyecto. @es
comment: Short (8 or 9 words) plain text description of a project.
type: Property
label: description courte @fr
label: 簡単な説明 @ja
range: Literal
comment: Krátký (8 nebo 9 slov) čistě textový popis projektu. @cs
comment: 日本語の二十文字ぐらいの説明 @ja
label: descripción corta @es
comment: Kurzbeschreibung (8 oder 9 Wörter) eines Projects als einfacher Text. @de
comment: Texte descriptif concis (8 ou 9 mots) d'un projet. @fr
label: krátký popis @cs
range: Resource

Contributor
description: Examples of a Contributor include a person, an organization, or a service. Typically, the name of a Contributor should be used to indicate the entity.
has version: contributor-006
issued: 1999-07-02
modified: 2008-01-14
type: Property
comment: An entity responsible for making contributions to the resource.
note: A second property with the same name as this property has been declared in the dcterms: namespace (http://purl.org/dc/terms/). See the Introduction to the document "DCMI Metadata Terms" (http://dublincore.org/documents/dcmi-terms/) for an explanation.

Department of Zoology, University of Oxford
type: Agent
member: Jun Zhao
type: Thing

has subset
type: Property
domain: dataset
range: dataset
range: Thing
range: Resource
domain: Resource
domain: Thing

Michael Hausenblas
type: Person
type: Thing
type: Human Agent
type: Agent
different from: http://lodlaundromat.org/.well-known/genid/68f2f4d3a20f91e8d84e8c5383181feb#3

Document that defines the core ontology of the Provenance Vocabulary
type: Document
alternate: ns.rdf
primary topic: Provenance Vocabulary Core Ontology namespace
description: This documents specifies the Provenance Vocabulary Core Ontology which defines the main classes and properties provided by the Provenance Vocabulary.
assurance: Detached signature
title: Provenance Vocabulary Core Ontology Specification
license: http://creativecommons.org/licenses/by/1.0/
conforms to: rdfa-syntax
type: Thing

description
comment: Čistě textový, 2 až 4 věty dlouhý popis projektu. @cs
label: descripción @es
comment: Texte descriptif d'un projet, long de 2 à 4 phrases. @fr
comment: プロジェクトの文の説明、2から4までの行数。 @ja
comment: Descripción en texto plano de un proyecto, de 2 a 4 enunciados de longitud. @es
label: popis @cs
range: Literal
type: Property
comment: Beschreibung eines Projekts als einfacher Text mit der Länge von 2 bis 4 Sätzen. @de
comment: Plain text description of a project, of 2-4 sentences in length.
label: Beschreibung @de
label: 説明 @ja
range: Resource

Date
description: Date may be used to express temporal information at any level of granularity. Recommended best practice is to use an encoding scheme, such as the W3CDTF profile of ISO 8601 [W3CDTF].
has version: date-006
issued: 1999-07-02
modified: 2008-01-14
type: Property
comment: A point or period of time associated with an event in the lifecycle of the resource.
note: A second property with the same name as this property has been declared in the dcterms: namespace (http://purl.org/dc/terms/). See the Introduction to the document "DCMI Metadata Terms" (http://dublincore.org/documents/dcmi-terms/) for an explanation.

programming language
comment: Programming language a project is implemented in or intended for use with.
range: Literal
comment: Lenguaje de programación en el que un proyecto es implementado o con el cuál pretende usarse. @es
comment: Programmiersprache in der ein Projekt implementiert ist oder intendiert wird zu benutzen. @de
comment: Langage de programmation avec lequel un projet est implémenté, ou avec lequel il est prévu de l'utiliser. @fr
comment: このプログラミングの実装のプログラミング言語、または目指した言語。 @ja
label: programovací jazyk @cs
comment: Programovací jazyk, ve kterém je projekt implementován nebo pro který je zamýšlen k použití. @cs
label: langage de programmation @fr
label: プログラミング言語 @ja
type: Property
label: lenguaje de programación @es
label: Programmiersprache @de
domain: Project
range: Resource
domain: Resource

release
comment: Une release (révision) d'un projet. @fr
comment: Un release (versión) de un proyecto. @es
comment: A project release.
label: Release @de
comment: Relase (verze) projektu. @cs
comment: Ein Release (Version) eines Projekts. @de
comment: このプロジェクトのリリース @ja
range: Version
type: Property
domain: Project
label: リリース @ja
range: Resource
domain: Resource

repository location
comment: このリポジトリの場所。 @ja
label: umístění úložiště @cs
comment: Lokation eines Repositorys. @de
label: lugar del respositorio @es
type: Property
comment: Location of a repository.
domain: Repository
label: emplacement du dépôt @fr
comment: lugar de un repositorio. @es
label: Repository Lokation @de
comment: Emplacement d'un dépôt. @fr
label: このリポジトリのURL @ja
comment: Umístění úložiště. @cs
domain: Resource

Rights
description: Typically, rights information includes a statement about various property rights associated with the resource, including intellectual property rights.
has version: rights-006
issued: 1999-07-02
modified: 2008-01-14
type: Property
comment: Information about rights held in and over the resource.
note: A second property with the same name as this property has been declared in the dcterms: namespace (http://purl.org/dc/terms/). See the Introduction to the document "DCMI Metadata Terms" (http://dublincore.org/documents/dcmi-terms/) for an explanation.

Jun Zhao
type: Person
type: Thing
type: Human Agent
type: Agent
different from: http://lodlaundromat.org/.well-known/genid/68f2f4d3a20f91e8d84e8c5383181feb#3

dataset
property partition: http://lodlaundromat.org/.well-known/genid/68f2f4d3a20f91e8d84e8c5383181feb#19
property partition: http://lodlaundromat.org/.well-known/genid/68f2f4d3a20f91e8d84e8c5383181feb#30
root resource: Observation outputValues
date: 2015-02-20T08:27:15.396Z
property partition: http://lodlaundromat.org/.well-known/genid/68f2f4d3a20f91e8d84e8c5383181feb#25
vocabulary: DUL.owl#
class partition: http://lodlaundromat.org/.well-known/genid/68f2f4d3a20f91e8d84e8c5383181feb#8
root resource: Observations
class partition: http://lodlaundromat.org/.well-known/genid/68f2f4d3a20f91e8d84e8c5383181feb#9
feature: N3
vocabulary: wgs84 pos#
property partition: http://lodlaundromat.org/.well-known/genid/68f2f4d3a20f91e8d84e8c5383181feb#22
property partition: http://lodlaundromat.org/.well-known/genid/68f2f4d3a20f91e8d84e8c5383181feb#14
class partition: http://lodlaundromat.org/.well-known/genid/68f2f4d3a20f91e8d84e8c5383181feb#10
property partition: http://lodlaundromat.org/.well-known/genid/68f2f4d3a20f91e8d84e8c5383181feb#23
property partition: http://lodlaundromat.org/.well-known/genid/68f2f4d3a20f91e8d84e8c5383181feb#29
class partition: http://lodlaundromat.org/.well-known/genid/68f2f4d3a20f91e8d84e8c5383181feb#6
root resource: Stations
created by: http://lodlaundromat.org/.well-known/genid/68f2f4d3a20f91e8d84e8c5383181feb#2
vocabulary: Dublin Core Metadata Element Set, Version 1.1
property partition: http://lodlaundromat.org/.well-known/genid/68f2f4d3a20f91e8d84e8c5383181feb#26
property partition: http://lodlaundromat.org/.well-known/genid/68f2f4d3a20f91e8d84e8c5383181feb#11
URI space: http://helheim.deusto.es/bizkaisense/resource/
type: Data Item
property partition: http://lodlaundromat.org/.well-known/genid/68f2f4d3a20f91e8d84e8c5383181feb#27
property partition: http://lodlaundromat.org/.well-known/genid/68f2f4d3a20f91e8d84e8c5383181feb#12
root resource: Observation sensorOutputs
feature: Turtle
root resource: Station points
vocabulary: ssn#
class partition: http://lodlaundromat.org/.well-known/genid/68f2f4d3a20f91e8d84e8c5383181feb#7
property partition: http://lodlaundromat.org/.well-known/genid/68f2f4d3a20f91e8d84e8c5383181feb#15
property partition: http://lodlaundromat.org/.well-known/genid/68f2f4d3a20f91e8d84e8c5383181feb#18
has a SPARQL endpoint at: sparql
property partition: http://lodlaundromat.org/.well-known/genid/68f2f4d3a20f91e8d84e8c5383181feb#20
type: Graph
property partition: http://lodlaundromat.org/.well-known/genid/68f2f4d3a20f91e8d84e8c5383181feb#16
property partition: http://lodlaundromat.org/.well-known/genid/68f2f4d3a20f91e8d84e8c5383181feb#24
vocabulary: rdf-schema#
property partition: http://lodlaundromat.org/.well-known/genid/68f2f4d3a20f91e8d84e8c5383181feb#28
property partition: http://lodlaundromat.org/.well-known/genid/68f2f4d3a20f91e8d84e8c5383181feb#13
vocabulary: location#
property partition: http://lodlaundromat.org/.well-known/genid/68f2f4d3a20f91e8d84e8c5383181feb#21
feature: RDF XML
property partition: http://lodlaundromat.org/.well-known/genid/68f2f4d3a20f91e8d84e8c5383181feb#17
was generated by: http://lodlaundromat.org/.well-known/genid/68f2f4d3a20f91e8d84e8c5383181feb#2
type: http://lodlaundromat.org/.well-known/genid/samples/jena///predicate//68f2f4d3a20f91e8d84e8c5383181feb/d3e700bc1857a8001f8ca87e5b965b3a#7
type: Thing
has subset: http://lodlaundromat.org/.well-known/genid/68f2f4d3a20f91e8d84e8c5383181feb#7
has subset: http://lodlaundromat.org/.well-known/genid/68f2f4d3a20f91e8d84e8c5383181feb#6
has subset: http://lodlaundromat.org/.well-known/genid/68f2f4d3a20f91e8d84e8c5383181feb#10
has subset: http://lodlaundromat.org/.well-known/genid/68f2f4d3a20f91e8d84e8c5383181feb#9
has subset: http://lodlaundromat.org/.well-known/genid/68f2f4d3a20f91e8d84e8c5383181feb#8
has subset: http://lodlaundromat.org/.well-known/genid/68f2f4d3a20f91e8d84e8c5383181feb#27
has subset: http://lodlaundromat.org/.well-known/genid/68f2f4d3a20f91e8d84e8c5383181feb#29
has subset: http://lodlaundromat.org/.well-known/genid/68f2f4d3a20f91e8d84e8c5383181feb#23
has subset: http://lodlaundromat.org/.well-known/genid/68f2f4d3a20f91e8d84e8c5383181feb#19
has subset: http://lodlaundromat.org/.well-known/genid/68f2f4d3a20f91e8d84e8c5383181feb#16
has subset: http://lodlaundromat.org/.well-known/genid/68f2f4d3a20f91e8d84e8c5383181feb#25
has subset: http://lodlaundromat.org/.well-known/genid/68f2f4d3a20f91e8d84e8c5383181feb#12
has subset: http://lodlaundromat.org/.well-known/genid/68f2f4d3a20f91e8d84e8c5383181feb#21
has subset: http://lodlaundromat.org/.well-known/genid/68f2f4d3a20f91e8d84e8c5383181feb#28
has subset: http://lodlaundromat.org/.well-known/genid/68f2f4d3a20f91e8d84e8c5383181feb#14
has subset: http://lodlaundromat.org/.well-known/genid/68f2f4d3a20f91e8d84e8c5383181feb#24
has subset: http://lodlaundromat.org/.well-known/genid/68f2f4d3a20f91e8d84e8c5383181feb#26
has subset: http://lodlaundromat.org/.well-known/genid/68f2f4d3a20f91e8d84e8c5383181feb#17
has subset: http://lodlaundromat.org/.well-known/genid/68f2f4d3a20f91e8d84e8c5383181feb#13
has subset: http://lodlaundromat.org/.well-known/genid/68f2f4d3a20f91e8d84e8c5383181feb#22
has subset: http://lodlaundromat.org/.well-known/genid/68f2f4d3a20f91e8d84e8c5383181feb#15
has subset: http://lodlaundromat.org/.well-known/genid/68f2f4d3a20f91e8d84e8c5383181feb#18
has subset: http://lodlaundromat.org/.well-known/genid/68f2f4d3a20f91e8d84e8c5383181feb#11
has subset: http://lodlaundromat.org/.well-known/genid/68f2f4d3a20f91e8d84e8c5383181feb#30
has subset: http://lodlaundromat.org/.well-known/genid/68f2f4d3a20f91e8d84e8c5383181feb#20
type: InformationRealization
type: Entity
type: http://lodlaundromat.org/.well-known/genid/samples/jena///predicate//68f2f4d3a20f91e8d84e8c5383181feb/d3e700bc1857a8001f8ca87e5b965b3a#4

Detached signature
type: Endorsement
endorser: pubkey2011
type: Thing

file-release
type: Property
label: soubor revize @cs
label: ファイル @ja
comment: URI of download associated with this release.
comment: URI adresa stažení asociované s revizí. @cs
label: このリリースのダウンロードできるファイルのURI @ja
domain: Version
domain: Resource

service endpoint
type: Property
label: サービスサイト @ja
comment: The URI of a web service endpoint where software as a service may be accessed
comment: ことプロジェクトが提供したサーブスを載せるサイト。 @ja
domain: Project
range: Resource
domain: Resource

URI space
type: Property
type: DatatypeProperty
comment: A URI that is a common string prefix of all the entity URIs in a void:Dataset.
domain: dataset
range: Literal
range: Resource
domain: Resource
domain: Thing

has a SPARQL endpoint at
type: Property
domain: dataset
domain: Resource
domain: Thing

Objects Target
type: Property
type: FunctionalProperty
comment: The dataset describing the objects of the triples contained in the Linkset.
domain: linkset
range: dataset
sub property of: Target
domain: Resource
domain: Thing
domain: dataset
range: Resource
range: Thing

bug database
label: databáze chyb @cs
label: suivi des bugs @fr
label: Fehlerdatenbank @de
label: バグページ @ja
comment: Suivi des bugs pour un projet. @fr
comment: Bug tracker for a project.
comment: Fehlerdatenbank eines Projektes. @de
comment: Bug tracker para un proyecto. @es
comment: このプロジェクのバグ管理ページ @ja
type: Property
domain: Project
label: base de datos de bugs @es
comment: Správa chyb projektu. @cs
domain: Resource

download page
label: stránka pro stažení @cs
comment: Web-Seite von der die Projekt-Software heruntergeladen werden kann. @de
label: ダウンロードページ @ja
label: page de téléchargement @fr
label: Seite zum Herunterladen @de
comment: Webová stránka, na které lze stáhnout projektový software. @cs
comment: Web page from which the project software can be downloaded.
domain: Project
comment: Page web à partir de laquelle on peut télécharger le programme. @fr
comment: このプロジェクトのダウンロードできるウェブページ @ja
type: Property
comment: Página web de la cuál se puede bajar el software. @es
label: página de descarga @es
domain: Resource

language extension
type: Property
sub property of: feature
domain: Service
range: Feature
comment: Relates an instance of sd:Service to a resource representing an implemented extension to the SPARQL Query or Update language.
domain: Resource
range: Resource

LiDRC
type: Agent
member: Michael Hausenblas
type: Thing

class partition
type: Property
comment: A subset of a void:Dataset that contains only the entities of a certain rdfs:Class.
domain: dataset
range: dataset
sub property of: has subset
domain: Resource
domain: Thing
range: Resource
range: Thing

anonymous root
comment: Repository für anonymen Zugriff @de
label: raíz anónima @es
label: anonymní kořen @cs
comment: Repositorio para acceso anónimo. @es
comment: Úložiště pro anonymní přístup. @cs
comment: Dépôt pour accès anonyme. @fr
range: Literal
domain: Repository
type: Property
label: 匿名ルート @ja
label: racine anonyme @fr
label: Anonymes Root @de
comment: 匿名でアクセスできるパス @ja
comment: Repository for anonymous access.
range: Resource
domain: Resource

tester
label: testeur @fr
comment: このプロジェクトのため、試験をする人や品質メンテナー。
label: Tester @de
range: Person
domain: Project
label: 試験者 @ja
comment: Tester nebo jiný spoluautor kontrolující kvalitu. @cs
comment: Un testeur ou un collaborateur au contrôle qualité. @fr
comment: Ein Tester oder anderer Mitarbeiter der Qualitätskontrolle. @de
comment: A tester or other quality control contributor.
type: Property
comment: Un tester u otro proveedor de control de calidad. @es
range: Thing
range: Human Agent
range: Resource
range: Agent
domain: Resource

supported entailment profile
type: Property
domain: Named Graph
range: Entailment Profile
comment: Relates a named graph description with a resource representing a supported profile of the entailment regime (as declared by sd:entailmentRegime) used for basic graph pattern matching over that graph.
range: Resource
range: Feature
domain: Resource

module
type: Property
comment: このリポジトリのモジュール名前 @ja
label: モジュール名前 @ja
label: modul @cs
label: Modul @de
domain: http://lodlaundromat.org/.well-known/genid/samples/jena///predicate//68f2f4d3a20f91e8d84e8c5383181feb/bf83860cd7dab8f53104c5f50b382094#2
label: módulo @es
comment: Jméno modulu v úložišti. @cs
comment: Nom du module d'un dépôt. @fr
comment: Nombre del módulo de un repositorio. @es
comment: Module name of a repository.
comment: Modul-Name eines Subversion. @de
domain: Resource
domain: Thing

Dublin Core Metadata Element Set, Version 1.1
modified: 2012-06-14
publisher: DCMI

Title
has version: title-006
issued: 1999-07-02
modified: 2008-01-14
type: Property
comment: A name given to the resource.
note: A second property with the same name as this property has been declared in the dcterms: namespace (http://purl.org/dc/terms/). See the Introduction to the document "DCMI Metadata Terms" (http://dublincore.org/documents/dcmi-terms/) for an explanation.

audience
type: Property
label: 目指したユーザ @ja
comment: Description of target user base
comment: 目指したユーザたちの説明 @ja
domain: Project
range: Literal
range: Resource
domain: Resource

platform
type: Property
label: プラットフォーム @ja
comment: Indicator of software platform (non-OS specific), e.g. Java, Firefox, ECMA CLR
comment: このプロジェクトの必要なプラットフォーム（OSに関係ない）。例えば：Java、Firefox、ECMA CLRとか。 @ja
domain: Project
domain: Version
range: Literal
range: Resource
domain: Resource

Type
description: Recommended best practice is to use a controlled vocabulary such as the DCMI Type Vocabulary [DCMITYPE]. To describe the file format, physical medium, or dimensions of the resource, use the Format element.
has version: type-006
issued: 1999-07-02
modified: 2008-01-14
type: Property
comment: The nature or genre of the resource.
note: A second property with the same name as this property has been declared in the dcterms: namespace (http://purl.org/dc/terms/). See the Introduction to the document "DCMI Metadata Terms" (http://dublincore.org/documents/dcmi-terms/) for an explanation.

entailment regime
type: Property
domain: Named Graph
range: Entailment Regime
comment: Relates a named graph description with a resource representing an entailment regime used for basic graph pattern matching over that graph.
range: Feature
range: Resource
domain: Resource

classes
type: Property
type: DatatypeProperty
comment: The total number of distinct classes in a void:Dataset. In other words, the number of distinct resources occuring as objects of rdf:type triples in the dataset.
domain: dataset
range: integer
range: Resource
range: decimal
domain: Resource
domain: Thing

maintainer
comment: Správce projektu, vedoucí projektu. @cs
type: Property
comment: Développeur principal d'un projet, un meneur du projet. @fr
comment: このプロジェクトのメンテなー及びリーダ。 @ja
label: Projektverantwortlicher @de
label: メンテナー @ja
range: Person
comment: Hauptentwickler eines Projektes, der Projektleiter @de
comment: Desarrollador principal de un proyecto, un líder de proyecto. @es
label: développeur principal @fr
domain: Project
label: správce @cs
label: desarrollador principal @es
comment: Maintainer of a project, a project leader.
range: Thing
range: Human Agent
range: Resource
range: Agent
domain: Resource

default entailment regime
type: Property
sub property of: feature
domain: Service
range: Entailment Regime
comment: Relates an instance of sd:Service with a resource representing an entailment regime used for basic graph pattern matching. This property is intended for use when a single entailment regime by default applies to all graphs in the default dataset of the service. In situations where a different entailment regime applies to a specific graph in the dataset, the sd:entailmentRegime property should be used to indicate this fact in the description of that graph.
domain: Resource
range: Feature
range: Resource

http://lodlaundromat.org/.well-known/genid/68f2f4d3a20f91e8d84e8c5383181feb#5
revision: 0.8.1
type: Version

Richard Cyganiak
type: Person
type: Thing
type: Human Agent
type: Agent
different from: http://lodlaundromat.org/.well-known/genid/68f2f4d3a20f91e8d84e8c5383181feb#3

extension function
type: Property
sub property of: feature
domain: Service
range: Function
comment: Relates an instance of sd:Service to a function that may be used in a SPARQL SELECT expression or a FILTER, HAVING, GROUP BY, ORDER BY, or BIND clause.
domain: Resource
range: Feature
range: Resource

default graph
type: Property
domain: Dataset
range: Graph
comment: Relates an instance of sd:Dataset to the description of its default graph.
range: Resource
domain: Resource
domain: Graph Collection

supported language
type: Property
sub property of: feature
domain: Service
range: Language
comment: Relates an instance of sd:Service to a SPARQL language (e.g. Query and Update) that it implements.
domain: Resource
range: Feature
range: Resource