Westminster Constituency
type: Property
subclass of: Resource
subclass of: Thing
type: Class
comment: Westminster parliamentary constituencies are used to elect members to the UK Parliament in Westminster, London.
subclass of: Constituency
subclass of: http://lodlaundromat.org/.well-known/genid/samples/jena///predicate//689f8faa17644200cfd4ac860ccb68c9/7f1086caca4c55ed131f188d00565a91#1
subclass of: http://lodlaundromat.org/.well-known/genid/samples/jena///predicate//689f8faa17644200cfd4ac860ccb68c9/7f1086caca4c55ed131f188d00565a91#2
subclass of: http://lodlaundromat.org/.well-known/genid/samples/jena///predicate//689f8faa17644200cfd4ac860ccb68c9/7f1086caca4c55ed131f188d00565a91#3

District Ward
type: Property
subclass of: Resource
subclass of: Thing
type: Class
subclass of: http://lodlaundromat.org/.well-known/genid/samples/jena///predicate//689f8faa17644200cfd4ac860ccb68c9/99deb3a852427474add767dab4c0efc6#5
subclass of: http://lodlaundromat.org/.well-known/genid/samples/jena///predicate//689f8faa17644200cfd4ac860ccb68c9/99deb3a852427474add767dab4c0efc6#2
subclass of: http://lodlaundromat.org/.well-known/genid/samples/jena///predicate//689f8faa17644200cfd4ac860ccb68c9/99deb3a852427474add767dab4c0efc6#4
subclass of: Ward
subclass of: http://lodlaundromat.org/.well-known/genid/samples/jena///predicate//689f8faa17644200cfd4ac860ccb68c9/99deb3a852427474add767dab4c0efc6#7
subclass of: http://lodlaundromat.org/.well-known/genid/samples/jena///predicate//689f8faa17644200cfd4ac860ccb68c9/99deb3a852427474add767dab4c0efc6#1
subclass of: http://lodlaundromat.org/.well-known/genid/samples/jena///predicate//689f8faa17644200cfd4ac860ccb68c9/99deb3a852427474add767dab4c0efc6#3
subclass of: http://lodlaundromat.org/.well-known/genid/samples/jena///predicate//689f8faa17644200cfd4ac860ccb68c9/99deb3a852427474add767dab4c0efc6#6

point
subclass of: Resource
type: Class
subclass of: SpatialThing
comment: A point, typically described using a coordinate system relative to Earth, such as WGS84.
comment: Uniquely identified by lat/long/alt. i.e. spaciallyIntersects(P1, P2) :- lat(P1, LAT), long(P1, LONG), alt(P1, ALT), lat(P2, LAT), long(P2, LONG), alt(P2, ALT). sameThing(P1, P2) :- type(P1, Point), type(P2, Point), spaciallyIntersects(P1, P2).

Borough
subclass of: Resource
subclass of: Thing
type: Class
type: Property
comment: Borough

easting
type: Property
type: DatatypeProperty
comment: Distance in metres east of National Grid origin.
domain: SpatialObject
domain: Resource

KT17 2NG
County Electoral Division: Ewell
District Ward: Stoneleigh
t spatially inside: http://statistics.data.gov.uk/id/statistical-geography/E05007282
t spatially inside: http://statistics.data.gov.uk/id/statistical-geography/E10000030
latitude: 51.361705350870835
t spatially inside: http://statistics.data.gov.uk/id/statistical-geography/E07000208
borough: Epsom and Ewell
longitude: -0.2466182985791111
northing: 163974
Westminster Constituency: Epsom and Ewell
County: Surrey
type: PostcodeUnit
easting: 522170
t spatially inside: http://statistics.data.gov.uk/id/statistical-geography/E14000694
type: SpatialThing
type: Thing
type: SpatialObject

County Electoral Division
subclass of: Resource
subclass of: Thing
type: Class
type: Property
comment: Apart from the special cases of the Isles of Scilly and the Greater London Authority (GLA), the English county councils are the only type of local authority in the UK which does not use standard electoral wards/divisions for electing councillors. Instead they use their own larger units, which are confusingly also termed electoral divisions. These county electoral divisions must be confined within district boundaries, but need not be based on whole electoral wards. Like electoral wards/divisions, county electoral divisions are defined by the Boundary Committee for England (BCFE).
subclass of: Civil Voting Area
subclass of: http://lodlaundromat.org/.well-known/genid/samples/jena///predicate//689f8faa17644200cfd4ac860ccb68c9/7e43e2530e79e373ee99c0645905af21#1
subclass of: http://lodlaundromat.org/.well-known/genid/samples/jena///predicate//689f8faa17644200cfd4ac860ccb68c9/7e43e2530e79e373ee99c0645905af21#2
subclass of: http://lodlaundromat.org/.well-known/genid/samples/jena///predicate//689f8faa17644200cfd4ac860ccb68c9/7e43e2530e79e373ee99c0645905af21#3
subclass of: http://lodlaundromat.org/.well-known/genid/samples/jena///predicate//689f8faa17644200cfd4ac860ccb68c9/7e43e2530e79e373ee99c0645905af21#4

SpatialThing
subclass of: Resource
type: Class
comment: Anything with spatial extent, i.e. size, shape, or position. e.g. people, places, bowling balls, as well as abstract areas like cubes.

County
type: Property
subclass of: Resource
subclass of: Thing
type: Class
subclass of: Civil Administrative Area
subclass of: http://lodlaundromat.org/.well-known/genid/samples/jena///predicate//689f8faa17644200cfd4ac860ccb68c9/761ef96fbac368281b2a0f585fe620a9#2
subclass of: http://lodlaundromat.org/.well-known/genid/samples/jena///predicate//689f8faa17644200cfd4ac860ccb68c9/761ef96fbac368281b2a0f585fe620a9#1
subclass of: http://lodlaundromat.org/.well-known/genid/samples/jena///predicate//689f8faa17644200cfd4ac860ccb68c9/761ef96fbac368281b2a0f585fe620a9#3
subclass of: http://lodlaundromat.org/.well-known/genid/samples/jena///predicate//689f8faa17644200cfd4ac860ccb68c9/761ef96fbac368281b2a0f585fe620a9#4
subclass of: http://lodlaundromat.org/.well-known/genid/samples/jena///predicate//689f8faa17644200cfd4ac860ccb68c9/761ef96fbac368281b2a0f585fe620a9#5
subclass of: http://lodlaundromat.org/.well-known/genid/samples/jena///predicate//689f8faa17644200cfd4ac860ccb68c9/761ef96fbac368281b2a0f585fe620a9#6
comment: Counties were formerly administrative units across the whole UK. Due to various administrative restructurings however then the only administrative areas still referred to as counties are the non-metropolitan (shire) counties of England. The English metropolitan counties, although no longer administrative units, are also used for statistical purposes.
subclass of: http://lodlaundromat.org/.well-known/genid/samples/jena///predicate//689f8faa17644200cfd4ac860ccb68c9/761ef96fbac368281b2a0f585fe620a9#7

KT17 2NG
type: SpatialThing
County Electoral Division: Ewell
District Ward: Stoneleigh
t spatially inside: http://statistics.data.gov.uk/id/statistical-geography/E05007282
t spatially inside: http://statistics.data.gov.uk/id/statistical-geography/E10000030
latitude: 51.361705350870835
t spatially inside: http://statistics.data.gov.uk/id/statistical-geography/E07000208
borough: Epsom and Ewell
longitude: -0.2466182985791111
northing: 163974
Westminster Constituency: Epsom and Ewell
County: Surrey
type: PostcodeUnit
easting: 522170
t spatially inside: http://statistics.data.gov.uk/id/statistical-geography/E14000694
type: Thing
type: SpatialObject

northing
type: Property
type: DatatypeProperty
comment: Distance in metres north of National Grid origin.
domain: SpatialObject
domain: Resource

lat/long
type: Property
comment: A comma-separated representation of a latitude, longitude coordinate.

longitude
type: Property
domain: SpatialThing
comment: The WGS84 longitude of a SpatialThing (decimal degrees).
domain: Resource

Ward
type: Class

WGS84 Geo Positioning: an RDF vocabulary
description: A vocabulary for representing latitude, longitude and altitude information in the WGS84 geodetic reference datum. Version $Id: wgs84_pos.rdf,v 1.22 2009/04/20 15:00:30 timbl Exp $. See http://www.w3.org/2003/01/geo/ for more details.
date: $Date: 2009/04/20 15:00:30 $
label: geo
comment: Recent changes to this namespace: $Log: wgs84_pos.rdf,v $ Revision 1.22 2009/04/20 15:00:30 timbl Remove the time bits which have been deal with elsewhere eg in iCal. Revision 1.21 2009/04/20 12:52:47 timbl try again Revision 1.20 2009/04/20 12:42:11 timbl Add Event (edited ages ago and never checked in), and location (following discussion http://chatlogs.planetrdf.com/swig/2009-04-20#T12-36-09) Revision 1.19 2009/04/20 12:36:31 timbl Add Event (edited ages ago and never checked in), and location (following discussion http://chatlogs.planetrdf.com/swig/2009-04-20#T12-36-09) Revision 1.18 2006/02/01 22:01:04 danbri Clarified that lat and long are decimal degrees, and that alt is decimal metres about local reference ellipsoid Revision 1.17 2004/02/06 17:38:12 danbri Fixed a bad commit screwup Revision 1.15 2003/04/19 11:24:08 danbri Fixed the typo even more. Revision 1.14 2003/04/19 11:16:56 danbri fixed a typo Revision 1.13 2003/02/19 22:27:27 connolly relaxed domain constraints on lat/long/alt from Point to SpatialThing Revision 1.12 2003/01/12 01:41:41 danbri Trying local copy of XSLT doc. Revision 1.11 2003/01/12 01:20:18 danbri added a link to morten's xslt rdfs viewer. Revision 1.10 2003/01/11 18:56:49 danbri Removed datatype range from lat and long properties, since they would have required each occurance of the property to mention the datatype. Revision 1.9 2003/01/11 11:41:31 danbri Another typo; repaired rdfs:Property to rdf:Property x4 Revision 1.8 2003/01/11 11:05:02 danbri Added an rdfs:range for each lat/long/alt property, http://www.w3.org/2001/XMLSchema#float Revision 1.7 2003/01/10 20:25:16 danbri Longer rdfs:comment for Point, trying to be Earth-centric and neutral about coordinate system(s) at the same time. Feedback welcomed. Revision 1.6 2003/01/10 20:18:30 danbri Added CVS log comments into the RDF/XML as an rdfs:comment property of the vocabulary. Note that this is not common practice (but seems both harmless and potentially useful). revision 1.…

altitude
type: Property
domain: SpatialThing
comment: The WGS84 altitude of a SpatialThing (decimal meters above the local reference ellipsoid).
domain: Resource

Constituency
type: Class

Civil Voting Area
type: Class

location
type: Property
range: SpatialThing
sub property of: based near
comment: The relation between something and the point, or other geometrical thing in space, where it is. For example, the realtionship between a radio tower and a Point with a given lat and long. Or a relationship between a park and its outline as a closed arc of points, or a road and its location as a arc (a sequence of points). Clearly in practice there will be limit to the accuracy of any such statement, but one would expect an accuracy appropriate for the size of the object and uses such as mapping
range: Resource

Civil Administrative Area
type: Class

latitude
type: Property
domain: SpatialThing
comment: The WGS84 latitude of a SpatialThing (decimal degrees).
domain: Resource