Landing Page
range: Thing
domain: Thing
sub property of: hasPart
type: Property
type: ObjectProperty
definition: This property captures the relation between a Europeana aggregation representing a cultural heritage object and a (reference) Web resource giving access to that object. Europeana provides the value for this property.
sub property of: Aggregates
range: Web Resource
range: Aggregated Resource
range: Resource
domain: Aggregation
domain: Resource
domain: Collection
range: http://lodlaundromat.org/.well-known/genid/samples/jena///class//6177fda54d042f065cb8e89e071998cc/c46ef0e1a7e9b215d2c9066b02f88654#5
range: http://lodlaundromat.org/.well-known/genid/samples/jena///class//6177fda54d042f065cb8e89e071998cc/6515c153e9f1dcbee79829339a7016be#50
range: E89 Propositional Object
range: http://lodlaundromat.org/.well-known/genid/samples/jena///class//6177fda54d042f065cb8e89e071998cc/6515c153e9f1dcbee79829339a7016be#5
range: http://lodlaundromat.org/.well-known/genid/samples/jena///class//6177fda54d042f065cb8e89e071998cc/6515c153e9f1dcbee79829339a7016be#9
range: http://lodlaundromat.org/.well-known/genid/samples/jena///class//6177fda54d042f065cb8e89e071998cc/c46ef0e1a7e9b215d2c9066b02f88654#50
range: http://lodlaundromat.org/.well-known/genid/samples/jena///class//6177fda54d042f065cb8e89e071998cc/c46ef0e1a7e9b215d2c9066b02f88654#9
range: Information Resource

Happened At
sub property of: Is Related To
range: Thing
domain: Thing
sub property of: P7 took place at
type: ObjectProperty
definition: This property associates an event with the place at which the event happened.
sub property of: relation
equivalent property: P7 took place at
domain: Event
range: Place
type: Property
range: Resource
range: space-region
range: E53 Place
range: F9 Place
range: Non-Information Resource
domain: http://lodlaundromat.org/.well-known/genid/samples/jena///class//6177fda54d042f065cb8e89e071998cc/c46ef0e1a7e9b215d2c9066b02f88654#43
domain: http://lodlaundromat.org/.well-known/genid/samples/jena///class//6177fda54d042f065cb8e89e071998cc/6515c153e9f1dcbee79829339a7016be#43
domain: Resource
domain: Temporality
domain: F8 Event
domain: E4 Period
domain: http://lodlaundromat.org/.well-known/genid/samples/jena///class//6177fda54d042f065cb8e89e071998cc/c46ef0e1a7e9b215d2c9066b02f88654#4
domain: Non-Information Resource
domain: http://lodlaundromat.org/.well-known/genid/samples/jena///class//6177fda54d042f065cb8e89e071998cc/6515c153e9f1dcbee79829339a7016be#4

Europeana Type
sub property of: Is Related To
sub property of: P2 has type
sub property of: Has Type
type: Property
range: http://lodlaundromat.org/.well-known/genid/samples/jena///class//6177fda54d042f065cb8e89e071998cc/c46ef0e1a7e9b215d2c9066b02f88654#54
type: DatatypeProperty
definition: The Europeana material type of the resource
sub property of: type
range: http://lodlaundromat.org/.well-known/genid/samples/jena///class//6177fda54d042f065cb8e89e071998cc/6515c153e9f1dcbee79829339a7016be#54
range: Thing
range: Non-Information Resource
range: Resource
domain: http://lodlaundromat.org/.well-known/genid/samples/jena///class//6177fda54d042f065cb8e89e071998cc/c46ef0e1a7e9b215d2c9066b02f88654#43
domain: http://lodlaundromat.org/.well-known/genid/samples/jena///class//6177fda54d042f065cb8e89e071998cc/6515c153e9f1dcbee79829339a7016be#43
domain: Thing
domain: Resource
domain: http://lodlaundromat.org/.well-known/genid/samples/jena///class//6177fda54d042f065cb8e89e071998cc/c46ef0e1a7e9b215d2c9066b02f88654#29
domain: http://lodlaundromat.org/.well-known/genid/samples/jena///class//6177fda54d042f065cb8e89e071998cc/6515c153e9f1dcbee79829339a7016be#29

http://lodlaundromat.org/.well-known/genid/samples/jena///class//6177fda54d042f065cb8e89e071998cc/6515c153e9f1dcbee79829339a7016be#4
type: Class
subclass of: Resource
subclass of: Thing
type: Restriction
cardinality: 1
on property: Happened At
subclass of: http://lodlaundromat.org/.well-known/genid/samples/jena///class//6177fda54d042f065cb8e89e071998cc/c46ef0e1a7e9b215d2c9066b02f88654#4
equivalent class: http://lodlaundromat.org/.well-known/genid/samples/jena///class//6177fda54d042f065cb8e89e071998cc/c46ef0e1a7e9b215d2c9066b02f88654#4

Physical Thing
subclass of: http://lodlaundromat.org/.well-known/genid/samples/jena///class//6177fda54d042f065cb8e89e071998cc/c46ef0e1a7e9b215d2c9066b02f88654#50
subclass of: http://lodlaundromat.org/.well-known/genid/samples/jena///class//6177fda54d042f065cb8e89e071998cc/6515c153e9f1dcbee79829339a7016be#50
subclass of: Thing
subclass of: E18 Physical Thing
subclass of: Resource
type: Class
definition: A persistent physical item such as a painting, a building, a book or a stone. Persons are not items. This class represents Cultural Heritage Objects known to Europeana to be physical things (such as Mona Lisa) as well as all physical things Europeana refers to in the descriptions of Cultural Heritage Objects (such as the Rosetta Stone).
subclass of: Non-Information Resource
equivalent class: E18 Physical Thing

Agent
subclass of: http://lodlaundromat.org/.well-known/genid/samples/jena///class//6177fda54d042f065cb8e89e071998cc/6515c153e9f1dcbee79829339a7016be#50
subclass of: http://lodlaundromat.org/.well-known/genid/samples/jena///class//6177fda54d042f065cb8e89e071998cc/c46ef0e1a7e9b215d2c9066b02f88654#16
subclass of: http://lodlaundromat.org/.well-known/genid/samples/jena///class//6177fda54d042f065cb8e89e071998cc/c46ef0e1a7e9b215d2c9066b02f88654#50
subclass of: E39 Actor
subclass of: http://lodlaundromat.org/.well-known/genid/samples/jena///class//6177fda54d042f065cb8e89e071998cc/6515c153e9f1dcbee79829339a7016be#16
subclass of: http://lodlaundromat.org/.well-known/genid/samples/jena///class//6177fda54d042f065cb8e89e071998cc/6515c153e9f1dcbee79829339a7016be#26
subclass of: Thing
subclass of: http://lodlaundromat.org/.well-known/genid/samples/jena///class//6177fda54d042f065cb8e89e071998cc/c46ef0e1a7e9b215d2c9066b02f88654#26
subclass of: Resource
type: Class
definition: This class comprises people, either individually or in groups, who have the potential to perform intentional actions for which they can be held responsible.
example: Leonardo da Vinci, the British Museum, W3C
subclass of: Non-Information Resource
equivalent class: E39 Actor
scope note: Rationale: This class is a domain of edm:wasPresentAt

Non-Information Resource
subclass of: Resource
type: Class
subclass of: Thing
definition: All resources that are not information resources.
complement of: Information Resource

Europeana URI
range: Thing
domain: Thing
type: ObjectProperty
definition: This is a tag created by a user through the Europeana interface.
type: Property
range: Resource
domain: Resource

Collection Name
range: Thing
domain: Thing
type: Property
type: ObjectProperty
definition: This property holds the collection identifier given to the dataset in Europeana.
note: The value of this property is provided by Europeana as part of the ingestion process.
range: Resource
domain: Resource

Object
sub property of: hasPart
sub property of: Aggregates
type: Property
range: Thing
domain: Thing
type: ObjectProperty
definition: The URL of a thumbnail representing the digital object or, if there is no such thumbnail, the URL of the digital object in the best resolution available on the web site of the data provider from which a thumbnail could be generated. This will often be the same URL as given in edm:isShownBy.
sub property of: Has View
range: Web Resource
range: Aggregated Resource
range: Resource
range: E89 Propositional Object
range: http://lodlaundromat.org/.well-known/genid/samples/jena///class//6177fda54d042f065cb8e89e071998cc/6515c153e9f1dcbee79829339a7016be#9
range: http://lodlaundromat.org/.well-known/genid/samples/jena///class//6177fda54d042f065cb8e89e071998cc/c46ef0e1a7e9b215d2c9066b02f88654#5
range: http://lodlaundromat.org/.well-known/genid/samples/jena///class//6177fda54d042f065cb8e89e071998cc/6515c153e9f1dcbee79829339a7016be#5
range: http://lodlaundromat.org/.well-known/genid/samples/jena///class//6177fda54d042f065cb8e89e071998cc/c46ef0e1a7e9b215d2c9066b02f88654#9
range: Information Resource
range: http://lodlaundromat.org/.well-known/genid/samples/jena///class//6177fda54d042f065cb8e89e071998cc/c46ef0e1a7e9b215d2c9066b02f88654#50
range: http://lodlaundromat.org/.well-known/genid/samples/jena///class//6177fda54d042f065cb8e89e071998cc/6515c153e9f1dcbee79829339a7016be#50
domain: Aggregation
domain: Resource
domain: Collection

Europeana Aggregation
subclass of: http://lodlaundromat.org/.well-known/genid/samples/jena///class//6177fda54d042f065cb8e89e071998cc/c46ef0e1a7e9b215d2c9066b02f88654#3
type: Class
subclass of: Resource
subclass of: http://lodlaundromat.org/.well-known/genid/samples/jena///class//6177fda54d042f065cb8e89e071998cc/6515c153e9f1dcbee79829339a7016be#3
subclass of: Thing
equivalent class: http://lodlaundromat.org/.well-known/genid/samples/jena///class//6177fda54d042f065cb8e89e071998cc/c46ef0e1a7e9b215d2c9066b02f88654#3
example: The 56th issue of "Le Temps" is a (different) Cultural Heritage Object represented in Europeana by another EuropeanaAggregation instance
equivalent class: http://lodlaundromat.org/.well-known/genid/samples/jena///class//6177fda54d042f065cb8e89e071998cc/6515c153e9f1dcbee79829339a7016be#3
subclass of: Europeana Object
note: An instance of EuropeanaAggregation is created at ingestion time for each different Cultural Heritage Object recognized by Europeana. Such instance is associated to the Cultural Heritage Object that it is about, by the property edm:aggregatedCHO
scope note: Rationale: This class is used in Europeana to gather in a single conceptual unit all the information about a Cultural Heritage Object, necessary for all operations on these objects.
scope note: Obligation and Occurence: The relation between the Cultural Heritage Objects represented in Europeana and the instances of the class EuropeanaAggregation is one-to-one, in the data maintained by Europeana: every Cultural Heritage Object is represented by an instance of EuropeanaAggregation, and every instance of EuropeanaAggregation represent a Cultural Heritage Object.
definition: The set of resources related to a single Cultural Heritage Object that collectively represent that object in Europeana. Such set consists of: all descriptions about the object that Europeana collects from (possibly different) content providers, including thumbnails and other forms of abstractions, as well as of the description of the object Europeana builds.
example: The painting Mona Lisa is a Cultural Heritage Object represented in Europeana by one EuropeanaAggregation instance
example: The journal "Le Temps" is a Cultural Heritage Object represented in Europeana by one EuropeanaAggregation instance
subclass of: Aggregation
subclass of: Web Resource
subclass of: Collection
subclass of: http://lodlaundromat.org/.well-known/genid/samples/jena///class//6177fda54d042f065cb8e89e071998cc/c46ef0e1a7e9b215d2c9066b02f88654#9
subclass of: E89 Propositional Object
subclass of: http://lodlaundromat.org/.well-known/genid/samples/jena///class//6177fda54d042f065cb8e89e071998cc/c46ef0e1a7e9b215d2c9066b02f88654#5
subclass of: Information Resource
subclass of: http://lodlaundromat.org/.well-known/genid/samples/jena///class//6177fda54d042f065cb8e89e071998cc/6515c153e9f1dcbee79829339a7016be#5
subclass of: http://lodlaundromat.org/.well-known/genid/samples/jena///class//6177fda54d042f065cb8e89e071998cc/6515c153e9f1dcbee79829339a7016be#9
subclass of: http://lodlaundromat.org/.well-known/genid/samples/jena///class//6177fda54d042f065cb8e89e071998cc/6515c153e9f1dcbee79829339a7016be#50
subclass of: http://lodlaundromat.org/.well-known/genid/samples/jena///class//6177fda54d042f065cb8e89e071998cc/c46ef0e1a7e9b215d2c9066b02f88654#50

Occured At
sub property of: Is Related To
range: Thing
domain: Thing
sub property of: P4 has time-span
type: ObjectProperty
definition: This property associates an event to the smallest known time span that overlaps with the occurrence of that event
sub property of: relation
equivalent property: P4 has time-span
domain: Event
range: Time Span
type: Property
range: Resource
range: Time
range: http://lodlaundromat.org/.well-known/genid/samples/jena///class//6177fda54d042f065cb8e89e071998cc/6515c153e9f1dcbee79829339a7016be#16
range: http://lodlaundromat.org/.well-known/genid/samples/jena///class//6177fda54d042f065cb8e89e071998cc/c46ef0e1a7e9b215d2c9066b02f88654#26
range: E52 Time-Span
range: http://lodlaundromat.org/.well-known/genid/samples/jena///class//6177fda54d042f065cb8e89e071998cc/c46ef0e1a7e9b215d2c9066b02f88654#16
range: http://lodlaundromat.org/.well-known/genid/samples/jena///class//6177fda54d042f065cb8e89e071998cc/6515c153e9f1dcbee79829339a7016be#26
range: time-interval
range: Non-Information Resource
range: PeriodOfTime
domain: http://lodlaundromat.org/.well-known/genid/samples/jena///class//6177fda54d042f065cb8e89e071998cc/c46ef0e1a7e9b215d2c9066b02f88654#43
domain: http://lodlaundromat.org/.well-known/genid/samples/jena///class//6177fda54d042f065cb8e89e071998cc/6515c153e9f1dcbee79829339a7016be#43
domain: Resource
domain: Temporality
domain: F8 Event
domain: E4 Period
domain: http://lodlaundromat.org/.well-known/genid/samples/jena///class//6177fda54d042f065cb8e89e071998cc/c46ef0e1a7e9b215d2c9066b02f88654#4
domain: Non-Information Resource
domain: http://lodlaundromat.org/.well-known/genid/samples/jena///class//6177fda54d042f065cb8e89e071998cc/6515c153e9f1dcbee79829339a7016be#4

Information Resource
subclass of: Thing
type: Class
subclass of: E89 Propositional Object
subclass of: http://lodlaundromat.org/.well-known/genid/samples/jena///class//6177fda54d042f065cb8e89e071998cc/6515c153e9f1dcbee79829339a7016be#9
subclass of: http://lodlaundromat.org/.well-known/genid/samples/jena///class//6177fda54d042f065cb8e89e071998cc/c46ef0e1a7e9b215d2c9066b02f88654#5
subclass of: http://lodlaundromat.org/.well-known/genid/samples/jena///class//6177fda54d042f065cb8e89e071998cc/6515c153e9f1dcbee79829339a7016be#5
subclass of: http://lodlaundromat.org/.well-known/genid/samples/jena///class//6177fda54d042f065cb8e89e071998cc/6515c153e9f1dcbee79829339a7016be#50
subclass of: http://lodlaundromat.org/.well-known/genid/samples/jena///class//6177fda54d042f065cb8e89e071998cc/c46ef0e1a7e9b215d2c9066b02f88654#50
subclass of: Resource
subclass of: http://lodlaundromat.org/.well-known/genid/samples/jena///class//6177fda54d042f065cb8e89e071998cc/c46ef0e1a7e9b215d2c9066b02f88654#9
equivalent class: http://lodlaundromat.org/.well-known/genid/samples/jena///class//6177fda54d042f065cb8e89e071998cc/c46ef0e1a7e9b215d2c9066b02f88654#5
equivalent class: http://lodlaundromat.org/.well-known/genid/samples/jena///class//6177fda54d042f065cb8e89e071998cc/c46ef0e1a7e9b215d2c9066b02f88654#9
definition: An information resource is a resource whose essential characteristics can be conveyed in a single message. It can be associated with a URI, it can have a representation, for example: a text is an InformationResource.
equivalent class: E89 Propositional Object
equivalent class: http://lodlaundromat.org/.well-known/genid/samples/jena///class//6177fda54d042f065cb8e89e071998cc/6515c153e9f1dcbee79829339a7016be#5
equivalent class: http://lodlaundromat.org/.well-known/genid/samples/jena///class//6177fda54d042f065cb8e89e071998cc/6515c153e9f1dcbee79829339a7016be#9

Time Span
type: Class
subclass of: Resource
subclass of: Time
subclass of: http://lodlaundromat.org/.well-known/genid/samples/jena///class//6177fda54d042f065cb8e89e071998cc/6515c153e9f1dcbee79829339a7016be#16
subclass of: http://lodlaundromat.org/.well-known/genid/samples/jena///class//6177fda54d042f065cb8e89e071998cc/c46ef0e1a7e9b215d2c9066b02f88654#26
subclass of: E52 Time-Span
subclass of: http://lodlaundromat.org/.well-known/genid/samples/jena///class//6177fda54d042f065cb8e89e071998cc/c46ef0e1a7e9b215d2c9066b02f88654#16
subclass of: http://lodlaundromat.org/.well-known/genid/samples/jena///class//6177fda54d042f065cb8e89e071998cc/6515c153e9f1dcbee79829339a7016be#26
subclass of: time-interval
subclass of: Thing
definition: The class of "abstract temporal extents, in the sense of Galilean physics, having a beginning, an end and a duration" (CIDOC CRM)
subclass of: Non-Information Resource
subclass of: PeriodOfTime
equivalent class: Time
equivalent class: time-interval
equivalent class: E52 Time-Span

http://lodlaundromat.org/.well-known/genid/samples/jena///class//6177fda54d042f065cb8e89e071998cc/c46ef0e1a7e9b215d2c9066b02f88654#3
subclass of: Thing
subclass of: http://lodlaundromat.org/.well-known/genid/samples/jena///class//6177fda54d042f065cb8e89e071998cc/6515c153e9f1dcbee79829339a7016be#3
type: Class
subclass of: Resource
subclass of: Europeana Aggregation
type: Restriction
cardinality: 1
on property: Aggregated Cultural Heritage Object
subclass of: Aggregation
subclass of: Web Resource
subclass of: Collection
subclass of: Europeana Object
subclass of: E89 Propositional Object
subclass of: http://lodlaundromat.org/.well-known/genid/samples/jena///class//6177fda54d042f065cb8e89e071998cc/6515c153e9f1dcbee79829339a7016be#9
subclass of: Information Resource
subclass of: http://lodlaundromat.org/.well-known/genid/samples/jena///class//6177fda54d042f065cb8e89e071998cc/6515c153e9f1dcbee79829339a7016be#5
subclass of: http://lodlaundromat.org/.well-known/genid/samples/jena///class//6177fda54d042f065cb8e89e071998cc/c46ef0e1a7e9b215d2c9066b02f88654#9
subclass of: http://lodlaundromat.org/.well-known/genid/samples/jena///class//6177fda54d042f065cb8e89e071998cc/c46ef0e1a7e9b215d2c9066b02f88654#5
subclass of: http://lodlaundromat.org/.well-known/genid/samples/jena///class//6177fda54d042f065cb8e89e071998cc/c46ef0e1a7e9b215d2c9066b02f88654#50
subclass of: http://lodlaundromat.org/.well-known/genid/samples/jena///class//6177fda54d042f065cb8e89e071998cc/6515c153e9f1dcbee79829339a7016be#50
equivalent class: http://lodlaundromat.org/.well-known/genid/samples/jena///class//6177fda54d042f065cb8e89e071998cc/6515c153e9f1dcbee79829339a7016be#3
equivalent class: Europeana Aggregation

Provided CHO
subclass of: Thing
subclass of: http://lodlaundromat.org/.well-known/genid/samples/jena///class//6177fda54d042f065cb8e89e071998cc/c46ef0e1a7e9b215d2c9066b02f88654#36
subclass of: http://lodlaundromat.org/.well-known/genid/samples/jena///class//6177fda54d042f065cb8e89e071998cc/c46ef0e1a7e9b215d2c9066b02f88654#19
subclass of: http://lodlaundromat.org/.well-known/genid/samples/jena///class//6177fda54d042f065cb8e89e071998cc/6515c153e9f1dcbee79829339a7016be#43
subclass of: http://lodlaundromat.org/.well-known/genid/samples/jena///class//6177fda54d042f065cb8e89e071998cc/6515c153e9f1dcbee79829339a7016be#19
subclass of: Resource
subclass of: http://lodlaundromat.org/.well-known/genid/samples/jena///class//6177fda54d042f065cb8e89e071998cc/c46ef0e1a7e9b215d2c9066b02f88654#29
type: Class
subclass of: http://lodlaundromat.org/.well-known/genid/samples/jena///class//6177fda54d042f065cb8e89e071998cc/6515c153e9f1dcbee79829339a7016be#29
subclass of: http://lodlaundromat.org/.well-known/genid/samples/jena///class//6177fda54d042f065cb8e89e071998cc/6515c153e9f1dcbee79829339a7016be#36
subclass of: http://lodlaundromat.org/.well-known/genid/samples/jena///class//6177fda54d042f065cb8e89e071998cc/c46ef0e1a7e9b215d2c9066b02f88654#43
subclass of: http://lodlaundromat.org/.well-known/genid/samples/jena///class//6177fda54d042f065cb8e89e071998cc/c46ef0e1a7e9b215d2c9066b02f88654#14
definition: This class comprises the Cultural Heritage objects that Europeana collects descriptions about.
subclass of: http://lodlaundromat.org/.well-known/genid/samples/jena///class//6177fda54d042f065cb8e89e071998cc/6515c153e9f1dcbee79829339a7016be#14
note: This class has been mostly motivated by the need to assign a type to the “central node” in the EDM pattern, during the ingestion process, related to the XML expression of EDM at that stage. It was especially intended to fit the cases where edm:PhysicalThing cannot be used as the type of the resource standing for the real-world object (independently of any specific data contributor perspective).
example: Mona Lisa, Winged Victory of Samothrace
scope note: Rationale: This class is the range of edm:aggregatedCHO. A resource of type ProvidedCHO can be the subject of statements using edm:isRelatedTo or any more specific property.

http://lodlaundromat.org/.well-known/genid/samples/jena///class//6177fda54d042f065cb8e89e071998cc/6515c153e9f1dcbee79829339a7016be#14
type: Class
subclass of: Thing
subclass of: Resource
type: Restriction
cardinality: 1
on property: http://lodlaundromat.org/.well-known/genid/samples/jena///class//6177fda54d042f065cb8e89e071998cc/6515c153e9f1dcbee79829339a7016be#15

Is Successor Of
sub property of: Is Related To
sub property of: relation
sub property of: P130 shows features of
range: Thing
domain: Thing
type: ObjectProperty
definition: This property captures the relation between the continuation of a resource and that resource. This applies to a story, a serial, a journal etc. No content of the successor resource is identical or has a similar form with that of the precursor. The similarity is only in the context, subjects and figures of a plot. Successors typically form part of a common whole – such as a trilogy, a journal, etc.
sub property of: Is Similar To
type: Property
domain: http://lodlaundromat.org/.well-known/genid/samples/jena///class//6177fda54d042f065cb8e89e071998cc/c46ef0e1a7e9b215d2c9066b02f88654#43
domain: http://lodlaundromat.org/.well-known/genid/samples/jena///class//6177fda54d042f065cb8e89e071998cc/6515c153e9f1dcbee79829339a7016be#43
domain: Resource
range: Resource

Has Type
range: Thing
domain: Thing
sub property of: P2 has type
domain: http://lodlaundromat.org/.well-known/genid/samples/jena///class//6177fda54d042f065cb8e89e071998cc/c46ef0e1a7e9b215d2c9066b02f88654#29
type: ObjectProperty
definition: This property relates a resource with the concepts it belongs to in a suitable type system such as MIME or any thesaurus that captures categories of objects in a given field (e.g., the “Objects” facet in Getty’s Art and Architecture Thesaurus). It does not capture aboutness.
sub property of: Is Related To
equivalent property: P2 has type
domain: http://lodlaundromat.org/.well-known/genid/samples/jena///class//6177fda54d042f065cb8e89e071998cc/6515c153e9f1dcbee79829339a7016be#29
range: Non-Information Resource
type: Property
range: Resource
domain: http://lodlaundromat.org/.well-known/genid/samples/jena///class//6177fda54d042f065cb8e89e071998cc/c46ef0e1a7e9b215d2c9066b02f88654#43
domain: http://lodlaundromat.org/.well-known/genid/samples/jena///class//6177fda54d042f065cb8e89e071998cc/6515c153e9f1dcbee79829339a7016be#43
domain: Resource

Realizes
range: Thing
domain: Thing
sub property of: P128 carries
type: ObjectProperty
definition: This property describes a relation between a physical thing and the information resource that is contained in it, visible at it or otherwise carried by it, if applicable.
sub property of: Is Related To
equivalent property: P128 carries
domain: Physical Thing
range: Information Resource
type: Property
range: Resource
range: E89 Propositional Object
range: http://lodlaundromat.org/.well-known/genid/samples/jena///class//6177fda54d042f065cb8e89e071998cc/6515c153e9f1dcbee79829339a7016be#9
range: http://lodlaundromat.org/.well-known/genid/samples/jena///class//6177fda54d042f065cb8e89e071998cc/c46ef0e1a7e9b215d2c9066b02f88654#5
range: http://lodlaundromat.org/.well-known/genid/samples/jena///class//6177fda54d042f065cb8e89e071998cc/6515c153e9f1dcbee79829339a7016be#5
range: http://lodlaundromat.org/.well-known/genid/samples/jena///class//6177fda54d042f065cb8e89e071998cc/6515c153e9f1dcbee79829339a7016be#50
range: http://lodlaundromat.org/.well-known/genid/samples/jena///class//6177fda54d042f065cb8e89e071998cc/c46ef0e1a7e9b215d2c9066b02f88654#50
range: http://lodlaundromat.org/.well-known/genid/samples/jena///class//6177fda54d042f065cb8e89e071998cc/c46ef0e1a7e9b215d2c9066b02f88654#9
domain: http://lodlaundromat.org/.well-known/genid/samples/jena///class//6177fda54d042f065cb8e89e071998cc/c46ef0e1a7e9b215d2c9066b02f88654#43
domain: http://lodlaundromat.org/.well-known/genid/samples/jena///class//6177fda54d042f065cb8e89e071998cc/6515c153e9f1dcbee79829339a7016be#43
domain: Resource
domain: http://lodlaundromat.org/.well-known/genid/samples/jena///class//6177fda54d042f065cb8e89e071998cc/c46ef0e1a7e9b215d2c9066b02f88654#50
domain: http://lodlaundromat.org/.well-known/genid/samples/jena///class//6177fda54d042f065cb8e89e071998cc/6515c153e9f1dcbee79829339a7016be#50
domain: E18 Physical Thing
domain: Non-Information Resource

Europeana Proxy
range: Thing
domain: Thing
type: ObjectProperty
definition: This property serves only as a flag to indicate that a proxy is a Europeana proxy (as opposed to a provider proxy). It is for internal use only.
note: By default, any proxy without this flag can be interpreted as having the value false and is a provider proxy.
type: Property
range: Resource
domain: Resource

Aggregation
subclass of: Resource
subclass of: Thing
type: Class
comment: A set of related resources (Aggregated Resources), grouped together such that the set can be treated as a single resource. This is the entity described within the ORE interoperability framework by a Resource Map.
subclass of: Collection

Was Present At
range: Thing
domain: Thing
sub property of: Is Related To
sub property of: P12i was present at
domain: http://lodlaundromat.org/.well-known/genid/samples/jena///class//6177fda54d042f065cb8e89e071998cc/c46ef0e1a7e9b215d2c9066b02f88654#50
type: ObjectProperty
definition: This property associates the people, things or information resources with an event at which they were present
sub property of: relation
equivalent property: P12i was present at
domain: http://lodlaundromat.org/.well-known/genid/samples/jena///class//6177fda54d042f065cb8e89e071998cc/6515c153e9f1dcbee79829339a7016be#50
range: Event
type: Property
range: Resource
range: Temporality
range: F8 Event
range: E4 Period
range: http://lodlaundromat.org/.well-known/genid/samples/jena///class//6177fda54d042f065cb8e89e071998cc/c46ef0e1a7e9b215d2c9066b02f88654#4
range: Non-Information Resource
range: http://lodlaundromat.org/.well-known/genid/samples/jena///class//6177fda54d042f065cb8e89e071998cc/6515c153e9f1dcbee79829339a7016be#4
domain: http://lodlaundromat.org/.well-known/genid/samples/jena///class//6177fda54d042f065cb8e89e071998cc/c46ef0e1a7e9b215d2c9066b02f88654#43
domain: http://lodlaundromat.org/.well-known/genid/samples/jena///class//6177fda54d042f065cb8e89e071998cc/6515c153e9f1dcbee79829339a7016be#43
domain: Resource

Europeana Rights
range: Thing
domain: Thing
type: ObjectProperty
definition: Information about copyright of the digital object as specified by isShownBy and isShownAt
type: Property
range: Resource
domain: Resource

Preview
sub property of: hasPart
sub property of: Aggregates
type: Property
range: Thing
domain: Thing
type: ObjectProperty
definition: The URL of a thumbnail representing the digital object, generated by Europeana.
sub property of: Has View
range: Web Resource
range: Aggregated Resource
range: Resource
range: E89 Propositional Object
range: http://lodlaundromat.org/.well-known/genid/samples/jena///class//6177fda54d042f065cb8e89e071998cc/6515c153e9f1dcbee79829339a7016be#9
range: http://lodlaundromat.org/.well-known/genid/samples/jena///class//6177fda54d042f065cb8e89e071998cc/c46ef0e1a7e9b215d2c9066b02f88654#5
range: http://lodlaundromat.org/.well-known/genid/samples/jena///class//6177fda54d042f065cb8e89e071998cc/6515c153e9f1dcbee79829339a7016be#5
range: http://lodlaundromat.org/.well-known/genid/samples/jena///class//6177fda54d042f065cb8e89e071998cc/c46ef0e1a7e9b215d2c9066b02f88654#9
range: Information Resource
range: http://lodlaundromat.org/.well-known/genid/samples/jena///class//6177fda54d042f065cb8e89e071998cc/c46ef0e1a7e9b215d2c9066b02f88654#50
range: http://lodlaundromat.org/.well-known/genid/samples/jena///class//6177fda54d042f065cb8e89e071998cc/6515c153e9f1dcbee79829339a7016be#50
domain: Aggregation
domain: Resource
domain: Collection

Is Shown By
sub property of: hasPart
sub property of: Aggregates
range: Thing
domain: Thing
type: Property
type: ObjectProperty
definition: An unambiguous URL reference to the digital object on the provider’s web site in the best available resolution/quality.
sub property of: Has View
range: Web Resource
range: Aggregated Resource
range: Resource
range: E89 Propositional Object
range: http://lodlaundromat.org/.well-known/genid/samples/jena///class//6177fda54d042f065cb8e89e071998cc/6515c153e9f1dcbee79829339a7016be#9
range: http://lodlaundromat.org/.well-known/genid/samples/jena///class//6177fda54d042f065cb8e89e071998cc/c46ef0e1a7e9b215d2c9066b02f88654#5
range: http://lodlaundromat.org/.well-known/genid/samples/jena///class//6177fda54d042f065cb8e89e071998cc/6515c153e9f1dcbee79829339a7016be#5
range: http://lodlaundromat.org/.well-known/genid/samples/jena///class//6177fda54d042f065cb8e89e071998cc/c46ef0e1a7e9b215d2c9066b02f88654#9
range: Information Resource
range: http://lodlaundromat.org/.well-known/genid/samples/jena///class//6177fda54d042f065cb8e89e071998cc/c46ef0e1a7e9b215d2c9066b02f88654#50
range: http://lodlaundromat.org/.well-known/genid/samples/jena///class//6177fda54d042f065cb8e89e071998cc/6515c153e9f1dcbee79829339a7016be#50
domain: Aggregation
domain: Resource
domain: Collection

Aggregated Cultural Heritage Object
sub property of: Is Related To
sub property of: hasPart
type: Property
inverse of: http://lodlaundromat.org/.well-known/genid/samples/jena///class//6177fda54d042f065cb8e89e071998cc/c46ef0e1a7e9b215d2c9066b02f88654#15
inverse of: http://lodlaundromat.org/.well-known/genid/samples/jena///class//6177fda54d042f065cb8e89e071998cc/6515c153e9f1dcbee79829339a7016be#15
range: Thing
domain: Thing
type: ObjectProperty
definition: This property associates an ORE aggregation with the cultural heritage object(s) (CHO for short) it is about.
sub property of: Aggregates
sub property of: subject
sub property of: P129 is about
domain: Aggregation
range: Provided CHO
range: Aggregated Resource
range: Resource
domain: http://lodlaundromat.org/.well-known/genid/samples/jena///class//6177fda54d042f065cb8e89e071998cc/c46ef0e1a7e9b215d2c9066b02f88654#43
domain: http://lodlaundromat.org/.well-known/genid/samples/jena///class//6177fda54d042f065cb8e89e071998cc/6515c153e9f1dcbee79829339a7016be#43
domain: Resource
domain: Collection
range: http://lodlaundromat.org/.well-known/genid/samples/jena///class//6177fda54d042f065cb8e89e071998cc/c46ef0e1a7e9b215d2c9066b02f88654#36
range: http://lodlaundromat.org/.well-known/genid/samples/jena///class//6177fda54d042f065cb8e89e071998cc/6515c153e9f1dcbee79829339a7016be#14
range: http://lodlaundromat.org/.well-known/genid/samples/jena///class//6177fda54d042f065cb8e89e071998cc/6515c153e9f1dcbee79829339a7016be#19
range: http://lodlaundromat.org/.well-known/genid/samples/jena///class//6177fda54d042f065cb8e89e071998cc/c46ef0e1a7e9b215d2c9066b02f88654#43
range: http://lodlaundromat.org/.well-known/genid/samples/jena///class//6177fda54d042f065cb8e89e071998cc/6515c153e9f1dcbee79829339a7016be#36
range: http://lodlaundromat.org/.well-known/genid/samples/jena///class//6177fda54d042f065cb8e89e071998cc/6515c153e9f1dcbee79829339a7016be#43
range: http://lodlaundromat.org/.well-known/genid/samples/jena///class//6177fda54d042f065cb8e89e071998cc/6515c153e9f1dcbee79829339a7016be#29
range: http://lodlaundromat.org/.well-known/genid/samples/jena///class//6177fda54d042f065cb8e89e071998cc/c46ef0e1a7e9b215d2c9066b02f88654#14
range: http://lodlaundromat.org/.well-known/genid/samples/jena///class//6177fda54d042f065cb8e89e071998cc/c46ef0e1a7e9b215d2c9066b02f88654#19
range: http://lodlaundromat.org/.well-known/genid/samples/jena///class//6177fda54d042f065cb8e89e071998cc/c46ef0e1a7e9b215d2c9066b02f88654#29

http://lodlaundromat.org/.well-known/genid/samples/jena///class//6177fda54d042f065cb8e89e071998cc/c46ef0e1a7e9b215d2c9066b02f88654#4
subclass of: Thing
type: Class
subclass of: Resource
type: Restriction
cardinality: 1
on property: Happened At
subclass of: http://lodlaundromat.org/.well-known/genid/samples/jena///class//6177fda54d042f065cb8e89e071998cc/6515c153e9f1dcbee79829339a7016be#4
equivalent class: http://lodlaundromat.org/.well-known/genid/samples/jena///class//6177fda54d042f065cb8e89e071998cc/6515c153e9f1dcbee79829339a7016be#4

Europeana Object
subclass of: Resource
type: Class
subclass of: Thing
definition: Any object that is the result of Europeana’s activities
subclass of: Web Resource
example: Any instance of the class EuropeanaAggregation
example: An annotation created by a user through the Europeana portal
example: Any content created by the users through the service made available by Europeana for that purpose
scope note: Rationale: This class is used to tag objects that are the result of activity of Europeana, and, as such, objects on which Europeana holds rights
subclass of: E89 Propositional Object
subclass of: http://lodlaundromat.org/.well-known/genid/samples/jena///class//6177fda54d042f065cb8e89e071998cc/c46ef0e1a7e9b215d2c9066b02f88654#9
subclass of: http://lodlaundromat.org/.well-known/genid/samples/jena///class//6177fda54d042f065cb8e89e071998cc/6515c153e9f1dcbee79829339a7016be#9
subclass of: http://lodlaundromat.org/.well-known/genid/samples/jena///class//6177fda54d042f065cb8e89e071998cc/c46ef0e1a7e9b215d2c9066b02f88654#5
subclass of: http://lodlaundromat.org/.well-known/genid/samples/jena///class//6177fda54d042f065cb8e89e071998cc/6515c153e9f1dcbee79829339a7016be#5
subclass of: Information Resource
subclass of: http://lodlaundromat.org/.well-known/genid/samples/jena///class//6177fda54d042f065cb8e89e071998cc/c46ef0e1a7e9b215d2c9066b02f88654#50
subclass of: http://lodlaundromat.org/.well-known/genid/samples/jena///class//6177fda54d042f065cb8e89e071998cc/6515c153e9f1dcbee79829339a7016be#50

Is Annotation Of
range: Thing
domain: Thing
sub property of: Is Related To
range: http://lodlaundromat.org/.well-known/genid/samples/jena///class//6177fda54d042f065cb8e89e071998cc/c46ef0e1a7e9b215d2c9066b02f88654#36
type: ObjectProperty
definition: This property relates an annotation (a Europeana object) with the resource that it annotates.
sub property of: subject
sub property of: P67 refers to
domain: Europeana Object
range: http://lodlaundromat.org/.well-known/genid/samples/jena///class//6177fda54d042f065cb8e89e071998cc/6515c153e9f1dcbee79829339a7016be#36
type: Property
domain: http://lodlaundromat.org/.well-known/genid/samples/jena///class//6177fda54d042f065cb8e89e071998cc/c46ef0e1a7e9b215d2c9066b02f88654#43
domain: http://lodlaundromat.org/.well-known/genid/samples/jena///class//6177fda54d042f065cb8e89e071998cc/6515c153e9f1dcbee79829339a7016be#43
domain: Resource
range: Resource
domain: http://lodlaundromat.org/.well-known/genid/samples/jena///class//6177fda54d042f065cb8e89e071998cc/6515c153e9f1dcbee79829339a7016be#5
domain: http://lodlaundromat.org/.well-known/genid/samples/jena///class//6177fda54d042f065cb8e89e071998cc/c46ef0e1a7e9b215d2c9066b02f88654#9
domain: http://lodlaundromat.org/.well-known/genid/samples/jena///class//6177fda54d042f065cb8e89e071998cc/c46ef0e1a7e9b215d2c9066b02f88654#5
domain: E89 Propositional Object
domain: http://lodlaundromat.org/.well-known/genid/samples/jena///class//6177fda54d042f065cb8e89e071998cc/6515c153e9f1dcbee79829339a7016be#9
domain: Information Resource
domain: http://lodlaundromat.org/.well-known/genid/samples/jena///class//6177fda54d042f065cb8e89e071998cc/c46ef0e1a7e9b215d2c9066b02f88654#50
domain: http://lodlaundromat.org/.well-known/genid/samples/jena///class//6177fda54d042f065cb8e89e071998cc/6515c153e9f1dcbee79829339a7016be#50
domain: Web Resource

Is Derivative Of
inverse of: http://lodlaundromat.org/.well-known/genid/samples/jena///class//6177fda54d042f065cb8e89e071998cc/c46ef0e1a7e9b215d2c9066b02f88654#62
inverse of: http://lodlaundromat.org/.well-known/genid/samples/jena///class//6177fda54d042f065cb8e89e071998cc/c46ef0e1a7e9b215d2c9066b02f88654#63
sub property of: P130 shows features of
inverse of: http://lodlaundromat.org/.well-known/genid/samples/jena///class//6177fda54d042f065cb8e89e071998cc/c46ef0e1a7e9b215d2c9066b02f88654#64
inverse of: http://lodlaundromat.org/.well-known/genid/samples/jena///class//6177fda54d042f065cb8e89e071998cc/6515c153e9f1dcbee79829339a7016be#63
sub property of: R2 is derivative of
sub property of: relation
sub property of: Is Related To
inverse of: http://lodlaundromat.org/.well-known/genid/samples/jena///class//6177fda54d042f065cb8e89e071998cc/6515c153e9f1dcbee79829339a7016be#62
inverse of: http://lodlaundromat.org/.well-known/genid/samples/jena///class//6177fda54d042f065cb8e89e071998cc/6515c153e9f1dcbee79829339a7016be#64
type: Property
definition: This property captures a narrower notion of derivation than edm:isSimilarTo, in the sense that it relates a resource to another one, obtained by reworking, reducing, expanding, parts or the whole contents of the former, and possibly adding some minor parts. Versions have an even narrower meaning, in that it requires common identity between the related resources. Translations, summaries, abstractions etc. do not qualify as versions, but do qualify as derivatives.
sub property of: Is Similar To
equivalent property: R2 is derivative of
domain: http://lodlaundromat.org/.well-known/genid/samples/jena///class//6177fda54d042f065cb8e89e071998cc/c46ef0e1a7e9b215d2c9066b02f88654#43
domain: http://lodlaundromat.org/.well-known/genid/samples/jena///class//6177fda54d042f065cb8e89e071998cc/6515c153e9f1dcbee79829339a7016be#43
domain: Thing
domain: Resource

Aggregated Resource
subclass of: Resource
type: Class
comment: A resource which is included in an Aggregation. Note that asserting that a resource is a member of the class of Aggregated Resources does not imply anything other than that it is aggregated by at least one Aggregation.

Place
subclass of: Thing
subclass of: Place
subclass of: space-region
type: Class
subclass of: E53 Place
subclass of: F9 Place
subclass of: Resource
definition: An "extent in space, in particular on the surface of the earth, in the pure sense of physics: independent from temporal phenomena and matter" (CIDOC CRM)
subclass of: Non-Information Resource
equivalent class: space-region
equivalent class: Place
equivalent class: E53 Place
equivalent class: F9 Place

UGC
type: FunctionalProperty
range: http://lodlaundromat.org/.well-known/genid/samples/jena///class//6177fda54d042f065cb8e89e071998cc/c46ef0e1a7e9b215d2c9066b02f88654#60
type: DatatypeProperty
definition: This element is used to identify user generated content (also called user created content). It should be applied to all digitised or born digital content contributed by the general public and collected by Europeana through a crowdsourcing initiative or project.
range: http://lodlaundromat.org/.well-known/genid/samples/jena///class//6177fda54d042f065cb8e89e071998cc/6515c153e9f1dcbee79829339a7016be#60
type: Property
range: Resource

Is Representation Of
range: Thing
domain: Thing
sub property of: Is Related To
type: ObjectProperty
definition: This property associates an information resource to the resource (if any) that it represents
sub property of: subject
domain: Information Resource
sub property of: P138 represents
type: Property
domain: http://lodlaundromat.org/.well-known/genid/samples/jena///class//6177fda54d042f065cb8e89e071998cc/c46ef0e1a7e9b215d2c9066b02f88654#43
domain: http://lodlaundromat.org/.well-known/genid/samples/jena///class//6177fda54d042f065cb8e89e071998cc/6515c153e9f1dcbee79829339a7016be#43
domain: Resource
range: Resource
domain: http://lodlaundromat.org/.well-known/genid/samples/jena///class//6177fda54d042f065cb8e89e071998cc/6515c153e9f1dcbee79829339a7016be#5
domain: http://lodlaundromat.org/.well-known/genid/samples/jena///class//6177fda54d042f065cb8e89e071998cc/c46ef0e1a7e9b215d2c9066b02f88654#9
domain: http://lodlaundromat.org/.well-known/genid/samples/jena///class//6177fda54d042f065cb8e89e071998cc/c46ef0e1a7e9b215d2c9066b02f88654#5
domain: E89 Propositional Object
domain: http://lodlaundromat.org/.well-known/genid/samples/jena///class//6177fda54d042f065cb8e89e071998cc/6515c153e9f1dcbee79829339a7016be#9
domain: http://lodlaundromat.org/.well-known/genid/samples/jena///class//6177fda54d042f065cb8e89e071998cc/c46ef0e1a7e9b215d2c9066b02f88654#50
domain: http://lodlaundromat.org/.well-known/genid/samples/jena///class//6177fda54d042f065cb8e89e071998cc/6515c153e9f1dcbee79829339a7016be#50

Proxy
subclass of: Resource
subclass of: Thing
type: Class
comment: A Proxy represents an Aggregated Resource as it exists in a specific Aggregation. All assertions made about an entity are globally true, not only within the context of the Aggregation. As such, in order to make assertions which are only true of a resource as it exists in an Aggregation, a Proxy object is required. For example, one might want to cite an article as it appears in a specific journal, or assign aggregation-specific metadata to a Resource.

Current Location
range: Thing
domain: Thing
sub property of: location
sub property of: P55 has current location
domain: http://lodlaundromat.org/.well-known/genid/samples/jena///class//6177fda54d042f065cb8e89e071998cc/c46ef0e1a7e9b215d2c9066b02f88654#19
type: ObjectProperty
definition: The geographic location and/or name of the repository, building, site, or other entity whose boundaries presently include the resource.
sub property of: spatial
equivalent property: location
equivalent property: P55 has current location
domain: http://lodlaundromat.org/.well-known/genid/samples/jena///class//6177fda54d042f065cb8e89e071998cc/6515c153e9f1dcbee79829339a7016be#19
range: Place
type: Property
range: Resource
range: space-region
range: E53 Place
range: F9 Place
range: Non-Information Resource
domain: Resource

Has View
range: Thing
domain: Thing
sub property of: hasPart
type: ObjectProperty
definition: This property relates a ORE aggregation about a CHO with a web resource providing a view of that CHO. Examples of view are: a thumbnail, a textual abstract and a table of contents. The ORE aggregation may be a Europeana Aggregation, in which case the view is an object owned by Europeana (i.e., an instance of edm:EuropeanaObject) or an aggregation contributed by a content provider. In order to capture both these cases, the domain of edm:hasView is ore:Aggregation and its range is edm:WebResource
sub property of: Aggregates
domain: Aggregation
range: Web Resource
type: Property
range: Aggregated Resource
range: Resource
domain: Resource
domain: Collection
range: http://lodlaundromat.org/.well-known/genid/samples/jena///class//6177fda54d042f065cb8e89e071998cc/c46ef0e1a7e9b215d2c9066b02f88654#5
range: http://lodlaundromat.org/.well-known/genid/samples/jena///class//6177fda54d042f065cb8e89e071998cc/6515c153e9f1dcbee79829339a7016be#50
range: E89 Propositional Object
range: http://lodlaundromat.org/.well-known/genid/samples/jena///class//6177fda54d042f065cb8e89e071998cc/6515c153e9f1dcbee79829339a7016be#5
range: http://lodlaundromat.org/.well-known/genid/samples/jena///class//6177fda54d042f065cb8e89e071998cc/6515c153e9f1dcbee79829339a7016be#9
range: http://lodlaundromat.org/.well-known/genid/samples/jena///class//6177fda54d042f065cb8e89e071998cc/c46ef0e1a7e9b215d2c9066b02f88654#50
range: http://lodlaundromat.org/.well-known/genid/samples/jena///class//6177fda54d042f065cb8e89e071998cc/c46ef0e1a7e9b215d2c9066b02f88654#9
range: Information Resource

Event
subclass of: Temporality
subclass of: Resource
subclass of: Thing
type: Class
subclass of: F8 Event
subclass of: Event
subclass of: E4 Period
example: the change of custody of Mona Lisa
note: Events are identified either by the content provider or by Europeana enrichment at ingestion time
equivalent class: Event
example: the act of painting Mona Lisa
subclass of: http://lodlaundromat.org/.well-known/genid/samples/jena///class//6177fda54d042f065cb8e89e071998cc/c46ef0e1a7e9b215d2c9066b02f88654#4
subclass of: Non-Information Resource
example: the 2nd World War
scope note: Rationale:This class is a domain of edm:happenedAt and the domain of edm:occurredAt
equivalent class: E4 Period
equivalent class: Temporality
subclass of: http://lodlaundromat.org/.well-known/genid/samples/jena///class//6177fda54d042f065cb8e89e071998cc/6515c153e9f1dcbee79829339a7016be#4
definition: An event is a change "of states in cultural, social or physical systems, regardless of scale, brought about by a series or group of coherent physical, cultural, technological or legal phenomena" (E5 Event in CIDOC CRM) or a "set of coherent phenomena or cultural manifestations bounded in time and space" (E4 Period in CIDOC CRM)
equivalent class: F8 Event

http://lodlaundromat.org/.well-known/genid/samples/jena///class//6177fda54d042f065cb8e89e071998cc/c46ef0e1a7e9b215d2c9066b02f88654#14
type: Class
subclass of: Thing
subclass of: Resource
type: Restriction
cardinality: 1
on property: http://lodlaundromat.org/.well-known/genid/samples/jena///class//6177fda54d042f065cb8e89e071998cc/c46ef0e1a7e9b215d2c9066b02f88654#15

Incorporates
sub property of: Is Related To
sub property of: relation
sub property of: P130 shows features of
range: Thing
domain: Thing
sub property of: R14 incorporates
type: ObjectProperty
definition: This property captures the use of some resource to add value to another resource. Such resources may be nested, such as performing a theater play text, and then recording the performance, or creating an artful edition of a collection of poems or just aggregating various poems in an anthology. There may be no single part that contains ultimately the incorporated object, which may be dispersed in the presentation. Therefore, incorporated resources do in general not form proper parts. Incorporated resources are not part of the same resource, but are taken from other resources, and have an independent history. Therefore edm:incorporates is not a sub-property of dcterm:hasPart.
sub property of: Is Similar To
equivalent property: R14 incorporates
type: Property
range: Resource
domain: http://lodlaundromat.org/.well-known/genid/samples/jena///class//6177fda54d042f065cb8e89e071998cc/c46ef0e1a7e9b215d2c9066b02f88654#43
domain: http://lodlaundromat.org/.well-known/genid/samples/jena///class//6177fda54d042f065cb8e89e071998cc/6515c153e9f1dcbee79829339a7016be#43
domain: Resource

Web Resource
subclass of: Resource
subclass of: Thing
subclass of: E89 Propositional Object
subclass of: http://lodlaundromat.org/.well-known/genid/samples/jena///class//6177fda54d042f065cb8e89e071998cc/6515c153e9f1dcbee79829339a7016be#9
subclass of: http://lodlaundromat.org/.well-known/genid/samples/jena///class//6177fda54d042f065cb8e89e071998cc/c46ef0e1a7e9b215d2c9066b02f88654#5
type: Class
subclass of: http://lodlaundromat.org/.well-known/genid/samples/jena///class//6177fda54d042f065cb8e89e071998cc/6515c153e9f1dcbee79829339a7016be#5
subclass of: http://lodlaundromat.org/.well-known/genid/samples/jena///class//6177fda54d042f065cb8e89e071998cc/c46ef0e1a7e9b215d2c9066b02f88654#9
definition: Information Resources that have at least one Web Representation and at least a URI.
subclass of: Information Resource
subclass of: http://lodlaundromat.org/.well-known/genid/samples/jena///class//6177fda54d042f065cb8e89e071998cc/c46ef0e1a7e9b215d2c9066b02f88654#50
subclass of: http://lodlaundromat.org/.well-known/genid/samples/jena///class//6177fda54d042f065cb8e89e071998cc/6515c153e9f1dcbee79829339a7016be#50

http://lodlaundromat.org/.well-known/genid/samples/jena///class//6177fda54d042f065cb8e89e071998cc/6515c153e9f1dcbee79829339a7016be#3
subclass of: Resource
type: Class
subclass of: Thing
subclass of: Europeana Aggregation
subclass of: http://lodlaundromat.org/.well-known/genid/samples/jena///class//6177fda54d042f065cb8e89e071998cc/c46ef0e1a7e9b215d2c9066b02f88654#3
type: Restriction
cardinality: 1
on property: Aggregated Cultural Heritage Object
subclass of: Collection
subclass of: Europeana Object
subclass of: Web Resource
subclass of: Aggregation
subclass of: http://lodlaundromat.org/.well-known/genid/samples/jena///class//6177fda54d042f065cb8e89e071998cc/c46ef0e1a7e9b215d2c9066b02f88654#5
subclass of: http://lodlaundromat.org/.well-known/genid/samples/jena///class//6177fda54d042f065cb8e89e071998cc/6515c153e9f1dcbee79829339a7016be#5
subclass of: http://lodlaundromat.org/.well-known/genid/samples/jena///class//6177fda54d042f065cb8e89e071998cc/c46ef0e1a7e9b215d2c9066b02f88654#9
subclass of: E89 Propositional Object
subclass of: Information Resource
subclass of: http://lodlaundromat.org/.well-known/genid/samples/jena///class//6177fda54d042f065cb8e89e071998cc/6515c153e9f1dcbee79829339a7016be#9
subclass of: http://lodlaundromat.org/.well-known/genid/samples/jena///class//6177fda54d042f065cb8e89e071998cc/6515c153e9f1dcbee79829339a7016be#50
subclass of: http://lodlaundromat.org/.well-known/genid/samples/jena///class//6177fda54d042f065cb8e89e071998cc/c46ef0e1a7e9b215d2c9066b02f88654#50
equivalent class: Europeana Aggregation
equivalent class: http://lodlaundromat.org/.well-known/genid/samples/jena///class//6177fda54d042f065cb8e89e071998cc/c46ef0e1a7e9b215d2c9066b02f88654#3

Is Shown At
sub property of: hasPart
sub property of: Aggregates
type: Property
range: Thing
domain: Thing
type: ObjectProperty
definition: An unambiguous URL reference to the digital object on the provider’s web site in its full information context.
sub property of: Has View
range: Web Resource
range: Aggregated Resource
range: Resource
range: E89 Propositional Object
range: http://lodlaundromat.org/.well-known/genid/samples/jena///class//6177fda54d042f065cb8e89e071998cc/6515c153e9f1dcbee79829339a7016be#9
range: http://lodlaundromat.org/.well-known/genid/samples/jena///class//6177fda54d042f065cb8e89e071998cc/c46ef0e1a7e9b215d2c9066b02f88654#5
range: http://lodlaundromat.org/.well-known/genid/samples/jena///class//6177fda54d042f065cb8e89e071998cc/6515c153e9f1dcbee79829339a7016be#5
range: http://lodlaundromat.org/.well-known/genid/samples/jena///class//6177fda54d042f065cb8e89e071998cc/c46ef0e1a7e9b215d2c9066b02f88654#9
range: Information Resource
range: http://lodlaundromat.org/.well-known/genid/samples/jena///class//6177fda54d042f065cb8e89e071998cc/c46ef0e1a7e9b215d2c9066b02f88654#50
range: http://lodlaundromat.org/.well-known/genid/samples/jena///class//6177fda54d042f065cb8e89e071998cc/6515c153e9f1dcbee79829339a7016be#50
domain: Aggregation
domain: Resource
domain: Collection

Is Similar To
sub property of: Is Related To
sub property of: P130 shows features of
type: Property
definition: The most generic derivation property, covering also the case of questionable derivation. Is Similar To asserts that parts of the contents of one resource exhibit common features with respect to ideas, shapes, structures, colors, words, plots, topics with the contents of the related resource. Those common features may be attributed to a common origin or influence (in particular for derivation), but also to more generic cultural or psychological factors.
sub property of: relation
equivalent property: P130 shows features of
domain: http://lodlaundromat.org/.well-known/genid/samples/jena///class//6177fda54d042f065cb8e89e071998cc/c46ef0e1a7e9b215d2c9066b02f88654#43
domain: http://lodlaundromat.org/.well-known/genid/samples/jena///class//6177fda54d042f065cb8e89e071998cc/6515c153e9f1dcbee79829339a7016be#43
domain: Thing
domain: Resource

Resource Map
subclass of: Resource
type: Class
comment: A description of an Aggregation according to the OAI-ORE data model. Resource Maps are serialised to a machine readable format according to the implementation guidelines.
subclass of: Graph

Is Next In Sequence Of
sub property of: Is Related To
range: Thing
domain: Thing
type: ObjectProperty
definition: edm:isNextInSequence relates two resources S and R that are ordered parts of the same resource A, and such that S comes immediately after R in the order created by their being parts of A.
sub property of: relation
type: Property
domain: http://lodlaundromat.org/.well-known/genid/samples/jena///class//6177fda54d042f065cb8e89e071998cc/c46ef0e1a7e9b215d2c9066b02f88654#43
domain: http://lodlaundromat.org/.well-known/genid/samples/jena///class//6177fda54d042f065cb8e89e071998cc/6515c153e9f1dcbee79829339a7016be#43
domain: Resource
range: Resource

Has Met
sub property of: Is Related To
type: Property
definition: edm:hasMet relates a resource with the objects or phenomena that have happened to or have happened together with the resource under consideration. We can abstractly think of history and the present as a series of “meetings” between people and other things in space-time. Therefore we name this relationship as the things the object “has met” in the course of its existence. These meetings are events in the proper sense, in which other people and things participate in any role.
sub property of: relation
domain: http://lodlaundromat.org/.well-known/genid/samples/jena///class//6177fda54d042f065cb8e89e071998cc/c46ef0e1a7e9b215d2c9066b02f88654#43
domain: http://lodlaundromat.org/.well-known/genid/samples/jena///class//6177fda54d042f065cb8e89e071998cc/6515c153e9f1dcbee79829339a7016be#43
domain: Thing
domain: Resource

Provider
sub property of: Is Related To
sub property of: relation
type: Property
definition: The name or identifier of the organization who delivers data directly to an aggregation service (e.g. Europeana)
sub property of: Has Met
range: Agent
domain: http://lodlaundromat.org/.well-known/genid/samples/jena///class//6177fda54d042f065cb8e89e071998cc/c46ef0e1a7e9b215d2c9066b02f88654#43
domain: http://lodlaundromat.org/.well-known/genid/samples/jena///class//6177fda54d042f065cb8e89e071998cc/6515c153e9f1dcbee79829339a7016be#43
domain: Thing
domain: Resource
range: E39 Actor
range: Resource
range: Thing
range: http://lodlaundromat.org/.well-known/genid/samples/jena///class//6177fda54d042f065cb8e89e071998cc/6515c153e9f1dcbee79829339a7016be#50
range: Non-Information Resource
range: http://lodlaundromat.org/.well-known/genid/samples/jena///class//6177fda54d042f065cb8e89e071998cc/c46ef0e1a7e9b215d2c9066b02f88654#26
range: http://lodlaundromat.org/.well-known/genid/samples/jena///class//6177fda54d042f065cb8e89e071998cc/c46ef0e1a7e9b215d2c9066b02f88654#50
range: http://lodlaundromat.org/.well-known/genid/samples/jena///class//6177fda54d042f065cb8e89e071998cc/c46ef0e1a7e9b215d2c9066b02f88654#16
range: http://lodlaundromat.org/.well-known/genid/samples/jena///class//6177fda54d042f065cb8e89e071998cc/6515c153e9f1dcbee79829339a7016be#26
range: http://lodlaundromat.org/.well-known/genid/samples/jena///class//6177fda54d042f065cb8e89e071998cc/6515c153e9f1dcbee79829339a7016be#16

Similar To
type: Property
comment: The subject of this relationship MUST be an Aggregation. This Aggregation should be considered an expression within the ORE context of the object of the relationship, as it is broadly equivalent to the resource. For example, the Aggregation may consist of the resources which, together, make up a journal article which has a DOI assigned to it. The Aggregation is not the article to which the DOI was assigned, but is a representation of it in some manner.
domain: Aggregation
domain: Resource
domain: Thing
domain: Collection

Martin Doerr
type: Person

http://lodlaundromat.org/.well-known/genid/samples/jena///class//6177fda54d042f065cb8e89e071998cc/c46ef0e1a7e9b215d2c9066b02f88654#58
first: VIDEO
rest: http://lodlaundromat.org/.well-known/genid/samples/jena///class//6177fda54d042f065cb8e89e071998cc/c46ef0e1a7e9b215d2c9066b02f88654#59

Proxy For
type: Property
comment: Proxy objects are used to represent a Resource as it is aggregated in a particular Aggregation. The ore:proxyFor relationship is used to link the proxy to the Aggregated Resource it is a proxy for. The subject of the relationship is a Proxy object, and the object of the relationship is the Aggregated Resource.
domain: Proxy
range: Aggregated Resource
range: Resource
domain: Resource
domain: Thing

http://lodlaundromat.org/.well-known/genid/samples/jena///class//6177fda54d042f065cb8e89e071998cc/6515c153e9f1dcbee79829339a7016be#58
first: VIDEO
rest: http://lodlaundromat.org/.well-known/genid/samples/jena///class//6177fda54d042f065cb8e89e071998cc/6515c153e9f1dcbee79829339a7016be#59

End
domain: http://lodlaundromat.org/.well-known/genid/samples/jena///class//6177fda54d042f065cb8e89e071998cc/c46ef0e1a7e9b215d2c9066b02f88654#26
type: DatatypeProperty
definition: This property denotes the end date of a period of time.
sub property of: Is Related To
domain: http://lodlaundromat.org/.well-known/genid/samples/jena///class//6177fda54d042f065cb8e89e071998cc/6515c153e9f1dcbee79829339a7016be#26
type: Property
domain: http://lodlaundromat.org/.well-known/genid/samples/jena///class//6177fda54d042f065cb8e89e071998cc/c46ef0e1a7e9b215d2c9066b02f88654#43
domain: http://lodlaundromat.org/.well-known/genid/samples/jena///class//6177fda54d042f065cb8e89e071998cc/6515c153e9f1dcbee79829339a7016be#43
domain: Thing
domain: Resource

Unstored
type: Property
definition: This is a container element which includes all relevant information that otherwise cannot be mapped to another element in the ESE.

http://lodlaundromat.org/.well-known/genid/samples/jena///class//6177fda54d042f065cb8e89e071998cc/c46ef0e1a7e9b215d2c9066b02f88654#61
first: TRUE
rest: nil

http://lodlaundromat.org/.well-known/genid/samples/jena///class//6177fda54d042f065cb8e89e071998cc/6515c153e9f1dcbee79829339a7016be#61
first: TRUE
rest: nil

Describes
type: Property
comment: This relationship asserts that the subject (a Resource Map) describes the object (an Aggregation).
domain: Resource Map
range: Aggregation
inverse of: Is Described By
range: Collection
range: Resource
range: Thing
domain: Resource
domain: Graph

http://lodlaundromat.org/.well-known/genid/samples/jena///class//6177fda54d042f065cb8e89e071998cc/c46ef0e1a7e9b215d2c9066b02f88654#56
first: IMAGE
rest: http://lodlaundromat.org/.well-known/genid/samples/jena///class//6177fda54d042f065cb8e89e071998cc/c46ef0e1a7e9b215d2c9066b02f88654#57

Europeana
type: Organization

Antoine Isaac
type: Person

Begin
domain: http://lodlaundromat.org/.well-known/genid/samples/jena///class//6177fda54d042f065cb8e89e071998cc/c46ef0e1a7e9b215d2c9066b02f88654#16
type: DatatypeProperty
definition: This property denotes the start date of a period of time.
sub property of: Is Related To
domain: http://lodlaundromat.org/.well-known/genid/samples/jena///class//6177fda54d042f065cb8e89e071998cc/6515c153e9f1dcbee79829339a7016be#16
type: Property
domain: http://lodlaundromat.org/.well-known/genid/samples/jena///class//6177fda54d042f065cb8e89e071998cc/c46ef0e1a7e9b215d2c9066b02f88654#43
domain: http://lodlaundromat.org/.well-known/genid/samples/jena///class//6177fda54d042f065cb8e89e071998cc/6515c153e9f1dcbee79829339a7016be#43
domain: Thing
domain: Resource

http://lodlaundromat.org/.well-known/genid/samples/jena///class//6177fda54d042f065cb8e89e071998cc/6515c153e9f1dcbee79829339a7016be#56
first: IMAGE
rest: http://lodlaundromat.org/.well-known/genid/samples/jena///class//6177fda54d042f065cb8e89e071998cc/6515c153e9f1dcbee79829339a7016be#57

Participants of Europeana Version 1.0 Work Package on Further Specification of Functionality and Interoperability aspects of Europeana (WP3)
type: Organization

Proxy In
type: Property
comment: Proxy objects must link to the Aggregation in which the resource being proxied is aggregated. The ore:proxyIn relationship is used for this purpose. The subject of the relationship is a Proxy object, and the object of the relationship is the Aggregation.
domain: Proxy
range: Aggregation
range: Collection
range: Resource
range: Thing
domain: Resource
domain: Thing

Lamé, lanciert und broschiert
Europeana Type: IMAGE
format: image/jpeg
subject: Fotos
source: SLUB/Deutsche Fotothek
subject: Textilgewebe
type: Proxy
type: image
subject: Fotografie
coverage: Dresden
coverage: Frankreich
description: Lamé, lanciert und broschiert
subject: Kunstgewerbe
coverage: Staatliche Kunstsammlungen Dresden
date: 1701
language: de-DE
subject: Ortskatalog zur Kunst und Architektur
Has Type: IMAGE
P2 has type: IMAGE
Is Related To: IMAGE
relation: Staatliche Kunstsammlungen Dresden
relation: Frankreich
relation: Dresden
Has Met: Staatliche Kunstsammlungen Dresden
Has Met: Frankreich
Has Met: Dresden
Is Related To: Staatliche Kunstsammlungen Dresden
Is Related To: Frankreich
Is Related To: Dresden
Is Related To: de-DE
P2 has type: de-DE
Has Type: de-DE
type: http://lodlaundromat.org/.well-known/genid/samples/jena///class//6177fda54d042f065cb8e89e071998cc/6515c153e9f1dcbee79829339a7016be#29
type: http://lodlaundromat.org/.well-known/genid/samples/jena///class//6177fda54d042f065cb8e89e071998cc/c46ef0e1a7e9b215d2c9066b02f88654#29
type: Thing
Is Related To: Ortskatalog zur Kunst und Architektur
Is Related To: Kunstgewerbe
Is Related To: Fotografie
Is Related To: Textilgewebe
Is Related To: Fotos
Has Type: image/jpeg
P2 has type: image/jpeg
Is Related To: image/jpeg
relation: SLUB/Deutsche Fotothek
Is Derivative Of: SLUB/Deutsche Fotothek
P130 shows features of: SLUB/Deutsche Fotothek
Is Related To: SLUB/Deutsche Fotothek
Is Similar To: SLUB/Deutsche Fotothek
R2 is derivative of: SLUB/Deutsche Fotothek
type: http://lodlaundromat.org/.well-known/genid/samples/jena///class//6177fda54d042f065cb8e89e071998cc/6515c153e9f1dcbee79829339a7016be#49
type: http://lodlaundromat.org/.well-known/genid/samples/jena///class//6177fda54d042f065cb8e89e071998cc/c46ef0e1a7e9b215d2c9066b02f88654#35
type: http://lodlaundromat.org/.well-known/genid/samples/jena///class//6177fda54d042f065cb8e89e071998cc/6515c153e9f1dcbee79829339a7016be#25
type: http://lodlaundromat.org/.well-known/genid/samples/jena///class//6177fda54d042f065cb8e89e071998cc/c46ef0e1a7e9b215d2c9066b02f88654#49
type: http://lodlaundromat.org/.well-known/genid/samples/jena///class//6177fda54d042f065cb8e89e071998cc/6515c153e9f1dcbee79829339a7016be#42
type: http://lodlaundromat.org/.well-known/genid/samples/jena///class//6177fda54d042f065cb8e89e071998cc/c46ef0e1a7e9b215d2c9066b02f88654#42
type: http://lodlaundromat.org/.well-known/genid/samples/jena///class//6177fda54d042f065cb8e89e071998cc/c46ef0e1a7e9b215d2c9066b02f88654#25
type: http://lodlaundromat.org/.well-known/genid/samples/jena///class//6177fda54d042f065cb8e89e071998cc/6515c153e9f1dcbee79829339a7016be#35
Is Related To: 1701
relation: 1701
Has Met: 1701
type: http://lodlaundromat.org/.well-known/genid/samples/jena///class//6177fda54d042f065cb8e89e071998cc/c46ef0e1a7e9b215d2c9066b02f88654#43
type: http://lodlaundromat.org/.well-known/genid/samples/jena///class//6177fda54d042f065cb8e89e071998cc/6515c153e9f1dcbee79829339a7016be#43
P2 has type: image
Has Type: image
Is Related To: image
type: http://lodlaundromat.org/.well-known/genid/samples/jena///class//6177fda54d042f065cb8e89e071998cc/6515c153e9f1dcbee79829339a7016be#32
type: http://lodlaundromat.org/.well-known/genid/samples/jena///class//6177fda54d042f065cb8e89e071998cc/6515c153e9f1dcbee79829339a7016be#46
type: http://lodlaundromat.org/.well-known/genid/samples/jena///class//6177fda54d042f065cb8e89e071998cc/6515c153e9f1dcbee79829339a7016be#39
type: http://lodlaundromat.org/.well-known/genid/samples/jena///class//6177fda54d042f065cb8e89e071998cc/c46ef0e1a7e9b215d2c9066b02f88654#32
type: http://lodlaundromat.org/.well-known/genid/samples/jena///class//6177fda54d042f065cb8e89e071998cc/6515c153e9f1dcbee79829339a7016be#22
type: http://lodlaundromat.org/.well-known/genid/samples/jena///class//6177fda54d042f065cb8e89e071998cc/c46ef0e1a7e9b215d2c9066b02f88654#22
type: http://lodlaundromat.org/.well-known/genid/samples/jena///class//6177fda54d042f065cb8e89e071998cc/c46ef0e1a7e9b215d2c9066b02f88654#46
type: http://lodlaundromat.org/.well-known/genid/samples/jena///class//6177fda54d042f065cb8e89e071998cc/c46ef0e1a7e9b215d2c9066b02f88654#19
type: http://lodlaundromat.org/.well-known/genid/samples/jena///class//6177fda54d042f065cb8e89e071998cc/6515c153e9f1dcbee79829339a7016be#36
type: http://lodlaundromat.org/.well-known/genid/samples/jena///class//6177fda54d042f065cb8e89e071998cc/c46ef0e1a7e9b215d2c9066b02f88654#36
type: http://lodlaundromat.org/.well-known/genid/samples/jena///class//6177fda54d042f065cb8e89e071998cc/c46ef0e1a7e9b215d2c9066b02f88654#39
type: http://lodlaundromat.org/.well-known/genid/samples/jena///class//6177fda54d042f065cb8e89e071998cc/6515c153e9f1dcbee79829339a7016be#19

http://lodlaundromat.org/.well-known/genid/samples/jena///class//6177fda54d042f065cb8e89e071998cc/c46ef0e1a7e9b215d2c9066b02f88654#59
first: 3D
rest: nil

http://lodlaundromat.org/.well-known/genid/samples/jena///class//6177fda54d042f065cb8e89e071998cc/6515c153e9f1dcbee79829339a7016be#59
first: 3D
rest: nil

Participants of Europeana Version 1.0 Work Package on Further Specification of Functionality and Interoperability aspects of Europeana (WP3)
type: Organization

Country
type: Property
sub property of: P12 occurred in the presence of

Julia Iwanowa
type: Person

http://data.europeana.eu/proxy/europeana/01004/E17BBC456775874D778D9540864548CF298254C4
Has Met: http://semium.org/time/1701
Has Met: http://sws.geonames.org/2935022/
Has Met: http://sws.geonames.org/3017382/
Has Met: http://www.eionet.europa.eu/gemet/concept/13123
Has Met: http://www.eionet.europa.eu/gemet/concept/6205
Europeana Year: 1701
type: Proxy
Is Related To: http://semium.org/time/1701
Is Related To: http://sws.geonames.org/2935022/
Is Related To: http://sws.geonames.org/3017382/
Is Related To: http://www.eionet.europa.eu/gemet/concept/13123
Is Related To: http://www.eionet.europa.eu/gemet/concept/6205
relation: http://semium.org/time/1701
relation: http://sws.geonames.org/2935022/
relation: http://sws.geonames.org/3017382/
relation: http://www.eionet.europa.eu/gemet/concept/13123
relation: http://www.eionet.europa.eu/gemet/concept/6205
type: http://lodlaundromat.org/.well-known/genid/samples/jena///class//6177fda54d042f065cb8e89e071998cc/6515c153e9f1dcbee79829339a7016be#49
type: http://lodlaundromat.org/.well-known/genid/samples/jena///class//6177fda54d042f065cb8e89e071998cc/c46ef0e1a7e9b215d2c9066b02f88654#35
type: http://lodlaundromat.org/.well-known/genid/samples/jena///class//6177fda54d042f065cb8e89e071998cc/6515c153e9f1dcbee79829339a7016be#25
type: Thing
type: http://lodlaundromat.org/.well-known/genid/samples/jena///class//6177fda54d042f065cb8e89e071998cc/c46ef0e1a7e9b215d2c9066b02f88654#49
type: http://lodlaundromat.org/.well-known/genid/samples/jena///class//6177fda54d042f065cb8e89e071998cc/6515c153e9f1dcbee79829339a7016be#42
type: http://lodlaundromat.org/.well-known/genid/samples/jena///class//6177fda54d042f065cb8e89e071998cc/c46ef0e1a7e9b215d2c9066b02f88654#42
type: http://lodlaundromat.org/.well-known/genid/samples/jena///class//6177fda54d042f065cb8e89e071998cc/c46ef0e1a7e9b215d2c9066b02f88654#25
type: http://lodlaundromat.org/.well-known/genid/samples/jena///class//6177fda54d042f065cb8e89e071998cc/6515c153e9f1dcbee79829339a7016be#35
temporal: 1701
type: http://lodlaundromat.org/.well-known/genid/samples/jena///class//6177fda54d042f065cb8e89e071998cc/c46ef0e1a7e9b215d2c9066b02f88654#43
type: http://lodlaundromat.org/.well-known/genid/samples/jena///class//6177fda54d042f065cb8e89e071998cc/6515c153e9f1dcbee79829339a7016be#43
type: http://lodlaundromat.org/.well-known/genid/samples/jena///class//6177fda54d042f065cb8e89e071998cc/6515c153e9f1dcbee79829339a7016be#32
type: http://lodlaundromat.org/.well-known/genid/samples/jena///class//6177fda54d042f065cb8e89e071998cc/6515c153e9f1dcbee79829339a7016be#46
type: http://lodlaundromat.org/.well-known/genid/samples/jena///class//6177fda54d042f065cb8e89e071998cc/6515c153e9f1dcbee79829339a7016be#39
type: http://lodlaundromat.org/.well-known/genid/samples/jena///class//6177fda54d042f065cb8e89e071998cc/c46ef0e1a7e9b215d2c9066b02f88654#29
type: http://lodlaundromat.org/.well-known/genid/samples/jena///class//6177fda54d042f065cb8e89e071998cc/c46ef0e1a7e9b215d2c9066b02f88654#32
type: http://lodlaundromat.org/.well-known/genid/samples/jena///class//6177fda54d042f065cb8e89e071998cc/6515c153e9f1dcbee79829339a7016be#22
type: http://lodlaundromat.org/.well-known/genid/samples/jena///class//6177fda54d042f065cb8e89e071998cc/c46ef0e1a7e9b215d2c9066b02f88654#22
type: http://lodlaundromat.org/.well-known/genid/samples/jena///class//6177fda54d042f065cb8e89e071998cc/c46ef0e1a7e9b215d2c9066b02f88654#46
type: http://lodlaundromat.org/.well-known/genid/samples/jena///class//6177fda54d042f065cb8e89e071998cc/c46ef0e1a7e9b215d2c9066b02f88654#19
type: http://lodlaundromat.org/.well-known/genid/samples/jena///class//6177fda54d042f065cb8e89e071998cc/6515c153e9f1dcbee79829339a7016be#29
type: http://lodlaundromat.org/.well-known/genid/samples/jena///class//6177fda54d042f065cb8e89e071998cc/6515c153e9f1dcbee79829339a7016be#36
type: http://lodlaundromat.org/.well-known/genid/samples/jena///class//6177fda54d042f065cb8e89e071998cc/c46ef0e1a7e9b215d2c9066b02f88654#36
type: http://lodlaundromat.org/.well-known/genid/samples/jena///class//6177fda54d042f065cb8e89e071998cc/c46ef0e1a7e9b215d2c9066b02f88654#39
type: http://lodlaundromat.org/.well-known/genid/samples/jena///class//6177fda54d042f065cb8e89e071998cc/6515c153e9f1dcbee79829339a7016be#19

User Tag
type: Property
definition: This is a tag created by a user through the Europeana interface.
sub property of: description

Vassilis Tzouvaras
type: Person

The OAI ORE terms vocabulary
publisher: The Open Archives Initiative ORE Project
comment: The set of terms provided by the OAI ORE initiative
license: http://creativecommons.org/licenses/by-sa/3.0/

http://data.europeana.eu/aggregation/europeana/01004/E17BBC456775874D778D9540864548CF298254C4
Collection Name: 01004_L_DE_slub_DeutscheFotothek__fotos_ese.xml.gz
Europeana Language: de
Country: germany
Landing Page: http://www.europeana.eu/portal/record/01004/E17BBC456775874D778D9540864548CF298254C4.html
creator: Europeana
Preview: http://europeanastatic.eu/api/image
type: Europeana Aggregation
Is Related To: Europeana
relation: Europeana
Has Met: Europeana
type: Thing
type: Aggregation
type: Collection
P12 occurred in the presence of: germany
type: Europeana Object
type: http://lodlaundromat.org/.well-known/genid/samples/jena///class//6177fda54d042f065cb8e89e071998cc/c46ef0e1a7e9b215d2c9066b02f88654#3
type: http://lodlaundromat.org/.well-known/genid/samples/jena///class//6177fda54d042f065cb8e89e071998cc/6515c153e9f1dcbee79829339a7016be#3
type: Web Resource
type: http://lodlaundromat.org/.well-known/genid/samples/jena///class//6177fda54d042f065cb8e89e071998cc/6515c153e9f1dcbee79829339a7016be#5
type: http://lodlaundromat.org/.well-known/genid/samples/jena///class//6177fda54d042f065cb8e89e071998cc/6515c153e9f1dcbee79829339a7016be#9
type: E89 Propositional Object
type: http://lodlaundromat.org/.well-known/genid/samples/jena///class//6177fda54d042f065cb8e89e071998cc/c46ef0e1a7e9b215d2c9066b02f88654#5
type: Information Resource
type: http://lodlaundromat.org/.well-known/genid/samples/jena///class//6177fda54d042f065cb8e89e071998cc/c46ef0e1a7e9b215d2c9066b02f88654#9
has part: http://europeanastatic.eu/api/image
Has View: http://europeanastatic.eu/api/image
Aggregates: http://europeanastatic.eu/api/image
type: http://lodlaundromat.org/.well-known/genid/samples/jena///class//6177fda54d042f065cb8e89e071998cc/c46ef0e1a7e9b215d2c9066b02f88654#50
type: http://lodlaundromat.org/.well-known/genid/samples/jena///class//6177fda54d042f065cb8e89e071998cc/6515c153e9f1dcbee79829339a7016be#50
type: http://lodlaundromat.org/.well-known/genid/samples/jena///class//6177fda54d042f065cb8e89e071998cc/c46ef0e1a7e9b215d2c9066b02f88654#43
type: http://lodlaundromat.org/.well-known/genid/samples/jena///class//6177fda54d042f065cb8e89e071998cc/6515c153e9f1dcbee79829339a7016be#43

Data Provider
type: Property
definition: The name or identifier of the organisation who contributes data indirectly to an aggregation service (e.g. Europeana).
sub property of: provenance
domain: Aggregation
range: Agent
range: E39 Actor
range: Resource
range: Thing
range: http://lodlaundromat.org/.well-known/genid/samples/jena///class//6177fda54d042f065cb8e89e071998cc/6515c153e9f1dcbee79829339a7016be#50
range: Non-Information Resource
range: http://lodlaundromat.org/.well-known/genid/samples/jena///class//6177fda54d042f065cb8e89e071998cc/c46ef0e1a7e9b215d2c9066b02f88654#26
range: http://lodlaundromat.org/.well-known/genid/samples/jena///class//6177fda54d042f065cb8e89e071998cc/c46ef0e1a7e9b215d2c9066b02f88654#50
range: http://lodlaundromat.org/.well-known/genid/samples/jena///class//6177fda54d042f065cb8e89e071998cc/c46ef0e1a7e9b215d2c9066b02f88654#16
range: http://lodlaundromat.org/.well-known/genid/samples/jena///class//6177fda54d042f065cb8e89e071998cc/6515c153e9f1dcbee79829339a7016be#26
range: http://lodlaundromat.org/.well-known/genid/samples/jena///class//6177fda54d042f065cb8e89e071998cc/6515c153e9f1dcbee79829339a7016be#16
domain: Resource
domain: Thing
domain: Collection

Aggregates
type: Property
comment: Aggregations, by definition, aggregate resources. The ore:aggregates relationship expresses that the object resource is a member of the set of Aggregated Resources of the subject (the Aggregation). This relationship between the Aggregation and its Aggregated Resources is thus more specific than a simple part/whole relationship, as expressed by dcterms:hasPart for example.
sub property of: hasPart
domain: Aggregation
range: Aggregated Resource
inverse of: Is Aggregated By
range: Resource
domain: Resource
domain: Thing
domain: Collection

Europeana Data Model (EDM) vocabulary
contributor: Hugo Manguinhas
issued: 2010-03-25
creator: Antoine Isaac
contributor: Participants of Europeana Version 1.0 Work Package on Further Specification of Functionality and Interoperability aspects of Europeana (WP3)
type: Ontology
changes: ======= Changes between ontology file EDM version 5.2.4 (edm, was once EDM-v524-120820) and ontology file EDM version 5.2.3 (EDM-v523-120123) ======= 1. edm:isShownAt made a sub-property of edm:hasView 2. added edm:begin and edm:end and their mappings to CRM 3. added owl:Class declarations added for compatibility with some OWL-DL reasoners (feedback from Pedro Szekely, ISI) 4. added "of" at the end of the label for edm:isNextInSequence 5. added vocabulary metadata to follow Linked Open Vocabularies (http://lov.okfn.org/) and ADMS (https://joinup.ec.europa.eu/asset/adms/release/100) guidelines 6. removed a domain axiom on edm:hasMet 7. added edm:collectionName and edm:europeanaProxy 8. removed version number from file name 9. generalisation of Country, DataProvider and Provider 10. updated CRM namespace and CRM class and property identifiers 11. added FRBRoo mappings
to do list: ======= Remaining TODOs for ontology file EDM version 5.2.4 ======= - finish and check FRBRoo mappings according to the recommendations of the EDM-FRBRoo task force. Also include implicit mappings and mappings for elements outside the EDM namespace? - try to capture formal cardinality constraints resulting from "Obligation and Occurrence" documentation, which should be attached to non-EDM constructs (esp. ore:Aggregation) - continue adding documentation values (skos:scopeNote, skos:example, etc, according to 1.), starting from edm:InformationResource. Add all Europeana examples and rationale notes for non-EDM constructs - use specific EDM-doc properties for "rationale" and "obligation and occurrence". Use skos:definition for "Europeana definition", skos:example for "Example", skos:note for "Europeana note"
type: Vocabulary
contributor: Nasos Drosopoulos
contributor: Martin Doerr
version notes: The present specification is based on the document "Definition of the Europeana Data Model elements", originally edited by Carlo Meghini. It is aligned with the version 5.2.4 of these EDM Definitions.
example: data.europeana.eu
version info: 5.2.4
example: case-studies-edm
publisher: Europeana
preferred namespace prefix: edm
related web page: http://europeanalabs.eu/wiki/EDMPrototypingTask11
contributor: Vassilis Tzouvaras
description: The Europeana Data Model (EDM) is aimed at being an integration medium for collecting, connecting and enriching the descriptions provided by Europeana data providers. The RDF vocabulary for http://www.europeana.eu/schemas/edm/ defines the elements introduced by EDM (as opposed to the ones EDM re-uses from other namespaces).
contributor: Julia Iwanowa
modified: 2013-05-20
Is Related To: Europeana
relation: Europeana
Has Met: Europeana
Is Related To: Antoine Isaac
relation: Antoine Isaac
Has Met: Antoine Isaac
Is Related To: Hugo Manguinhas
Is Related To: Participants of Europeana Version 1.0 Work Package on Further Specification of Functionality and Interoperability aspects of Europeana (WP3)
Is Related To: Julia Iwanowa
Is Related To: Vassilis Tzouvaras
Is Related To: Nasos Drosopoulos
Is Related To: Martin Doerr
relation: Hugo Manguinhas
relation: Participants of Europeana Version 1.0 Work Package on Further Specification of Functionality and Interoperability aspects of Europeana (WP3)
relation: Julia Iwanowa
relation: Vassilis Tzouvaras
relation: Nasos Drosopoulos
relation: Martin Doerr
Has Met: Hugo Manguinhas
Has Met: Participants of Europeana Version 1.0 Work Package on Further Specification of Functionality and Interoperability aspects of Europeana (WP3)
Has Met: Julia Iwanowa
Has Met: Vassilis Tzouvaras
Has Met: Nasos Drosopoulos
Has Met: Martin Doerr
type: Thing
type: http://lodlaundromat.org/.well-known/genid/samples/jena///class//6177fda54d042f065cb8e89e071998cc/c46ef0e1a7e9b215d2c9066b02f88654#43
type: http://lodlaundromat.org/.well-known/genid/samples/jena///class//6177fda54d042f065cb8e89e071998cc/6515c153e9f1dcbee79829339a7016be#43

http://data.europeana.eu/aggregation/provider/01004/E17BBC456775874D778D9540864548CF298254C4
rights: Deutsche Fotothek
Is Shown At: obj32009297.html
Provider: Saxon State and University Library, Dresden / Deutsche Fotothek
type: Aggregation
relation: Saxon State and University Library, Dresden / Deutsche Fotothek
Is Related To: Saxon State and University Library, Dresden / Deutsche Fotothek
Has Met: Saxon State and University Library, Dresden / Deutsche Fotothek
type: Collection
type: Thing
has part: obj32009297.html
Aggregates: obj32009297.html
Has View: obj32009297.html
type: http://lodlaundromat.org/.well-known/genid/samples/jena///class//6177fda54d042f065cb8e89e071998cc/c46ef0e1a7e9b215d2c9066b02f88654#43
type: http://lodlaundromat.org/.well-known/genid/samples/jena///class//6177fda54d042f065cb8e89e071998cc/6515c153e9f1dcbee79829339a7016be#43
type: Aggregated Resource

Nasos Drosopoulos
type: Person

Lineage
type: Property
comment: ore:lineage is a relationship between two Proxy objects, both of which MUST have the same Resource for which they are proxies. The meaning is that the Resource for which the subject of the relationship is a Proxy was discovered in the Aggregation in which the object Proxy's resource is aggregated.
domain: Proxy
range: Proxy
range: Resource
range: Thing
domain: Resource
domain: Thing

http://lodlaundromat.org/.well-known/genid/samples/jena///class//6177fda54d042f065cb8e89e071998cc/c46ef0e1a7e9b215d2c9066b02f88654#57
first: SOUND
rest: http://lodlaundromat.org/.well-known/genid/samples/jena///class//6177fda54d042f065cb8e89e071998cc/c46ef0e1a7e9b215d2c9066b02f88654#58

http://lodlaundromat.org/.well-known/genid/samples/jena///class//6177fda54d042f065cb8e89e071998cc/6515c153e9f1dcbee79829339a7016be#57
first: SOUND
rest: http://lodlaundromat.org/.well-known/genid/samples/jena///class//6177fda54d042f065cb8e89e071998cc/6515c153e9f1dcbee79829339a7016be#58

Europeana Year
type: Property
definition: A point of time associated with an event in the life of the original analog or born digital object.
sub property of: temporal

Hugo Manguinhas
type: Person

Is Related To
domain: http://lodlaundromat.org/.well-known/genid/samples/jena///class//6177fda54d042f065cb8e89e071998cc/c46ef0e1a7e9b215d2c9066b02f88654#43
type: Property
definition: edm:isRelatedTo is the most general contextual property in EDM. Contextual properties have typically to do either with the things that have happened to or together with the object under consideration, or what the object refers to by its shape, form or features in a figural or encoded form. For sake of simplicity, we include in the contextual relationships also the scholarly classification, which may have either to do with the role and cultural connections of the object in the past, or its kind of structure, substance or contents as it can be verified at present.
domain: http://lodlaundromat.org/.well-known/genid/samples/jena///class//6177fda54d042f065cb8e89e071998cc/6515c153e9f1dcbee79829339a7016be#43
domain: Resource
domain: Thing

Is Aggregated By
type: Property
comment: The inverse relationship of ore:aggregates, ore:isAggregatedBy asserts that an Aggregated Resource is aggregated by an Aggregation.
sub property of: isPartOf
domain: Aggregated Resource
range: Aggregation
inverse of: Aggregates
range: Collection
range: Resource
range: Thing
domain: Resource

http://data.europeana.eu/rm/europeana/01004/E17BBC456775874D778D9540864548CF298254C4
use guidelines: metadata-usage-guidelines
contributor: Saxon State and University Library, Dresden / Deutsche Fotothek
publisher: Europeana
type: Resource Map
license: http://creativecommons.org/publicdomain/zero/1.0/
Is Related To: Europeana
relation: Europeana
Has Met: Europeana
type: Graph
Is Related To: Saxon State and University Library, Dresden / Deutsche Fotothek
relation: Saxon State and University Library, Dresden / Deutsche Fotothek
Has Met: Saxon State and University Library, Dresden / Deutsche Fotothek
type: Thing
type: http://lodlaundromat.org/.well-known/genid/samples/jena///class//6177fda54d042f065cb8e89e071998cc/c46ef0e1a7e9b215d2c9066b02f88654#43
type: http://lodlaundromat.org/.well-known/genid/samples/jena///class//6177fda54d042f065cb8e89e071998cc/6515c153e9f1dcbee79829339a7016be#43

Europeana Language
type: Property
definition: The value for this element is added by the Data Ingestion Team as part of the ingestion process, based on the language of the data provider.

Hugo Manguinhas
type: Person

Is Described By
type: Property
comment: The inverse relationship of ore:describes, in this case the object of the relationship is the Resource Map and the subject is the Aggregation which it describes.
domain: Aggregation
range: Resource Map
inverse of: Describes
range: Resource
range: Graph
domain: Resource
domain: Thing
domain: Collection

http://lodlaundromat.org/.well-known/genid/samples/jena///class//6177fda54d042f065cb8e89e071998cc/c46ef0e1a7e9b215d2c9066b02f88654#55
first: TEXT
rest: http://lodlaundromat.org/.well-known/genid/samples/jena///class//6177fda54d042f065cb8e89e071998cc/c46ef0e1a7e9b215d2c9066b02f88654#56

http://lodlaundromat.org/.well-known/genid/samples/jena///class//6177fda54d042f065cb8e89e071998cc/6515c153e9f1dcbee79829339a7016be#55
first: TEXT
rest: http://lodlaundromat.org/.well-known/genid/samples/jena///class//6177fda54d042f065cb8e89e071998cc/6515c153e9f1dcbee79829339a7016be#56