MIN
disjoint with: Nothing
subclass of: SP System class
subclass of: Resource
subclass of: Thing
subclass of: Aggregation
type: Class
comment: Represents MIN aggregations.

expression
sub property of: SP system property
sub property of: topDataProperty
property disjoint with: bottomDataProperty
type: DatatypeProperty
type: Property
comment: Points to an expression, for example in a Filter or Assignment.

has narrower transitive
sub property of: topObjectProperty
property disjoint with: has member
property disjoint with: has member list
type: TransitiveProperty
property disjoint with: is top concept in scheme
inverse of: has broader transitive
property disjoint with: has top concept
property disjoint with: is in scheme
property disjoint with: bottomObjectProperty
type: ObjectProperty
sub property of: is in semantic relation with
definition: skos:narrowerTransitive is a transitive superproperty of skos:narrower.
scope note: By convention, skos:narrowerTransitive is not used to make assertions. Rather, the properties can be used to draw inferences about the transitive closure of the hierarchical relation, which is useful e.g. when implementing a simple query expansion algorithm in a search application.
type: Property

documenter
sub property of: topObjectProperty
property disjoint with: accessed
property disjoint with: bottomObjectProperty
type: ObjectProperty
comment: Proveedor de documentación para el proyecto. @es
type: Property
comment: Collaborateur à la documentation du projet. @fr
comment: このプロジェクトのドキュメントの貢献者 @ja
label: dokumentarista @cs
label: Dokumentator @de
range: Person
label: escritor de ayuda @es
domain: Project
comment: Spoluautor dokumentace projektu. @cs
label: 文章制作者 @ja
comment: Contributor of documentation to the project.
label: rédacteur de l'aide @fr
comment: Mitarbeiter an der Dokumentation eines Projektes. @de

query
sub property of: topObjectProperty
property disjoint with: bottomObjectProperty
type: ObjectProperty
type: Property
sub property of: SP system property
range: Query
domain: Sub query
comment: Links a SubQuery resource with the nested Query.

arg5
sub property of: topObjectProperty
sub property of: arg
property disjoint with: bottomObjectProperty
type: ObjectProperty
type: Property
comment: The fifth argument of a function call. Further arguments are not common in SPARQL, therefore no sp:arg6, etc are defined here. However, they can be created if needed.

module
sub property of: topObjectProperty
property disjoint with: bottomObjectProperty
type: ObjectProperty
type: Property
comment: このリポジトリのモジュール名前 @ja
label: モジュール名前 @ja
label: modul @cs
label: Modul @de
label: módulo @es
comment: Jméno modulu v úložišti. @cs
comment: Nom du module d'un dépôt. @fr
comment: Module name of a repository.
comment: Nombre del módulo de un repositorio. @es
domain: http://lodlaundromat.org/.well-known/genid/samples/pellet///class//4f5f5734e1719911a6ea81b78b619b4b/bf83860cd7dab8f53104c5f50b382094#2
comment: Modul-Name eines Subversion. @de

Git Repository
disjoint with: Nothing
subclass of: Repository
subclass of: Thing
type: Class
label: Dépôt Git @fr
comment: Repositorio Git del código fuente. @es
label: Úložiště Git @cs
comment: Dépôt Git du code source. @fr
comment: Úložiště zdrojových kódů Git. @cs
label: Gitのリポジトリ @ja
label: Repositorio Git @es
label: Git repository @de
comment: ソースコードのGitのリポジトリ @ja
comment: Git source code repository.
comment: Git Quellcode-Versionierungssystem. @de

Creation Guideline
disjoint with: Nothing
disjoint with: File
subclass of: Plan
subclass of: Data Item
subclass of: InformationRealization
type: Class
subclass of: http://lodlaundromat.org/.well-known/genid/samples/pellet///class//4f5f5734e1719911a6ea81b78b619b4b/d3e700bc1857a8001f8ca87e5b965b3a#7
subclass of: Thing
subclass of: http://lodlaundromat.org/.well-known/genid/samples/pellet///class//4f5f5734e1719911a6ea81b78b619b4b/d3e700bc1857a8001f8ca87e5b965b3a#4
subclass of: Entity
comment: CreationGuideline is a concept that represents a guideline used to guide the execution of a data creation. Examples for creation guidelines are transformation rules, mapping definitions, entailment rules, and database queries.

Sensor
subclass of: Data Creator
disjoint with: Person
subclass of: Data Creating Device
subclass of: Thing
subclass of: Non-Human Agent
disjoint with: Organization
type: Class
disjoint with: Group
disjoint with: Data Creating Service
disjoint with: Human Agent
disjoint with: Nothing
disjoint with: Data Creating Entity
subclass of: Agent
disjoint with: Data Publisher

guided by
property disjoint with: accessed
sub property of: used
type: ObjectProperty
property disjoint with: serialized by
sub property of: topObjectProperty
property disjoint with: bottomObjectProperty
property disjoint with: involved exchange of
comment: This property refers to a creation guideline which guided the execution of a data creation. Examples for creation guidelines are transformation rules, mapping definitions, entailment rules, and database queries. Notice, all creation guidelines have provenance; we strongly encourage to describe this provenance as well, at least as far as available information permits.
domain: Data Creation
range: Creation Guideline

Construct
disjoint with: Nothing
subclass of: SP System class
subclass of: Query
subclass of: Resource
subclass of: Thing
subclass of: Command
type: Class
comment: A CONSTRUCT-type query that can be used to construct new triples from template triples (head) that use variable bindings from the match patterns (body).

Path
disjoint with: Nothing
subclass of: SP System class
subclass of: Resource
subclass of: Thing
type: Class
comment: The base class of SPARQL property path expressions. Paths are used by sp:TriplePath triple paths.

with
property disjoint with: all
property disjoint with: silent
property disjoint with: offset
type: DatatypeProperty
property disjoint with: varName
property disjoint with: bottomDataProperty
property disjoint with: separator
property disjoint with: distinct
property disjoint with: named
sub property of: topDataProperty
property disjoint with: order by
property disjoint with: bindings
property disjoint with: mod max
property disjoint with: having
property disjoint with: text
property disjoint with: result nodes
sub property of: SP system property
property disjoint with: limit
property disjoint with: default
property disjoint with: mod min
property disjoint with: group by
property disjoint with: reduced
property disjoint with: templates
type: Property
range: Resource
domain: Modify

Describe
disjoint with: Nothing
subclass of: SP System class
subclass of: Query
subclass of: Resource
subclass of: Thing
subclass of: Command
type: Class
comment: A DESCRIBE-type Query.

darcs Repository
disjoint with: Nothing
subclass of: Repository
subclass of: Thing
type: Class
label: Dépôt darcs @fr
comment: Dépôt darcs du code source. @fr
comment: Repositorio darcs del código fuente. @es
comment: darcs source code repository.
label: darcsのリポジトリ @ja
label: Repositorio darcs @es
comment: ソースコードのdarcsのリポジトリ @ja

platform
sub property of: topDataProperty
property disjoint with: bottomDataProperty
type: DatatypeProperty
type: Property
label: プラットフォーム @ja
comment: Indicator of software platform (non-OS specific), e.g. Java, Firefox, ECMA CLR
comment: このプロジェクトの必要なプラットフォーム（OSに関係ない）。例えば：Java、Firefox、ECMA CLRとか。 @ja
domain: Project
domain: Version
range: Literal

programming language
sub property of: topDataProperty
property disjoint with: bottomDataProperty
type: DatatypeProperty
comment: Programming language a project is implemented in or intended for use with.
range: Literal
comment: Lenguaje de programación en el que un proyecto es implementado o con el cuál pretende usarse. @es
comment: Programmiersprache in der ein Projekt implementiert ist oder intendiert wird zu benutzen. @de
comment: Langage de programmation avec lequel un projet est implémenté, ou avec lequel il est prévu de l'utiliser. @fr
comment: このプログラミングの実装のプログラミング言語、または目指した言語。 @ja
label: programovací jazyk @cs
comment: Programovací jazyk, ve kterém je projekt implementován nebo pro který je zamýšlen k použití. @cs
label: langage de programmation @fr
label: プログラミング言語 @ja
type: Property
label: lenguaje de programación @es
label: Programmiersprache @de
domain: Project

Order by condition
disjoint with: Nothing
subclass of: SP System class
subclass of: Resource
subclass of: Thing
type: Class
comment: An abstract base class for ascending or descending order conditions. Instances of this class (typically bnodes) must have a value for expression to point to the actual values.

Delete where
disjoint with: Nothing
subclass of: Update
subclass of: SP System class
subclass of: Resource
subclass of: Thing
subclass of: Command
type: Class
comment: An Update operation where the triples matched by the WHERE clause (sp:where) will be the triples deleted.

document
property disjoint with: distinct
property disjoint with: bindings
property disjoint with: reduced
property disjoint with: having
property disjoint with: order by
property disjoint with: bottomDataProperty
property disjoint with: mod min
sub property of: topDataProperty
property disjoint with: text
property disjoint with: default
type: DatatypeProperty
property disjoint with: offset
property disjoint with: varName
property disjoint with: mod max
property disjoint with: limit
property disjoint with: separator
property disjoint with: all
property disjoint with: silent
property disjoint with: templates
sub property of: SP system property
property disjoint with: result nodes
property disjoint with: named
property disjoint with: group by
type: Property
range: Resource
domain: Load
comment: The URI of the document to load using a LOAD Update operation.

Mod path
disjoint with: Nothing
subclass of: Path
subclass of: SP System class
subclass of: Resource
subclass of: Thing
type: Class
comment: A modified path such as rdfs:subClassOf*.

using named
property disjoint with: distinct
property disjoint with: text
property disjoint with: mod min
property disjoint with: bottomDataProperty
property disjoint with: result nodes
property disjoint with: reduced
property disjoint with: order by
property disjoint with: all
property disjoint with: silent
property disjoint with: having
type: DatatypeProperty
property disjoint with: group by
sub property of: topDataProperty
property disjoint with: named
property disjoint with: varName
property disjoint with: mod max
property disjoint with: limit
property disjoint with: templates
property disjoint with: default
property disjoint with: separator
sub property of: SP system property
property disjoint with: offset
property disjoint with: bindings
type: Property
range: Resource
domain: Modify

is in mapping relation with
property disjoint with: is in scheme
type: ObjectProperty
property disjoint with: has top concept
property disjoint with: bottomObjectProperty
property disjoint with: has member list
sub property of: topObjectProperty
sub property of: is in semantic relation with
property disjoint with: has member
property disjoint with: is top concept in scheme
definition: Relates two concepts coming, by convention, from different schemes, and that have comparable meanings
comment: These concept mapping relations mirror semantic relations, and the data model defined below is similar (with the exception of skos:exactMatch) to the data model defined for semantic relations. A distinct vocabulary is provided for concept mapping relations, to provide a convenient way to differentiate links within a concept scheme from links between concept schemes. However, this pattern of usage is not a formal requirement of the SKOS data model, and relies on informal definitions of best practice.
type: Property

from named
sub property of: SP system property
property disjoint with: distinct
property disjoint with: order by
property disjoint with: group by
property disjoint with: limit
property disjoint with: bindings
property disjoint with: named
property disjoint with: bottomDataProperty
property disjoint with: default
property disjoint with: mod min
property disjoint with: having
property disjoint with: reduced
type: DatatypeProperty
property disjoint with: templates
property disjoint with: separator
property disjoint with: varName
sub property of: topDataProperty
property disjoint with: all
property disjoint with: text
property disjoint with: offset
property disjoint with: result nodes
property disjoint with: mod max
property disjoint with: silent
type: Property
range: Resource
domain: Query
comment: Specifies a named RDF Dataset used by a Query (FROM NAMED syntax in SPARQL). Values of this property must be URI resources.

tester
sub property of: topObjectProperty
property disjoint with: accessed
property disjoint with: bottomObjectProperty
type: ObjectProperty
label: testeur @fr
comment: このプロジェクトのため、試験をする人や品質メンテナー。
label: Tester @de
range: Person
domain: Project
label: 試験者 @ja
comment: Tester nebo jiný spoluautor kontrolující kvalitu. @cs
comment: Un testeur ou un collaborateur au contrôle qualité. @fr
comment: Ein Tester oder anderer Mitarbeiter der Qualitätskontrolle. @de
comment: A tester or other quality control contributor.
type: Property
comment: Un tester u otro proveedor de control de calidad. @es

subject
property disjoint with: varName
property disjoint with: bottomDataProperty
property disjoint with: silent
property disjoint with: named
property disjoint with: templates
property disjoint with: text
property disjoint with: reduced
property disjoint with: separator
property disjoint with: distinct
property disjoint with: result nodes
property disjoint with: all
property disjoint with: mod max
property disjoint with: order by
type: DatatypeProperty
sub property of: topDataProperty
sub property of: SP system property
property disjoint with: default
property disjoint with: mod min
property disjoint with: offset
property disjoint with: having
property disjoint with: bindings
property disjoint with: limit
property disjoint with: group by
type: Property
range: Resource
domain: Tuple
comment: A resource or Variable describing the subject of a triple.

Data Item
disjoint with: Nothing
subclass of: Entity
subclass of: Thing
type: Class
comment: Immutable is a concept that represents entities which are immutable.

Query
disjoint with: Nothing
subclass of: SP System class
subclass of: Resource
subclass of: Thing
subclass of: Command
type: Class
comment: Abstract base class of the various types of supported queries. Common to all types of queries is that they can have a body ("WHERE clause").

all
property disjoint with: order by
property disjoint with: limit
sub property of: SP system property
property disjoint with: text
property disjoint with: from named
property disjoint with: varName
sub property of: topDataProperty
property disjoint with: result nodes
property disjoint with: bottomDataProperty
property disjoint with: document
property disjoint with: bindings
property disjoint with: using named
property disjoint with: mod min
property disjoint with: separator
property disjoint with: subject
property disjoint with: group by
property disjoint with: graph name node
property disjoint with: with
property disjoint with: having
property disjoint with: mod max
type: DatatypeProperty
property disjoint with: offset
property disjoint with: templates
type: Property
range: boolean
comment: Used in DROP and CLEAR.

Tuple
disjoint with: Nothing
subclass of: SP System class
subclass of: Resource
subclass of: Thing
type: Class
comment: Abstract base class for things that have subject and object.

has broader
property disjoint with: is in scheme
type: ObjectProperty
sub property of: topObjectProperty
property disjoint with: is top concept in scheme
property disjoint with: bottomObjectProperty
sub property of: has broader transitive
property disjoint with: has member
sub property of: is in semantic relation with
property disjoint with: has top concept
property disjoint with: has member list
inverse of: has narrower
definition: Relates a concept to a concept that is more general in meaning.
comment: Broader concepts are typically rendered as parents in a concept hierarchy (tree).
scope note: By convention, skos:broader is only used to assert an immediate (i.e. direct) hierarchical link between two conceptual resources.
type: Property

has member
property disjoint with: has narrower transitive
property disjoint with: has related match
property disjoint with: has exact match
property disjoint with: is in mapping relation with
property disjoint with: is in semantic relation with
sub property of: topObjectProperty
property disjoint with: is top concept in scheme
property disjoint with: has related
property disjoint with: has broader match
type: ObjectProperty
property disjoint with: bottomObjectProperty
property disjoint with: has narrower match
property disjoint with: has broader transitive
property disjoint with: has broader
property disjoint with: has narrower
property disjoint with: has top concept
property disjoint with: is in scheme
property disjoint with: has close match
definition: Relates a collection to one of its members.
domain: Collection
range: http://lodlaundromat.org/.well-known/genid/samples/pellet///class//4f5f5734e1719911a6ea81b78b619b4b/d8234c3b1439a879aea940e9009663be#1
type: Property

Select query
disjoint with: Nothing
subclass of: SP System class
subclass of: Query
subclass of: Resource
subclass of: Thing
subclass of: Command
type: Class
comment: A SELECT-type query that returns variable bindings as its result.

Insert
disjoint with: Nothing
subclass of: Modify
subclass of: Thing
subclass of: Update
subclass of: SP System class
type: Class
subclass of: Command
subclass of: Resource
type: DeprecatedClass
comment: Deprecated - use sp:Modify instead. Represents a INSERT INTO (part of SPARQL UPDATE language). The graph IRIs are stored in sp:graphIRI. The template patterns to delete are stored in sp:insertPattern. The WHERE clause is represented using sp:where.

Concept Scheme
disjoint with: Ordered Collection
disjoint with: Concept
disjoint with: http://lodlaundromat.org/.well-known/genid/samples/pellet///class//4f5f5734e1719911a6ea81b78b619b4b/d8234c3b1439a879aea940e9009663be#1
disjoint with: Nothing
disjoint with: Collection
subclass of: Thing
type: Class
definition: A set of concepts, optionally including statements about semantic relationships between those concepts.
scope note: A concept scheme may be defined to include concepts from different sources.
example: Thesauri, classification schemes, subject heading lists, taxonomies, 'folksonomies', and other types of controlled vocabulary are all examples of concept schemes. Concept schemes are also embedded in glossaries and terminologies.

where
sub property of: topObjectProperty
property disjoint with: bottomObjectProperty
type: ObjectProperty
type: Property
sub property of: SP system property
range: Element list
comment: The WHERE clause of a Query.

has top concept
property disjoint with: has member
property disjoint with: is in mapping relation with
property disjoint with: has member list
type: ObjectProperty
property disjoint with: has close match
property disjoint with: has broader
property disjoint with: has narrower match
property disjoint with: has narrower transitive
property disjoint with: has related
property disjoint with: has exact match
property disjoint with: is top concept in scheme
property disjoint with: has narrower
inverse of: is top concept in scheme
property disjoint with: has related match
property disjoint with: bottomObjectProperty
property disjoint with: is in scheme
sub property of: topObjectProperty
property disjoint with: is in semantic relation with
property disjoint with: has broader transitive
property disjoint with: has broader match
definition: Relates, by convention, a concept scheme to a concept which is topmost in the broader/narrower concept hierarchies for that scheme, providing an entry point to these hierarchies.
domain: Concept Scheme
range: Concept
type: Property

text
sub property of: topDataProperty
property disjoint with: from named
property disjoint with: using named
type: DatatypeProperty
property disjoint with: distinct
property disjoint with: reduced
property disjoint with: order by
property disjoint with: all
property disjoint with: group by
property disjoint with: graph name node
property disjoint with: having
property disjoint with: mod max
property disjoint with: offset
property disjoint with: document
property disjoint with: silent
property disjoint with: limit
property disjoint with: bottomDataProperty
property disjoint with: named
property disjoint with: subject
property disjoint with: templates
property disjoint with: default
property disjoint with: bindings
property disjoint with: with
sub property of: SP system property
property disjoint with: result nodes
property disjoint with: mod min
type: Property
range: string
comment: Can be attached to sp:Queries to store a textual representation of the query. This can be useful for tools that do not have a complete SPIN Syntax parser available.

Non-Human Agent
disjoint with: Data Creating Entity
disjoint with: Organization
subclass of: Agent
disjoint with: Human Agent
disjoint with: Group
disjoint with: Nothing
disjoint with: Data Publisher
subclass of: Thing
disjoint with: Person
type: Class
comment: NonHumanAgent is a general class that represents agents who are not social beings.

graph name node
property disjoint with: separator
sub property of: topDataProperty
property disjoint with: bindings
property disjoint with: text
property disjoint with: mod min
property disjoint with: named
property disjoint with: result nodes
property disjoint with: reduced
property disjoint with: limit
property disjoint with: silent
type: DatatypeProperty
property disjoint with: varName
sub property of: SP system property
property disjoint with: bottomDataProperty
property disjoint with: group by
property disjoint with: all
property disjoint with: order by
property disjoint with: offset
property disjoint with: default
property disjoint with: templates
property disjoint with: distinct
property disjoint with: having
property disjoint with: mod max
type: Property
range: Resource
domain: Named graph
comment: The name (URI or Variable) of a NamedGraph.

Element group
disjoint with: Nothing
subclass of: Element
subclass of: SP System class
subclass of: Resource
subclass of: Thing
type: Class
comment: Abstract base class of group patterns.

has broader match
property disjoint with: has member list
property disjoint with: is in scheme
sub property of: is in semantic relation with
type: ObjectProperty
property disjoint with: bottomObjectProperty
sub property of: topObjectProperty
sub property of: has broader transitive
property disjoint with: has top concept
property disjoint with: is top concept in scheme
sub property of: is in mapping relation with
inverse of: has narrower match
property disjoint with: has member
sub property of: has broader
definition: skos:broadMatch is used to state a hierarchical mapping link between two conceptual resources in different concept schemes.
type: Property

mod min
property disjoint with: graph name node
property disjoint with: having
property disjoint with: silent
property disjoint with: bindings
property disjoint with: subject
property disjoint with: document
property disjoint with: from named
property disjoint with: distinct
property disjoint with: group by
property disjoint with: with
property disjoint with: reduced
property disjoint with: varName
type: DatatypeProperty
property disjoint with: templates
property disjoint with: using named
property disjoint with: bottomDataProperty
property disjoint with: separator
sub property of: SP system property
property disjoint with: named
sub property of: topDataProperty
property disjoint with: result nodes
property disjoint with: text
property disjoint with: order by
property disjoint with: all
property disjoint with: default
type: Property
range: integer
domain: Mod path

arg
sub property of: topObjectProperty
property disjoint with: bottomObjectProperty
type: ObjectProperty
type: Property
comment: Abstract superproperty for the enumerated arg1, arg2 etc.

Ask
disjoint with: Nothing
subclass of: SP System class
subclass of: Query
subclass of: Resource
subclass of: Thing
subclass of: Command
type: Class
comment: An ASK query that returns true if the condition in the body is met by at least one result set.

Artifact
disjoint with: Nothing
subclass of: Thing
type: Class
type: DeprecatedClass
comment: This class is deprecated and will be removed from the Provenance Vocabulary in the next revision. prv:Artifact was deprecated in the process of making the Provenance Vocabulary a specialization of W3C's PROV-O. Hence, use prov:Entity (or the more specific prv:Immutable) instead.

browse
sub property of: topObjectProperty
property disjoint with: bottomObjectProperty
type: ObjectProperty
comment: Webové rozhraní pro prohlížení úložiště. @cs
comment: Web browser interface to repository.
comment: Interface web au dépôt. @fr
label: ウェブのユーザインタフェース @ja
comment: Interface web del repositorio. @es
label: navegar @es
comment: Web-Browser Interface für das Repository. @de
label: visualiser @fr
type: Property
domain: Repository
label: prohlížeč @cs
comment: このリポジトリのウェブのウェブのユーザインタフェース @ja

has related
property disjoint with: has member list
property disjoint with: has top concept
sub property of: topObjectProperty
sub property of: is in semantic relation with
property disjoint with: bottomObjectProperty
property disjoint with: is in scheme
type: ObjectProperty
property disjoint with: has member
type: SymmetricProperty
property disjoint with: is top concept in scheme
definition: Relates a concept to a concept with which there is an associative semantic relationship.
comment: skos:related is disjoint with skos:broaderTransitive
type: Property

involved exchange of
sub property of: topObjectProperty
property disjoint with: used
property disjoint with: guided by
property disjoint with: bottomObjectProperty
type: ObjectProperty
comment: This property refers to an HTTP message (request or response) that has been exchanged during an HTTP based data access.
domain: Data Access
range: Message

Data Access
disjoint with: Data Creation
disjoint with: Query Execution
disjoint with: Nothing
disjoint with: Measurement
subclass of: Activity
subclass of: Thing
type: Class
comment: DataAccess is a concept that represents the completed execution of an activity by which an immutable data item has been retrieved from the Web.
subclass of: http://lodlaundromat.org/.well-known/genid/samples/pellet///class//4f5f5734e1719911a6ea81b78b619b4b/d3e700bc1857a8001f8ca87e5b965b3a#2
subclass of: http://lodlaundromat.org/.well-known/genid/samples/pellet///class//4f5f5734e1719911a6ea81b78b619b4b/d3e700bc1857a8001f8ca87e5b965b3a#3

templates
property disjoint with: mod min
property disjoint with: default
property disjoint with: named
property disjoint with: mod max
property disjoint with: subject
property disjoint with: document
property disjoint with: bottomDataProperty
property disjoint with: using named
property disjoint with: reduced
property disjoint with: all
property disjoint with: distinct
property disjoint with: limit
property disjoint with: offset
property disjoint with: graph name node
property disjoint with: separator
sub property of: SP system property
type: DatatypeProperty
property disjoint with: from named
sub property of: topDataProperty
property disjoint with: varName
property disjoint with: silent
property disjoint with: with
property disjoint with: text
type: Property
range: List
domain: Construct
comment: Points to a list of TripleTemplates that form the head of a Construct query.

SUM
disjoint with: Nothing
subclass of: SP System class
subclass of: Resource
subclass of: Thing
subclass of: Aggregation
type: Class
comment: Represents sum aggregations, e.g. SELECT SUM(?varName)...

object
sub property of: SP system property
sub property of: topDataProperty
property disjoint with: bottomDataProperty
type: DatatypeProperty
type: Property
domain: Tuple
comment: An RDF Node or Variable describing the object of a triple.

Modify
disjoint with: Nothing
subclass of: Update
subclass of: SP System class
subclass of: Resource
subclass of: Thing
subclass of: Command
type: Class
comment: Represents a MODIFY (part of SPARQL UPDATE language). The graph IRIs are stored in sp:graphIRI. The template patterns are stored in sp:deletePattern and sp:insertPattern. The WHERE clause is represented using sp:where.

named
property disjoint with: bindings
property disjoint with: separator
property disjoint with: with
property disjoint with: templates
sub property of: topDataProperty
property disjoint with: using named
property disjoint with: bottomDataProperty
property disjoint with: graph name node
property disjoint with: order by
property disjoint with: text
property disjoint with: limit
property disjoint with: group by
property disjoint with: subject
property disjoint with: mod max
property disjoint with: document
property disjoint with: mod min
property disjoint with: varName
type: DatatypeProperty
property disjoint with: having
property disjoint with: result nodes
property disjoint with: from named
sub property of: SP system property
property disjoint with: offset
type: Property
range: boolean
comment: Used in DROP and CLEAR.

Human Agent
disjoint with: Nothing
disjoint with: Data Providing Service
disjoint with: WebClient
disjoint with: Non-Human Agent
subclass of: Agent
disjoint with: Server
disjoint with: Data Creating Service
disjoint with: Data Creating Device
disjoint with: WebServer
disjoint with: Service
type: Class
disjoint with: Sensor
disjoint with: Data Accessor
subclass of: Thing
comment: HumanAgent is a general class that represents agents who are social beings such as persons, organizations, companies.

Bind
disjoint with: Nothing
subclass of: Element
subclass of: SP System class
subclass of: Resource
subclass of: Thing
type: Class
comment: A BIND element.

group by
property disjoint with: subject
property disjoint with: named
property disjoint with: default
property disjoint with: limit
property disjoint with: distinct
property disjoint with: mod min
sub property of: SP system property
property disjoint with: graph name node
property disjoint with: with
property disjoint with: varName
property disjoint with: reduced
property disjoint with: silent
property disjoint with: document
property disjoint with: from named
property disjoint with: offset
property disjoint with: bottomDataProperty
sub property of: topDataProperty
property disjoint with: separator
property disjoint with: all
type: DatatypeProperty
property disjoint with: text
property disjoint with: using named
property disjoint with: mod max
type: Property
range: List
domain: Select query
comment: Points from a Query to the list of GROUP BY expressions.

short description
sub property of: topDataProperty
property disjoint with: bottomDataProperty
type: DatatypeProperty
label: Kurzbeschreibung @de
comment: Descripción corta (8 o 9 palabras) en texto plano de un proyecto. @es
comment: Short (8 or 9 words) plain text description of a project.
type: Property
label: description courte @fr
label: 簡単な説明 @ja
range: Literal
comment: Krátký (8 nebo 9 slov) čistě textový popis projektu. @cs
comment: 日本語の二十文字ぐらいの説明 @ja
label: descripción corta @es
comment: Kurzbeschreibung (8 oder 9 Wörter) eines Projects als einfacher Text. @de
comment: Texte descriptif concis (8 ou 9 mots) d'un projet. @fr
label: krátký popis @cs

Concept
disjoint with: Concept Scheme
disjoint with: Ordered Collection
disjoint with: Nothing
disjoint with: Collection
subclass of: http://lodlaundromat.org/.well-known/genid/samples/pellet///class//4f5f5734e1719911a6ea81b78b619b4b/d8234c3b1439a879aea940e9009663be#1
subclass of: Thing
type: Class
definition: An idea or notion; a unit of thought.

bug database
sub property of: topObjectProperty
property disjoint with: bottomObjectProperty
type: ObjectProperty
label: databáze chyb @cs
label: suivi des bugs @fr
label: Fehlerdatenbank @de
label: バグページ @ja
comment: Suivi des bugs pour un projet. @fr
comment: Bug tracker for a project.
comment: Fehlerdatenbank eines Projektes. @de
comment: Bug tracker para un proyecto. @es
comment: このプロジェクのバグ管理ページ @ja
type: Property
domain: Project
label: base de datos de bugs @es
comment: Správa chyb projektu. @cs

Olaf Hartig
different from: http://lodlaundromat.org/.well-known/genid/4f5f5734e1719911a6ea81b78b619b4b#10
different from: jita
type: Human Agent
type: Agent
type: Thing
type: Person

subgraph of
sub property of: topObjectProperty
property disjoint with: serialized by
property disjoint with: bottomObjectProperty
type: ObjectProperty
type: Property
comment: The graph associated with the subject is a subgraph of a graph equivalent to that associated with the object.
domain: Graph
range: Graph

Reverse link path
disjoint with: Nothing
subclass of: Path
subclass of: SP System class
subclass of: Resource
subclass of: Thing
type: Class

Data Providing Service
disjoint with: Organization
disjoint with: Data Publisher
disjoint with: Group
disjoint with: Nothing
disjoint with: Human Agent
disjoint with: Data Creating Entity
subclass of: Non-Human Agent
disjoint with: Person
subclass of: Agent
subclass of: Thing
type: Class
comment: DataProvidingService is a concept that represents a non-human agent - usually a Web service or a server - that processes data access requests and actually sends the requested Web representations over the Web.

arg1
sub property of: topObjectProperty
sub property of: arg
property disjoint with: bottomObjectProperty
type: ObjectProperty
type: Property
comment: The first argument of a function call.

reduced
sub property of: topDataProperty
property disjoint with: bindings
property disjoint with: group by
property disjoint with: separator
property disjoint with: graph name node
sub property of: SP system property
property disjoint with: text
property disjoint with: varName
property disjoint with: templates
property disjoint with: offset
property disjoint with: using named
property disjoint with: having
type: DatatypeProperty
property disjoint with: mod min
property disjoint with: document
property disjoint with: with
property disjoint with: limit
property disjoint with: from named
property disjoint with: result nodes
property disjoint with: order by
property disjoint with: bottomDataProperty
property disjoint with: subject
property disjoint with: mod max
type: Property
range: boolean
domain: Select query
comment: A property with true to indicate that a Select query has a REDUCED flag.

Filter
disjoint with: Nothing
subclass of: Element
subclass of: SP System class
subclass of: Resource
subclass of: Thing
type: Class
comment: A constraint element that evaluates a given expression to true or false.

used
sub property of: topObjectProperty
property disjoint with: bottomObjectProperty
type: ObjectProperty
comment: This property is deprecated and will be removed from the Provenance Vocabulary in the next revision. prv:employedArtifact was deprecated in the process of making the Provenance Vocabulary a specialization of W3C's PROV-O. Hence, use prov:used instead.
type: DeprecatedProperty

has broader transitive
sub property of: is in semantic relation with
type: ObjectProperty
property disjoint with: is in scheme
property disjoint with: has top concept
property disjoint with: is top concept in scheme
sub property of: topObjectProperty
type: TransitiveProperty
inverse of: has narrower transitive
property disjoint with: has member
property disjoint with: bottomObjectProperty
property disjoint with: has member list
definition: skos:broaderTransitive is a transitive superproperty of skos:broader.
scope note: By convention, skos:broaderTransitive is not used to make assertions. Rather, the properties can be used to draw inferences about the transitive closure of the hierarchical relation, which is useful e.g. when implementing a simple query expansion algorithm in a search application.
type: Property

DESCRIBE <http://aims.fao.org/aos/jita/O>
type: Query
type: Plan
type: http://lodlaundromat.org/.well-known/genid/samples/pellet///class//4f5f5734e1719911a6ea81b78b619b4b/d3e700bc1857a8001f8ca87e5b965b3a#7
type: Thing
type: http://lodlaundromat.org/.well-known/genid/samples/pellet///class//4f5f5734e1719911a6ea81b78b619b4b/d3e700bc1857a8001f8ca87e5b965b3a#4
type: Entity
type: InformationRealization
type: SPARQL Query
type: Command
type: Creation Guideline
type: Data Item
type: Describe
type: SP System class

Description of a Project (DOAP) vocabulary
rights: Copyright © 2004-2009 Edd Dumbill
description: Slovník Description of a Project (DOAP, Popis projektu), popsaný použitím W3C RDF Schema a Web Ontology Language. @cs
type: Thing
description: Das Vokabular "Description of a Project (DOAP)", beschrieben durch W3C RDF Schema and the Web Ontology Language. @de
description: Le vocabulaire Description Of A Project (DOAP, Description D'Un Projet), décrit en utilisant RDF Schema du W3C et OWL. @fr
format: application/rdf+xml
description: El vocabulario Description of a Project (DOAP, Descripción de un Proyecto), descrito usando RDF Schema de W3C y Web Ontology Language. @es
creator: Edd Dumbill
description: The Description of a Project (DOAP) vocabulary, described using W3C RDF Schema and the Web Ontology Language.
description: プロジェクトの説明の語彙(DOAP)。W3C RDF SchemaとWeb Ontology Languageで作られた。 @ja
maker: Edd Dumbill
type: Ontology
imports: index.rdf

Actor
disjoint with: Nothing
subclass of: Thing
type: Class
type: DeprecatedClass
comment: This class is deprecated and will be removed from the Provenance Vocabulary in the next revision. prv:Actor was deprecated in the process of making the Provenance Vocabulary a specialization of W3C's PROV-O. Hence, use one of the more specific classes prv:HumanAgent and prv:NonHumanAgent instead; or, if such a specialization is unsuitable for the use case at hand, directly use the general class prov:Agent as defined by PROV-O.

SAMPLE
disjoint with: Nothing
subclass of: SP System class
subclass of: Resource
subclass of: Thing
subclass of: Aggregation
type: Class
comment: Represents SAMPLE aggregations

File
subclass of: Entity
subclass of: http://lodlaundromat.org/.well-known/genid/samples/pellet///class//4f5f5734e1719911a6ea81b78b619b4b/d3e700bc1857a8001f8ca87e5b965b3a#7
subclass of: http://lodlaundromat.org/.well-known/genid/samples/pellet///class//4f5f5734e1719911a6ea81b78b619b4b/d3e700bc1857a8001f8ca87e5b965b3a#4
type: Class
disjoint with: Data Item
disjoint with: Dataset
disjoint with: Graph
disjoint with: Query
disjoint with: Query Template
disjoint with: Creation Guideline
disjoint with: SQL Query
disjoint with: Triplify Mapping
disjoint with: Statement
disjoint with: Nothing
disjoint with: Query Result
disjoint with: SPARQL Query
subclass of: Thing
comment: File is a general class that represents computer files/documents of any kind.

HTTP-based Data Access
disjoint with: Measurement
disjoint with: Nothing
disjoint with: Query Execution
disjoint with: Data Creation
type: Class
subclass of: Data Access
subclass of: Activity
subclass of: Thing
comment: An HTTPBasedDataAccess represents the completed execution of accessing a data item using the HTTP protocol.

mailing list
sub property of: topObjectProperty
property disjoint with: bottomObjectProperty
type: ObjectProperty
label: lista de correo @es
label: メーリングリスト @ja
type: Property
comment: メーリングリストのホームページやメールアドレス @ja
label: liste de diffusion @fr
comment: Domovská stránka nebo e–mailová adresa e–mailové diskuse. @cs
comment: Page web de la liste de diffusion, ou adresse de courriel. @fr
comment: Homepage der Mailing Liste oder E-Mail Adresse. @de
comment: Mailing list home page or email address.
label: Mailing Liste @de
label: e–mailová diskuse @cs
comment: Página web de la lista de correo o dirección de correo. @es
domain: Project

Data Creating Device
subclass of: Agent
subclass of: Thing
type: Class
disjoint with: Person
subclass of: Data Creator
disjoint with: Data Publisher
disjoint with: Data Creating Entity
disjoint with: Group
subclass of: Non-Human Agent
disjoint with: Human Agent
disjoint with: Nothing
disjoint with: Organization
disjoint with: Data Creating Service
comment: DataCreatingDevice is a concept that represents a device which performed the creation of a data item. Examples for data creating devices are sensors.

notation
sub property of: topDataProperty
property disjoint with: bottomDataProperty
type: DatatypeProperty
definition: A notation, also known as classification code, is a string of characters such as "T58.5" or "303.4833" used to uniquely identify a concept within the scope of a given concept scheme.
scope note: By convention, skos:notation is used with a typed literal in the object position of the triple.
type: Property

has narrower match
property disjoint with: has member
sub property of: has narrower
property disjoint with: bottomObjectProperty
inverse of: has broader match
sub property of: has narrower transitive
sub property of: is in semantic relation with
sub property of: is in mapping relation with
type: ObjectProperty
property disjoint with: is in scheme
property disjoint with: is top concept in scheme
property disjoint with: has member list
property disjoint with: has top concept
sub property of: topObjectProperty
definition: skos:narrowMatch is used to state a hierarchical mapping link between two conceptual resources in different concept schemes.
type: Property

Data Item
subclass of: http://lodlaundromat.org/.well-known/genid/samples/pellet///class//4f5f5734e1719911a6ea81b78b619b4b/d3e700bc1857a8001f8ca87e5b965b3a#4
subclass of: Entity
subclass of: Thing
disjoint with: File
subclass of: InformationRealization
disjoint with: Nothing
subclass of: http://lodlaundromat.org/.well-known/genid/samples/pellet///class//4f5f5734e1719911a6ea81b78b619b4b/d3e700bc1857a8001f8ca87e5b965b3a#7
type: Class
comment: DataItem is a general concept that represents data items of any kind.

GROUP_CONCAT
disjoint with: Nothing
subclass of: SP System class
subclass of: Resource
subclass of: Thing
subclass of: Aggregation
type: Class
comment: Represents GROUP_CONCAT aggregations.

Triplify Mapping
subclass of: Plan
subclass of: Entity
disjoint with: File
subclass of: http://lodlaundromat.org/.well-known/genid/samples/pellet///class//4f5f5734e1719911a6ea81b78b619b4b/d3e700bc1857a8001f8ca87e5b965b3a#4
subclass of: Creation Guideline
subclass of: InformationRealization
subclass of: Thing
disjoint with: Nothing
subclass of: http://lodlaundromat.org/.well-known/genid/samples/pellet///class//4f5f5734e1719911a6ea81b78b619b4b/d3e700bc1857a8001f8ca87e5b965b3a#7
subclass of: Data Item
type: Class
comment: TriplifyMapping is a concept that represents the mapping defined in a Triplify configuration file.

Data Creator
disjoint with: Nothing
subclass of: Agent
subclass of: Thing
type: Class
comment: DataCreator is a concept that represents an agent which performed the creation of a data item.

is top concept in scheme
type: ObjectProperty
property disjoint with: has narrower transitive
property disjoint with: has broader transitive
property disjoint with: has top concept
property disjoint with: has exact match
property disjoint with: has broader match
sub property of: topObjectProperty
sub property of: is in scheme
property disjoint with: is in mapping relation with
property disjoint with: is in semantic relation with
property disjoint with: has member
property disjoint with: has member list
property disjoint with: has narrower match
property disjoint with: has broader
inverse of: has top concept
property disjoint with: has close match
property disjoint with: has narrower
property disjoint with: has related match
property disjoint with: has related
property disjoint with: bottomObjectProperty
definition: Relates a concept to the concept scheme that it is a top level concept of.
type: Property
domain: Concept
range: Concept Scheme

sub path
sub property of: topObjectProperty
property disjoint with: bottomObjectProperty
type: ObjectProperty
type: Property
sub property of: SP system property
comment: The child path of a property path expression. This is used by ReversePath and ModPath.

old homepage
sub property of: topObjectProperty
sub property of: homepage
property disjoint with: bottomObjectProperty
type: InverseFunctionalProperty
type: ObjectProperty
label: stará domovská stránka @cs
label: 前のホームページ @ja
label: ancienne page web @fr
domain: Project
type: Property
comment: URL adresa předešlé domovské stránky projektu asociované s právě jedním projektem. @cs
comment: URL of a project's past homepage, associated with exactly one project.
label: Alte Homepage @de
comment: L'URL d'une ancienne page web d'un projet, associée avec un unique projet. @fr
comment: URL der letzten Projekt-Homepage, verbunden mit genau einem Projekt. @de
comment: El URL de la antigua página de un proyecto, asociada con exactamente un proyecto. @es
comment: このプロジェクトの前のホームページ。他のプロジェクトの前のホームページじゃないこと。 @ja
label: página web antigua @es

runs
sub property of: topObjectProperty
property disjoint with: bottomObjectProperty
type: ObjectProperty
comment: This property refers to the software that was run by a non-human actor (usually a service).
domain: Non-Human Agent

service endpoint
sub property of: topObjectProperty
property disjoint with: bottomObjectProperty
type: ObjectProperty
type: Property
label: サービスサイト @ja
comment: The URI of a web service endpoint where software as a service may be accessed
comment: ことプロジェクトが提供したサーブスを載せるサイト。 @ja
domain: Project
range: Resource

SKOS Vocabulary
description: An RDF vocabulary for describing the basic structure and content of concept schemes such as thesauri, classification schemes, subject heading lists, taxonomies, 'folksonomies', other types of controlled vocabulary, and also concept schemes embedded in glossaries and terminologies.
contributor: Participants in W3C's Semantic Web Deployment Working Group.
contributor: Nikki Rogers
contributor: Dave Beckett
type: Thing
type: Ontology
creator: Alistair Miles
creator: Sean Bechhofer

blog
sub property of: topObjectProperty
property disjoint with: bottomObjectProperty
type: ObjectProperty
type: Property
label: ブログ @ja
comment: URI of a blog related to a project
comment: このプロジェクトに関するブログのURI @ja
domain: Project
range: Resource

result nodes
property disjoint with: separator
property disjoint with: graph name node
property disjoint with: silent
sub property of: topDataProperty
property disjoint with: text
property disjoint with: limit
property disjoint with: offset
property disjoint with: mod max
property disjoint with: all
property disjoint with: mod min
property disjoint with: using named
property disjoint with: varName
sub property of: SP system property
property disjoint with: reduced
type: DatatypeProperty
property disjoint with: default
property disjoint with: with
property disjoint with: named
property disjoint with: document
property disjoint with: from named
property disjoint with: subject
property disjoint with: bottomDataProperty
property disjoint with: distinct
type: Property
range: List
domain: Describe
comment: Contains the result nodes (URI resources or Variables) of a Describe query.

Optional
disjoint with: Nothing
subclass of: Element
subclass of: Element group
subclass of: SP System class
subclass of: Resource
subclass of: Thing
type: Class
comment: An optional element in a query.

yielded by
sub property of: topObjectProperty
property disjoint with: bottomObjectProperty
type: ObjectProperty
comment: This property is deprecated and will be removed from the Provenance Vocabulary in the next revision. prv:yieldedBy was deprecated in the process of making the Provenance Vocabulary a specialization of W3C's PROV-O. Hence, use prov:wasGeneratedBy instead.
type: DeprecatedProperty

path1
sub property of: topObjectProperty
property disjoint with: bottomObjectProperty
type: ObjectProperty
type: Property
sub property of: SP system property
range: Path
comment: The first child path of a property path. Used by sp:AltPath and sp:SeqPath.

distinct
property disjoint with: from named
property disjoint with: subject
property disjoint with: with
property disjoint with: text
property disjoint with: bottomDataProperty
property disjoint with: varName
type: DatatypeProperty
property disjoint with: bindings
property disjoint with: document
property disjoint with: mod max
property disjoint with: having
property disjoint with: limit
sub property of: topDataProperty
sub property of: SP system property
property disjoint with: result nodes
property disjoint with: group by
property disjoint with: using named
property disjoint with: separator
property disjoint with: order by
property disjoint with: mod min
property disjoint with: graph name node
property disjoint with: offset
property disjoint with: templates
type: Property
range: boolean
domain: Select query
comment: A marker property to indicate that a Select query is of type SELECT DISTINCT.

has related match
type: SymmetricProperty
sub property of: is in semantic relation with
type: ObjectProperty
sub property of: topObjectProperty
property disjoint with: has member list
sub property of: is in mapping relation with
property disjoint with: has top concept
property disjoint with: is top concept in scheme
property disjoint with: has member
sub property of: has related
property disjoint with: bottomObjectProperty
property disjoint with: is in scheme
definition: skos:relatedMatch is used to state an associative mapping link between two conceptual resources in different concept schemes.
type: Property

created
sub property of: topDataProperty
property disjoint with: bottomDataProperty
type: DatatypeProperty
comment: Erstellungsdatum von Irgendwas, angegeben im YYYY-MM-DD Format, z.B. 2004-04-05. @de
label: erstellt @de
label: vytvořeno @cs
comment: Datum, kdy bylo něco vytvořeno ve formátu RRRR-MM-DD, např. 2004-04-05 @cs
comment: Fecha en la que algo fue creado, en formato AAAA-MM-DD. e.g. 2004-04-05 @es
label: 作成日付 @ja
range: Literal
type: Property
label: creado @es
comment: 何かが作成された日付、AAAA-MM-JJの型、例えば2004-04-05。 @ja
label: créé @fr
comment: Date when something was created, in YYYY-MM-DD form. e.g. 2004-04-05
comment: Date à laquelle a été créé quelque chose, au format AAAA-MM-JJ (par ex. 2004-04-05) @fr

http://lodlaundromat.org/.well-known/genid/4f5f5734e1719911a6ea81b78b619b4b#3
revision: 0.4
type: Thing
type: Version

executed at
sub property of: topDataProperty
property disjoint with: bottomDataProperty
type: DatatypeProperty
type: DeprecatedProperty
comment: This property has been renamed to prv:completedAt. Hence, prv:performedAt is deprecated and will be removed from the Provenance Vocabulary in the next revision.

silent
property disjoint with: mod min
property disjoint with: templates
property disjoint with: bindings
property disjoint with: mod max
type: DatatypeProperty
sub property of: SP system property
property disjoint with: result nodes
property disjoint with: using named
property disjoint with: offset
property disjoint with: order by
property disjoint with: varName
property disjoint with: document
property disjoint with: limit
property disjoint with: separator
property disjoint with: subject
property disjoint with: graph name node
property disjoint with: text
property disjoint with: having
property disjoint with: from named
sub property of: topDataProperty
property disjoint with: with
property disjoint with: bottomDataProperty
property disjoint with: group by
type: Property
range: boolean

developer
sub property of: topObjectProperty
property disjoint with: accessed
property disjoint with: bottomObjectProperty
type: ObjectProperty
comment: プロジェクトのソフトウェアの開発者 @ja
label: Entwickler @de
comment: Vývojář softwaru projektu. @cs
comment: Desarrollador de software para el proyecto. @es
comment: Développeur pour le projet. @fr
label: vývojář @cs
type: Property
comment: Developer of software for the project.
label: développeur @fr
domain: Project
label: 開発者 @ja
range: Person
comment: Software-Entwickler für eine Projekt. @de
label: desarrollador @es

retrieved by
sub property of: topObjectProperty
sub property of: wasGeneratedBy
property disjoint with: bottomObjectProperty
property disjoint with: created by
type: FunctionalProperty
type: ObjectProperty
comment: This property refers to the data access by which an immutable entity has been retrieved from the Web. Each entity that has this property is a Web representation.
domain: Data Item
domain: http://lodlaundromat.org/.well-known/genid/samples/pellet///class//4f5f5734e1719911a6ea81b78b619b4b/d3e700bc1857a8001f8ca87e5b965b3a#4
range: Data Access

name
sub property of: topDataProperty
property disjoint with: bottomDataProperty
type: DatatypeProperty
label: nombre @es
type: Property
comment: A name of something.
label: nom @fr
label: Name @de
sub property of: label
range: Literal
comment: El nombre de algo. @es
comment: Der Name von Irgendwas @de
comment: Jméno něčeho. @cs
comment: 何かの名前 @ja
label: 名前 @ja
label: jméno @cs
comment: Le nom de quelque chose. @fr

Jun Zhao
different from: http://lodlaundromat.org/.well-known/genid/4f5f5734e1719911a6ea81b78b619b4b#10
different from: jita
type: Human Agent
type: Agent
type: Thing
type: Person

bindings
property disjoint with: text
type: DatatypeProperty
property disjoint with: default
property disjoint with: subject
property disjoint with: named
property disjoint with: offset
property disjoint with: mod max
property disjoint with: document
property disjoint with: reduced
property disjoint with: varName
property disjoint with: limit
property disjoint with: using named
property disjoint with: graph name node
property disjoint with: with
property disjoint with: distinct
property disjoint with: all
property disjoint with: bottomDataProperty
property disjoint with: separator
property disjoint with: silent
sub property of: SP system property
sub property of: topDataProperty
property disjoint with: mod min
property disjoint with: from named
type: Property
range: List
domain: Values
comment: The actual bindings of a sp:Values element.

category
sub property of: topObjectProperty
property disjoint with: bottomObjectProperty
type: ObjectProperty
label: 分類 @ja
comment: Eine Kategorie eines Projektes. @de
comment: Kategorie projektu. @cs
comment: このプロジェクトの分類。 @ja
comment: A category of project.
label: categoría @es
domain: Project
label: kategorie @cs
comment: Una categoría de proyecto. @es
label: Kategorie @de
type: Property
comment: Une catégorie de projet. @fr
label: catégorie @fr

Triple
disjoint with: Nothing
subclass of: Tuple
subclass of: SP System class
subclass of: Resource
subclass of: Thing
type: Class
comment: A base class for TriplePattern and TripleTemplate. This basically specifies that subject, predicate and object must be present.

AVG
disjoint with: Nothing
subclass of: SP System class
subclass of: Resource
subclass of: Thing
subclass of: Aggregation
type: Class
comment: Represents AVG aggregations.

varName
property disjoint with: having
property disjoint with: subject
property disjoint with: silent
property disjoint with: document
property disjoint with: bindings
property disjoint with: offset
type: DatatypeProperty
property disjoint with: default
property disjoint with: graph name node
sub property of: topDataProperty
property disjoint with: mod max
property disjoint with: distinct
property disjoint with: order by
property disjoint with: limit
property disjoint with: using named
property disjoint with: from named
property disjoint with: with
property disjoint with: reduced
property disjoint with: result nodes
property disjoint with: templates
property disjoint with: bottomDataProperty
property disjoint with: group by
property disjoint with: all
property disjoint with: mod min
property disjoint with: named
sub property of: SP system property
type: Property
range: string
domain: Variable
comment: The name of a Variable.

Version
disjoint with: Nothing
subclass of: Thing
type: Class
comment: Información sobre la versión de un release del proyecto. @es
comment: リリースのバーション情報 @jp
comment: Détails sur une version d'une realease d'un projet. @fr
comment: Informace o uvolněné verzi projektu. @cs
label: バーション @ja
comment: Version information of a project release.
label: Verze @cs
comment: Versionsinformation eines Projekt Releases. @de
label: Versión @es

having
property disjoint with: using named
property disjoint with: from named
property disjoint with: with
property disjoint with: bottomDataProperty
property disjoint with: text
property disjoint with: distinct
property disjoint with: all
property disjoint with: mod max
property disjoint with: default
property disjoint with: offset
property disjoint with: separator
property disjoint with: graph name node
property disjoint with: mod min
property disjoint with: document
property disjoint with: reduced
sub property of: SP system property
property disjoint with: silent
sub property of: topDataProperty
type: DatatypeProperty
property disjoint with: limit
property disjoint with: named
property disjoint with: subject
property disjoint with: varName
type: Property
range: List
domain: Select query
comment: Points from a SELECT query to a list of HAVING expressions.

Variable
disjoint with: Nothing
subclass of: SP System class
subclass of: Resource
subclass of: Thing
type: Class
comment: A variable mentioned in a Triple or expression. Variables are often blank nodes with the variable name stored in ts:name. Variables can also be supplied with a URI in which case the system will attempt to reuse the same variable instance across multiple query definitions.

screenshots
sub property of: topObjectProperty
property disjoint with: bottomObjectProperty
type: ObjectProperty
comment: スクリーンショットのあるウェブページ @ja
domain: Project
label: スクリーンショット @ja
label: snímek obrazovky @cs
comment: Web page with screenshots of project.
type: Property
comment: Página web con capturas de pantalla del proyecto. @es
comment: Page web avec des captures d'écran du projet. @fr
label: Screenshots @de
comment: Webová stránka projektu se snímky obrazovky. @cs
comment: Web-Seite mit Screenshots eines Projektes. @de
label: captures d'écran @fr
label: capturas de pantalla @es

3.[Objects, Pragmatics and Technicalities]: specific level
has narrower transitive: SO
different from: jita
type: Concept
has narrower transitive: IT
type: http://lodlaundromat.org/.well-known/genid/samples/pellet///class//4f5f5734e1719911a6ea81b78b619b4b/d8234c3b1439a879aea940e9009663be#1
narrower: SO
has narrower transitive: SE
type: Thing
narrower: IT
is in semantic relation with: HO
has narrower transitive: TR
is in semantic relation with: SO
narrower: HO
is in semantic relation with: TR
is in semantic relation with: SE
is in semantic relation with: IT
narrower: SE
has narrower transitive: HO
is in scheme: jita
narrower: TR
preferred label: 3.[Obiecte, Aspecte pragmatice și tehnice]: nivel specific @ro
preferred label: 3.[Objecten, pragmatiek en formaliteiten]: specifiek niveau @nl
preferred label: 3.[Objetos, Aspetos pragmáticos e aspetos técnicos]: nível específico @pt
preferred label: 3.[Предмет, прагматика и организационные вопросы]: специфический уровень @ru
preferred label: 3.[Objetos, prácticas y aspectos técnicos]: nivel específico @es
preferred label: 3.[Oggetti, questioni pragmatiche e tecniche]: livello specifico @it
preferred label: 3.[Objekty, Praktické otázky a techniky]: specifická úroveň @cs
preferred label: 3.[Objekt, Pragmatik och Teknikaliteter]: specifik nivå @sv
preferred label: 3.[Obiekty, Pragmatyka i aspekty techniczne]: poziom szczegółowy @pl
preferred label: 3.[Nesneler, Pragmatik ve Teknik ayrıntılar]: özel düzey @tr
preferred label: 3.[Πραγματογνωσία, πραγματολογία και τεχνικές λεπτομέρειες]: ειδικό επίπεδο @el
preferred label: 3.[Objets, questions pratiques et techniques]: niveau spécifique @fr
preferred label: 3. [ الكائنات ، البراجماتية والجوانب الفنية] : مستوى معين @ar
preferred label: 3.[Aspectes tècnics, pràctics i suports]: nivell específic @ca

arg2
sub property of: topObjectProperty
sub property of: arg
property disjoint with: bottomObjectProperty
type: ObjectProperty
type: Property
comment: The second argument of a function call.

Load
disjoint with: Nothing
subclass of: Update
subclass of: SP System class
subclass of: Resource
subclass of: Thing
subclass of: Command
type: Class
comment: A LOAD Update operation. The document to load is specified using sp:document, and the (optional) target graph using sp:into.

Specification
disjoint with: Nothing
subclass of: Resource
subclass of: Thing
type: Class
label: 明細書じ @ja
comment: A specification of a system's aspects, technical or otherwise.
comment: あるシステムの詳しく書いた明細書。多分技術的なもの。 @ja

Project
disjoint with: Nothing
subclass of: Project
subclass of: Thing
type: Class
label: Proyecto @es
comment: プログラミングのプロジェクト @ja
comment: Projekt. @cs
label: Projet @fr
comment: Un proyecto. @es
label: Projekt @cs
comment: Ein Projekt. @de
label: Prijekt @de
comment: Un projet. @fr
comment: A project.
label: プロジェクト @ja

Not exists
disjoint with: Nothing
subclass of: Element
subclass of: Element group
subclass of: SP System class
subclass of: Resource
subclass of: Thing
type: Class
comment: A NOT EXISTS element group.

offset
property disjoint with: varName
property disjoint with: named
property disjoint with: order by
property disjoint with: all
property disjoint with: document
property disjoint with: separator
property disjoint with: default
property disjoint with: reduced
property disjoint with: result nodes
property disjoint with: templates
type: DatatypeProperty
property disjoint with: from named
property disjoint with: bottomDataProperty
property disjoint with: using named
property disjoint with: with
property disjoint with: bindings
property disjoint with: graph name node
property disjoint with: distinct
property disjoint with: text
sub property of: topDataProperty
property disjoint with: having
property disjoint with: silent
property disjoint with: group by
property disjoint with: subject
sub property of: SP system property
type: Property
range: long
domain: Query
comment: The OFFSET solution modifier of a Query.

Data Publisher
disjoint with: Data Accessor
disjoint with: Non-Human Agent
disjoint with: WebServer
subclass of: Agent
disjoint with: WebClient
disjoint with: Service
disjoint with: Server
disjoint with: Sensor
subclass of: Thing
disjoint with: Data Creating Service
disjoint with: Data Providing Service
disjoint with: Data Creating Device
type: Class
subclass of: Human Agent
disjoint with: Nothing
comment: DataPublisher is a concept that represents entities such as persons, groups, or organizations who use a data providing service (see concept prv:DataProvidingService) to publish data on the Web.

http://lodlaundromat.org/.well-known/genid/4f5f5734e1719911a6ea81b78b619b4b#9
was associated with: jita
performed by: http://lodlaundromat.org/.well-known/genid/4f5f5734e1719911a6ea81b78b619b4b#10
accessed: jita
different from: http://lodlaundromat.org/.well-known/genid/4f5f5734e1719911a6ea81b78b619b4b#5
type: Activity
different from: http://lodlaundromat.org/.well-known/genid/4f5f5734e1719911a6ea81b78b619b4b#7
was associated with: http://lodlaundromat.org/.well-known/genid/4f5f5734e1719911a6ea81b78b619b4b#10
type: Data Access
executed at: 2015-02-20T08:17:14.456Z
type: Thing

MAX
disjoint with: Nothing
subclass of: SP System class
subclass of: Resource
subclass of: Thing
subclass of: Aggregation
type: Class
comment: Represents MAX aggregations.

repository location
sub property of: topObjectProperty
property disjoint with: bottomObjectProperty
type: ObjectProperty
comment: このリポジトリの場所。 @ja
label: umístění úložiště @cs
comment: Lokation eines Repositorys. @de
label: lugar del respositorio @es
type: Property
comment: Location of a repository.
domain: Repository
label: emplacement du dépôt @fr
comment: lugar de un repositorio. @es
label: Repository Lokation @de
comment: Emplacement d'un dépôt. @fr
label: このリポジトリのURL @ja
comment: Umístění úložiště. @cs

involved
sub property of: topObjectProperty
property disjoint with: bottomObjectProperty
type: ObjectProperty
comment: This property is deprecated and will be removed from the Provenance Vocabulary in the next revision. prv:involvedActor was deprecated in the process of making the Provenance Vocabulary a specialization of W3C's PROV-O. Hence, use prov:wasAssociatedWith instead.
type: DeprecatedProperty

Triple path
disjoint with: Nothing
subclass of: Element
subclass of: Tuple
subclass of: SP System class
subclass of: Resource
subclass of: Thing
type: Class
comment: Similar to a TriplePattern, but with a path expression as its predicate. For example, this can be used to express transitive sub-class relationships (?subClass rdfs:subClassOf* ?superClass).

Named graph
disjoint with: Nothing
subclass of: Element
subclass of: Element group
subclass of: SP System class
subclass of: Resource
subclass of: Thing
type: Class
comment: A named Graph element such as GRAPH <uri> {...}.

equivalent graph
sub property of: topObjectProperty
property disjoint with: serialized by
property disjoint with: bottomObjectProperty
type: ObjectProperty
type: Property
comment: The graphs associated with the subject and object are equivalent.
domain: Graph
range: Graph

GNU Arch repository
disjoint with: Nothing
subclass of: Repository
subclass of: http://lodlaundromat.org/.well-known/genid/samples/pellet///class//4f5f5734e1719911a6ea81b78b619b4b/bf83860cd7dab8f53104c5f50b382094#2
subclass of: Thing
type: Class
label: GNU Archのリポジトリ @ja
label: Dépôt GNU Arch @fr
comment: GNU Arch source code repository.
comment: Úložiště zdrojových kódů GNU Arch. @cs
label: Repositorio GNU Arch @es
comment: Dépôt GNU Arch du code source. @fr
label: Úložiště GNU Arch @cs
comment: ソースコードのGNU Archのリポジトリ @ja
comment: Repositorio GNU Arch del código fuente. @es
comment: GNU Arch Quellcode-Versionierungssystem. @de

file-release
sub property of: topObjectProperty
property disjoint with: bottomObjectProperty
type: ObjectProperty
type: Property
label: soubor revize @cs
label: ファイル @ja
comment: URI of download associated with this release.
comment: URI adresa stažení asociované s revizí. @cs
label: このリリースのダウンロードできるファイルのURI @ja
domain: Version

Data Creating Service
disjoint with: Group
subclass of: Non-Human Agent
disjoint with: Nothing
disjoint with: Person
type: Class
subclass of: Agent
disjoint with: Data Publisher
disjoint with: Data Creating Entity
disjoint with: Data Creating Device
disjoint with: Human Agent
subclass of: Data Creator
disjoint with: Sensor
disjoint with: Organization
subclass of: Thing
comment: DataCreatingService is a concept that represents a software service which performed the creation of a data item. Examples for data creating services are reasoners, query engines, and workflow engines.

order by
property disjoint with: default
property disjoint with: limit
property disjoint with: distinct
property disjoint with: offset
sub property of: topDataProperty
property disjoint with: varName
property disjoint with: bottomDataProperty
property disjoint with: using named
property disjoint with: named
sub property of: SP system property
property disjoint with: from named
property disjoint with: with
property disjoint with: text
property disjoint with: silent
property disjoint with: mod min
property disjoint with: graph name node
property disjoint with: mod max
property disjoint with: reduced
type: DatatypeProperty
property disjoint with: separator
property disjoint with: document
property disjoint with: subject
property disjoint with: all
type: Property
range: List
domain: Query
comment: Links a query with an ORDER BY clause where the values are rdf:List containing OrderByConditions or expressions. While the domain of this property is sp:Query, only Describe and Select queries can have values of it.

Mercurial Repository
disjoint with: Nothing
subclass of: Repository
subclass of: Thing
type: Class
label: Mercurialのリポジトリ @ja
comment: Mercurial source code repository.
comment: ソースコードのMercurialのリポジトリ @ja

Sub query
disjoint with: Nothing
subclass of: Element
subclass of: SP System class
subclass of: Resource
subclass of: Thing
type: Class
comment: A nested SELECT query inside of an element list. The query is stored in sp:query.

Insert data
disjoint with: Nothing
subclass of: Update
subclass of: SP System class
subclass of: Resource
subclass of: Thing
subclass of: Command
type: Class
comment: An Update operation to insert specific triples. The graph triples are represented using sp:data, which points to an rdf:List of sp:Triples or sp:NamedGraphs.

operating system
sub property of: topDataProperty
property disjoint with: bottomDataProperty
type: DatatypeProperty
label: operační systém @cs
comment: Système d'exploitation auquel est limité le projet. Omettez cette propriété si le projet n'est pas limité à un système d'exploitation. @fr
type: Property
comment: Sistema opertivo al cuál está limitado el proyecto. Omita esta propiedad si el proyecto no es específico de un sistema opertaivo en particular. @es
label: système d'exploitation @fr
comment: Betriebssystem auf dem das Projekt eingesetzt werden kann. Diese Eigenschaft kann ausgelassen werden, wenn das Projekt nicht BS-spezifisch ist. @de
range: Literal
label: Betriebssystem @de
comment: このプロジェクトの限られたオペレーティングシステム。もし、プロジェクトはどのOSも大丈夫なら、このプロパティを書き落としていい。 @ja
label: sistema operativo @es
comment: Operační systém, na jehož použití je projekt limitován. Vynechejte tuto vlastnost, pokud je projekt nezávislý na operačním systému. @cs
domain: Project
comment: Operating system that a project is limited to. Omit this property if the project is not OS-specific.
label: オペレーティングシステム @ja
domain: Version

license
sub property of: topObjectProperty
property disjoint with: bottomObjectProperty
type: ObjectProperty
comment: L'URI d'une description RDF de la licence sous laquelle le programme est distribué. @fr
type: Property
comment: El URI de una descripción RDF de la licencia bajo la cuál se distribuye el software. @es
comment: Die URI einer RDF-Beschreibung einer Lizenz unter der die Software herausgegeben wird. @de
label: Lizenz @de
comment: URI adresa RDF popisu licence, pod kterou je software distribuován. @cs
comment: このプロジェクトの散布ライセンスのRDF説明のURI @ja
label: licence @fr
label: licencia @es
comment: The URI of an RDF description of the license the software is distributed under.
label: ライセンス @ja

revision
sub property of: topDataProperty
property disjoint with: bottomDataProperty
type: DatatypeProperty
comment: Revision identifier of a software release.
comment: Indentificador de la versión de un release de software. @es
label: Version @de
comment: Identifikátor zpřístupněné revize softwaru. @cs
domain: Version
type: Property
label: リビジョンコート @ja
comment: Versionsidentifikator eines Software-Releases. @de
label: révision @fr
label: versión @es
comment: Identifiant de révision d'une release du programme. @fr
comment: このリリースのリビジョン識別子 @ja
range: Literal
label: verze @cs

translator
sub property of: topObjectProperty
property disjoint with: accessed
property disjoint with: bottomObjectProperty
type: ObjectProperty
label: traductor @es
range: Person
label: 翻訳者 @ja
type: Property
comment: Proveedor de traducciones al proyecto. @es
comment: Mitarbeiter an den Übersetzungen eines Projektes. @de
domain: Project
label: Übersetzer @de
comment: Contributor of translations to the project.
comment: Collaborateur à la traduction du projet. @fr
label: traducteur @fr
comment: Spoluautor překladu projektu. @cs
comment: このプロジェクトを翻訳する貢献者 @ja
label: překladatel @cs

vendor
sub property of: topObjectProperty
property disjoint with: accessed
property disjoint with: bottomObjectProperty
type: ObjectProperty
type: Property
label: 提供組織 @ja
comment: Vendor organization: commercial, free or otherwise
comment: 提供組織、商業の組織や自由の組織。 @ja
domain: Project
range: Organization

path2
sub property of: topObjectProperty
property disjoint with: bottomObjectProperty
type: ObjectProperty
type: Property
sub property of: SP system property
range: Path
comment: The second child path of a property path. Used by sp:AltPath and sp:SeqPath.

Data Creation
disjoint with: HTTP-based Data Access
disjoint with: Data Access
disjoint with: Nothing
subclass of: Activity
subclass of: Thing
type: Class
comment: DataCreation is a concept that represents the execution of an activity by which data items have been created.

contained in
sub property of: topObjectProperty
property disjoint with: serialized by
property disjoint with: bottomObjectProperty
type: ObjectProperty
comment: This property refers to a data item that contained a data item. Hence, this property refers to another data item of a larger granularity (e.g. an RDF triple is usually contained in an RDF graph).
domain: Data Item
range: Data Item

Query Execution
disjoint with: HTTP-based Data Access
disjoint with: Data Access
disjoint with: Nothing
subclass of: Data Creation
subclass of: Activity
subclass of: Thing
type: Class
subclass of: http://lodlaundromat.org/.well-known/genid/samples/pellet///class//4f5f5734e1719911a6ea81b78b619b4b/e098647b35c514b5f1bd10a1367fd0de#2

used
type: ObjectProperty
property disjoint with: bottomObjectProperty
property disjoint with: accessed
sub property of: used
property disjoint with: serialized by
property disjoint with: involved exchange of
sub property of: topObjectProperty
comment: This property refers to a source data item that has been used during the creation of a data item. Examples for source data are the content of a document used for machine learning, the statements in a knowledge base used to entail a new statement, and the entries in a database used to answer a query. Notice, all source data has provenance; we strongly encourage to describe this provenance as well, at least as far as available information permits.
domain: Data Creation
range: Data Item

Provenance Vocabulary Core Ontology Specification
description: This documents specifies the Provenance Vocabulary Core Ontology which defines the main classes and properties provided by the Provenance Vocabulary.
license: http://creativecommons.org/licenses/by/1.0/
type: Thing
alternate: ns.rdf
primary topic: Provenance Vocabulary Core Ontology namespace
conforms to: rdfa-syntax
assurance: Detached signature
type: Document
label: Document that defines the core ontology of the Provenance Vocabulary

Query Result
subclass of: http://lodlaundromat.org/.well-known/genid/samples/pellet///class//4f5f5734e1719911a6ea81b78b619b4b/d3e700bc1857a8001f8ca87e5b965b3a#4
disjoint with: File
subclass of: InformationRealization
subclass of: Data Item
type: Class
subclass of: Entity
subclass of: Thing
disjoint with: Nothing
subclass of: http://lodlaundromat.org/.well-known/genid/samples/pellet///class//4f5f5734e1719911a6ea81b78b619b4b/d3e700bc1857a8001f8ca87e5b965b3a#7
subclass of: http://lodlaundromat.org/.well-known/genid/samples/pellet///class//4f5f5734e1719911a6ea81b78b619b4b/e098647b35c514b5f1bd10a1367fd0de#1
comment: QueryResult is the result of a query execution.

RDF description of O
primary topic: 3.[Objects, Pragmatics and Technicalities]: specific level
type: Thing

is in scheme
sub property of: topObjectProperty
property disjoint with: is in semantic relation with
property disjoint with: has member
property disjoint with: has top concept
property disjoint with: has close match
property disjoint with: has exact match
property disjoint with: bottomObjectProperty
type: ObjectProperty
property disjoint with: has narrower
property disjoint with: has narrower match
property disjoint with: has broader
property disjoint with: has narrower transitive
property disjoint with: has broader match
property disjoint with: has related
property disjoint with: has related match
property disjoint with: is in mapping relation with
property disjoint with: has broader transitive
definition: Relates a resource (for example a concept) to a concept scheme in which it is included.
scope note: A concept may be a member of more than one concept scheme.
range: Concept Scheme
type: Property

Union
disjoint with: Nothing
subclass of: Element
subclass of: Element group
subclass of: SP System class
subclass of: Resource
subclass of: Thing
type: Class
comment: A UNION group.

Element list
subclass of: SP System class
subclass of: List
subclass of: Resource
type: Class
subclass of: Element group
subclass of: Thing
disjoint with: Nothing
subclass of: Element
comment: A list of Elements. This class is never instantiated directly as SPIN will use plain rdf:Lists to store element lists.

predicate
sub property of: topObjectProperty
property disjoint with: bottomObjectProperty
type: ObjectProperty
type: Property
sub property of: SP system property
range: Resource
domain: Triple
comment: A resource or Variable describing the predicate of a triple.

SPARQL Query
subclass of: InformationRealization
subclass of: Entity
type: Class
subclass of: http://lodlaundromat.org/.well-known/genid/samples/pellet///class//4f5f5734e1719911a6ea81b78b619b4b/d3e700bc1857a8001f8ca87e5b965b3a#4
disjoint with: File
disjoint with: SQL Query
subclass of: Creation Guideline
disjoint with: Nothing
subclass of: http://lodlaundromat.org/.well-known/genid/samples/pellet///class//4f5f5734e1719911a6ea81b78b619b4b/d3e700bc1857a8001f8ca87e5b965b3a#7
subclass of: Data Item
subclass of: Thing
subclass of: Query
subclass of: Plan

download page
sub property of: topObjectProperty
property disjoint with: bottomObjectProperty
type: ObjectProperty
label: stránka pro stažení @cs
comment: Web-Seite von der die Projekt-Software heruntergeladen werden kann. @de
label: ダウンロードページ @ja
label: page de téléchargement @fr
label: Seite zum Herunterladen @de
comment: Webová stránka, na které lze stáhnout projektový software. @cs
comment: Web page from which the project software can be downloaded.
domain: Project
comment: Page web à partir de laquelle on peut télécharger le programme. @fr
comment: このプロジェクトのダウンロードできるウェブページ @ja
type: Property
comment: Página web de la cuál se puede bajar el software. @es
label: página de descarga @es

Update
disjoint with: Nothing
subclass of: SP System class
subclass of: Resource
subclass of: Thing
subclass of: Command
type: Class
comment: Abstract base class to group the various SPARQL UPDATE commands.

Document that defines the types module of the Provenance Vocabulary
primary topic: Provenance Vocabulary types module namespace
type: Thing
type: Document

Repository
disjoint with: Nothing
subclass of: Thing
type: Class
label: Úložiště @cs
comment: ソースコードのリポジトリ @ja
label: リポジトリ @ja
comment: Source code repository.
comment: Dépôt du code source. @fr
label: Dépôt @fr
label: Repositorio @es
comment: Quellcode-Versionierungssystem. @de
comment: Úložiště zdrojových kódů. @cs
comment: Repositorio del código fuente. @es

is in semantic relation with
property disjoint with: bottomObjectProperty
property disjoint with: has member list
property disjoint with: has member
sub property of: topObjectProperty
property disjoint with: is in scheme
type: ObjectProperty
property disjoint with: has top concept
property disjoint with: is top concept in scheme
definition: Links a concept to a concept related by meaning.
scope note: This property should not be used directly, but as a super-property for all properties denoting a relationship of meaning between concepts.
domain: Concept
range: Concept
type: Property

Delete data
disjoint with: Nothing
subclass of: Update
subclass of: SP System class
subclass of: Resource
subclass of: Thing
subclass of: Command
type: Class
comment: An Update operation to delete specific triples. The graph triples are represented using sp:data, which points to an rdf:List of sp:Triples or sp:NamedGraphs.

has member list
type: ObjectProperty
property disjoint with: has broader transitive
property disjoint with: is in semantic relation with
property disjoint with: has related match
property disjoint with: has broader
property disjoint with: has narrower
property disjoint with: has narrower match
property disjoint with: has exact match
property disjoint with: has top concept
property disjoint with: has close match
property disjoint with: is top concept in scheme
property disjoint with: is in mapping relation with
sub property of: topObjectProperty
property disjoint with: has narrower transitive
property disjoint with: has related
property disjoint with: has broader match
property disjoint with: bottomObjectProperty
type: FunctionalProperty
definition: Relates an ordered collection to the RDF list containing its members.
domain: Ordered Collection
range: List
comment: For any resource, every item in the list given as the value of the skos:memberList property is also a value of the skos:member property.
type: Property

anonymous root
sub property of: topDataProperty
property disjoint with: bottomDataProperty
type: DatatypeProperty
comment: Repository für anonymen Zugriff @de
label: raíz anónima @es
label: anonymní kořen @cs
comment: Repositorio para acceso anónimo. @es
comment: Úložiště pro anonymní přístup. @cs
comment: Dépôt pour accès anonyme. @fr
range: Literal
domain: Repository
type: Property
label: 匿名ルート @ja
label: racine anonyme @fr
label: Anonymes Root @de
comment: 匿名でアクセスできるパス @ja
comment: Repository for anonymous access.

from
sub property of: topObjectProperty
property disjoint with: bottomObjectProperty
type: ObjectProperty
type: Property
sub property of: SP system property
range: Resource
domain: Query
comment: Specifies an RDF Dataset used by a Query (FROM syntax in SPARQL). Values of this property must be URI resources.

has exact match
sub property of: is in mapping relation with
sub property of: has close match
property disjoint with: bottomObjectProperty
sub property of: topObjectProperty
property disjoint with: is in scheme
property disjoint with: is top concept in scheme
property disjoint with: has member list
property disjoint with: has member
type: SymmetricProperty
sub property of: is in semantic relation with
property disjoint with: has top concept
type: ObjectProperty
type: TransitiveProperty
definition: skos:exactMatch is used to link two concepts, indicating a high degree of confidence that the concepts can be used interchangeably across a wide range of information retrieval applications. skos:exactMatch is a transitive property, and is a sub-property of skos:closeMatch.
comment: skos:exactMatch is disjoint with each of the properties skos:broadMatch and skos:relatedMatch.
type: Property

arg3
sub property of: topObjectProperty
sub property of: arg
property disjoint with: bottomObjectProperty
type: ObjectProperty
type: Property
comment: The third argument of a function call.

Edd Dumbill
different from: http://lodlaundromat.org/.well-known/genid/4f5f5734e1719911a6ea81b78b619b4b#10
different from: jita
type: Human Agent
type: Agent
type: Thing
type: Person

using
sub property of: topObjectProperty
property disjoint with: bottomObjectProperty
type: ObjectProperty
type: Property
sub property of: SP system property
range: Resource
domain: Modify

delete pattern
sub property of: topObjectProperty
property disjoint with: bottomObjectProperty
type: ObjectProperty
type: Property
sub property of: SP system property
range: List
domain: Update
comment: Points to a list of sp:TripleTemplates and sp:NamedGraphs in a modify operation.

mod max
property disjoint with: distinct
property disjoint with: default
type: DatatypeProperty
sub property of: topDataProperty
property disjoint with: subject
property disjoint with: templates
property disjoint with: document
property disjoint with: bindings
property disjoint with: order by
property disjoint with: result nodes
property disjoint with: named
property disjoint with: text
sub property of: SP system property
property disjoint with: reduced
property disjoint with: from named
property disjoint with: all
property disjoint with: group by
property disjoint with: graph name node
property disjoint with: having
property disjoint with: silent
property disjoint with: using named
property disjoint with: varName
property disjoint with: bottomDataProperty
property disjoint with: separator
property disjoint with: with
type: Property
range: integer
domain: Mod path

repository
sub property of: topObjectProperty
property disjoint with: bottomObjectProperty
type: ObjectProperty
comment: Repositorio del código fuente. @es
type: Property
label: repositorio @es
comment: Source code repository.
comment: Úložiště zdrojových kódů. @cs
label: dépôt @fr
range: Repository
label: Repository @de
label: リポジトリ @ja
comment: このプロジェクトのソースコードのリポジトリ @ja
label: úložiště @cs
domain: Project
comment: Dépôt du code source. @fr
comment: Quellcode-Versionierungssystem. @de

Bazaar Branch
disjoint with: Nothing
subclass of: Repository
subclass of: Thing
type: Class
label: Bazzarのリポジトリ @ja
comment: Bazaar source code branch.
comment: ソースコードのBazzarのリポジトリ @ja

Detached signature
endorser: pubkey2011
type: Endorsement
type: Thing

default
property disjoint with: varName
type: DatatypeProperty
property disjoint with: subject
property disjoint with: limit
property disjoint with: separator
property disjoint with: mod min
property disjoint with: graph name node
sub property of: topDataProperty
property disjoint with: text
property disjoint with: group by
property disjoint with: templates
property disjoint with: bottomDataProperty
property disjoint with: mod max
property disjoint with: offset
property disjoint with: document
property disjoint with: using named
property disjoint with: order by
property disjoint with: having
property disjoint with: bindings
sub property of: SP system property
property disjoint with: result nodes
property disjoint with: from named
property disjoint with: with
type: Property
range: boolean
comment: Used in DROP and CLEAR.

Desc
disjoint with: Nothing
subclass of: SP System class
subclass of: Resource
subclass of: Order by condition
subclass of: Thing
type: Class
comment: Marker to indicate descending order.

homepage
sub property of: topObjectProperty
sub property of: homepage
property disjoint with: bottomObjectProperty
type: InverseFunctionalProperty
type: ObjectProperty
label: page web @fr
label: Homepage @de
label: página web @es
comment: El URL de la página de un proyecto, asociada con exactamente un proyecto. @es
label: ホームページ @ja
comment: URL of a project's homepage, associated with exactly one project.
domain: Project
comment: URL der Projekt-Homepage, verbunden mit genau einem Projekt. @de
comment: このプロジェクトのホームページのURL。このホームページは他のプロジェクトのホームページじゃないこと。 @ja
label: domovská stránka @cs
comment: L'URL de la page web d'un projet, associée avec un unique projet. @fr
type: Property
comment: URL adresa domovské stránky projektu asociované s právě jedním projektem. @cs

used by
sub property of: topObjectProperty
sub property of: actedOnBehalfOf
property disjoint with: accessed
property disjoint with: bottomObjectProperty
type: ObjectProperty
comment: This property refers to a data publisher who used a data providing services at the time the provenance description refers to.
domain: Data Providing Service
range: Data Publisher

has narrower
sub property of: has narrower transitive
sub property of: is in semantic relation with
property disjoint with: is in scheme
property disjoint with: has member
property disjoint with: bottomObjectProperty
type: ObjectProperty
sub property of: topObjectProperty
inverse of: has broader
property disjoint with: is top concept in scheme
property disjoint with: has top concept
property disjoint with: has member list
definition: Relates a concept to a concept that is more specific in meaning.
scope note: By convention, skos:broader is only used to assert an immediate (i.e. direct) hierarchical link between two conceptual resources.
comment: Narrower concepts are typically rendered as children in a concept hierarchy (tree).
type: Property

Provenance Vocabulary Core Ontology namespace
created: 2009-08-25T12:00:00Z
description: The Provenance Vocabulary provides classes and properties for describing provenance of Web data. The vocabulary focuses on two main use cases: 1.) It enables consumers of Web data to describe provenance of data retrieved from the Web and of data derived from such Web data. 2.) It enables providers of Web data to publish provenance-related metadata about their data. Notice, the vocabulary is not intended for describing provenance of other kinds of Web content. The Provenance Vocabulary is designed as a Web data specific specialization of the W3C PROV Ontology (PROV-O); classes and properties provided by the vocabulary are domain specific extensions of the more general concepts introduced in PROV-O. As a consequence, any Provenance Vocabulary based description of provenance can be easily interpreted and exchanged according to the W3C PROV family of standards.
modified: 2012-03-14T12:00:00Z
type: Thing
type: Ontology
creator: Jun Zhao
creator: Olaf Hartig

Asc
disjoint with: Nothing
subclass of: SP System class
subclass of: Resource
subclass of: Order by condition
subclass of: Thing
type: Class
comment: Marker to indicate ascending order.

insert pattern
sub property of: topObjectProperty
property disjoint with: bottomObjectProperty
type: ObjectProperty
type: Property
sub property of: SP system property
range: List
domain: Modify
comment: Points to a list of sp:TripleTemplates or sp:NamedGraphs in a modify command.

path
sub property of: topObjectProperty
property disjoint with: bottomObjectProperty
type: ObjectProperty
type: Property
sub property of: SP system property
range: Path
domain: Triple path
comment: Points from a TriplePath to its path.

maintainer
sub property of: topObjectProperty
property disjoint with: accessed
property disjoint with: bottomObjectProperty
type: ObjectProperty
comment: Správce projektu, vedoucí projektu. @cs
type: Property
comment: Développeur principal d'un projet, un meneur du projet. @fr
comment: このプロジェクトのメンテなー及びリーダ。 @ja
label: Projektverantwortlicher @de
label: メンテナー @ja
range: Person
comment: Hauptentwickler eines Projektes, der Projektleiter @de
comment: Desarrollador principal de un proyecto, un líder de proyecto. @es
label: développeur principal @fr
domain: Project
label: správce @cs
label: desarrollador principal @es
comment: Maintainer of a project, a project leader.

release
sub property of: topObjectProperty
property disjoint with: bottomObjectProperty
type: ObjectProperty
comment: Une release (révision) d'un projet. @fr
comment: Un release (versión) de un proyecto. @es
comment: A project release.
label: Release @de
comment: Relase (verze) projektu. @cs
comment: Ein Release (Version) eines Projekts. @de
comment: このプロジェクトのリリース @ja
range: Version
type: Property
domain: Project
label: リリース @ja

SQL Query
subclass of: Creation Guideline
subclass of: Entity
disjoint with: Nothing
subclass of: http://lodlaundromat.org/.well-known/genid/samples/pellet///class//4f5f5734e1719911a6ea81b78b619b4b/d3e700bc1857a8001f8ca87e5b965b3a#7
subclass of: Query
subclass of: Thing
disjoint with: File
disjoint with: SPARQL Query
subclass of: http://lodlaundromat.org/.well-known/genid/samples/pellet///class//4f5f5734e1719911a6ea81b78b619b4b/d3e700bc1857a8001f8ca87e5b965b3a#4
subclass of: InformationRealization
type: Class
subclass of: Plan
subclass of: Data Item

elements
sub property of: topObjectProperty
property disjoint with: bottomObjectProperty
type: ObjectProperty
type: Property
sub property of: SP system property
range: Element list
comment: Points to an ElementList, for example in an Optional element.

into
sub property of: topObjectProperty
property disjoint with: bottomObjectProperty
type: ObjectProperty
type: Property
sub property of: SP system property
range: Resource
domain: Load
comment: The (optional) target of a LOAD Update operation.

accessed
sub property of: topObjectProperty
property disjoint with: used
property disjoint with: guided by
property disjoint with: bottomObjectProperty
type: ObjectProperty
comment: This property refers to the Web resource that has been accessed during the execution of a data access. More precisely, the request of the referenced Web resource resulted in retrieving the representation that has been retrieved by the corresponding prv:DataAccess execution.
domain: Data Access
range: WebResource

operated by
sub property of: topObjectProperty
sub property of: actedOnBehalfOf
property disjoint with: accessed
property disjoint with: bottomObjectProperty
type: ObjectProperty
comment: This property refers to a human agent who was operating a non-human agent. For instance, a service provider operates a data providing service (see concept prv:DataProvidingService). Another example is a human agent who operates a non-human data creating agent.
domain: Non-Human Agent
range: Human Agent

Create
disjoint with: Nothing
subclass of: Update
subclass of: SP System class
subclass of: Resource
subclass of: Thing
subclass of: Command
type: Class
comment: An Update operation that creates a new empty graph with a name specified by sp:graphIRI. May have sp:silent set to true.

Seq path
disjoint with: Nothing
subclass of: Path
subclass of: SP System class
subclass of: Resource
subclass of: Thing
type: Class
comment: A sequence of multiple paths.

language
sub property of: topDataProperty
property disjoint with: bottomDataProperty
type: DatatypeProperty
type: Property
label: 言語 @ja
comment: ISO language code a project has been translated into
comment: このプロジェクトの翻訳された言語のISO言語コート
domain: Project
range: Literal

Measurement
disjoint with: HTTP-based Data Access
disjoint with: Data Access
disjoint with: Nothing
subclass of: Data Creation
subclass of: Activity
subclass of: Thing
type: Class
comment: Measurement is a concept that represents the execution of a measurement.

http://lodlaundromat.org/.well-known/genid/4f5f5734e1719911a6ea81b78b619b4b#5
was associated with: http://lodlaundromat.org/.well-known/genid/4f5f5734e1719911a6ea81b78b619b4b#10
used: http://lodlaundromat.org/.well-known/genid/4f5f5734e1719911a6ea81b78b619b4b#6
different from: http://lodlaundromat.org/.well-known/genid/4f5f5734e1719911a6ea81b78b619b4b#9
type: Data Creation
executed at: 2015-02-20T08:17:14.456Z
type: Thing
performed by: http://lodlaundromat.org/.well-known/genid/4f5f5734e1719911a6ea81b78b619b4b#10
type: Activity

Triple template
disjoint with: Nothing
subclass of: Tuple
subclass of: SP System class
subclass of: Resource
subclass of: Triple
subclass of: Thing
type: Class
comment: A prototypical triple used as template in the head of a Construct query. May contain variables.

completed at
sub property of: topDataProperty
property disjoint with: bottomDataProperty
sub property of: endedAtTime
equivalent property: endedAtTime
type: FunctionalProperty
type: DatatypeProperty
comment: This property refers to the time an activity has been completed.

Graph
disjoint with: File
subclass of: http://lodlaundromat.org/.well-known/genid/samples/pellet///class//4f5f5734e1719911a6ea81b78b619b4b/d3e700bc1857a8001f8ca87e5b965b3a#7
subclass of: InformationRealization
disjoint with: Nothing
subclass of: http://lodlaundromat.org/.well-known/genid/samples/pellet///class//4f5f5734e1719911a6ea81b78b619b4b/d3e700bc1857a8001f8ca87e5b965b3a#4
type: Class
subclass of: Entity
subclass of: Data Item
subclass of: Thing
comment: An RDF graph (with intensional semantics).

created by
sub property of: topObjectProperty
sub property of: wasGeneratedBy
property disjoint with: retrieved by
property disjoint with: bottomObjectProperty
type: ObjectProperty
comment: This property refers to the creation of a data item (or a file that serializes data items).
domain: http://lodlaundromat.org/.well-known/genid/samples/pellet///class//4f5f5734e1719911a6ea81b78b619b4b/d3e700bc1857a8001f8ca87e5b965b3a#7
range: Data Creation
property chain axiom: http://lodlaundromat.org/.well-known/genid/samples/pellet///class//4f5f5734e1719911a6ea81b78b619b4b/d3e700bc1857a8001f8ca87e5b965b3a#10

Non-Human Actor
disjoint with: Nothing
subclass of: Thing
type: Class
type: DeprecatedClass
comment: This class is deprecated and will be removed from the Provenance Vocabulary in the next revision. prv:NonHumanActor was renamed to prv:NonHumanAgent in the process of making the Provenance Vocabulary a specialization of W3C's PROV-O. Hence, use prv:NonHumanAgent instead.

as
sub property of: topObjectProperty
property disjoint with: bottomObjectProperty
type: ObjectProperty
type: Property
sub property of: SP system property
range: Variable
comment: Points to a Variable used in an AS statement such as COUNT aggregates.

values
sub property of: topObjectProperty
property disjoint with: bottomObjectProperty
type: ObjectProperty
type: Property
sub property of: SP system property
range: Values
domain: Query
comment: The VALUES block at the end of a query. The object may just be an untyped blank node, i.e. the sp:Values type triple is optional.

Element
disjoint with: Nothing
subclass of: SP System class
subclass of: Resource
subclass of: Thing
type: Class
comment: An abstract base class for all pattern elements.

wiki
sub property of: topObjectProperty
property disjoint with: bottomObjectProperty
type: ObjectProperty
comment: L'URL du Wiki pour la discussion collaborative sur le projet. @fr
comment: このプロジェクトの討論用ウィキ @ja
label: ウィキ @ja
label: Wiki @de
comment: URL of Wiki for collaborative discussion of project.
comment: Wiki-URL für die kollaborative Dikussion eines Projektes. @de
comment: URL adresa wiki projektu pro společné diskuse. @cs
type: Property
domain: Project
comment: URL del Wiki para discusión colaborativa del proyecto. @es

description
sub property of: topDataProperty
property disjoint with: bottomDataProperty
type: DatatypeProperty
comment: Čistě textový, 2 až 4 věty dlouhý popis projektu. @cs
label: descripción @es
comment: Texte descriptif d'un projet, long de 2 à 4 phrases. @fr
comment: プロジェクトの文の説明、2から4までの行数。 @ja
comment: Descripción en texto plano de un proyecto, de 2 a 4 enunciados de longitud. @es
label: popis @cs
range: Literal
type: Property
comment: Beschreibung eines Projekts als einfacher Text mit der Länge von 2 bis 4 Sätzen. @de
comment: Plain text description of a project, of 2-4 sentences in length.
label: Beschreibung @de
label: 説明 @ja

helper
sub property of: topObjectProperty
property disjoint with: accessed
property disjoint with: bottomObjectProperty
type: ObjectProperty
type: Property
range: Person
comment: Spoluautor projektu. @cs
label: 貢献者 @ja
comment: Projekt-Mitarbeiter. @de
comment: Collaborateur au projet. @fr
comment: このプロジェクトの貢献者 @ja
label: collaborateur @fr
domain: Project
label: colaborador @es
comment: Project contributor.
label: Helfer @de
label: spoluautor @cs
comment: Colaborador del proyecto. @es

immediately preceded by
sub property of: topObjectProperty
sub property of: http://lodlaundromat.org/.well-known/genid/samples/pellet///class//4f5f5734e1719911a6ea81b78b619b4b/d3e700bc1857a8001f8ca87e5b965b3a#1
sub property of: replaces
property disjoint with: serialized by
property disjoint with: bottomObjectProperty
type: ObjectProperty
comment: This property may be used to make the relationship between different version of a data item explicit. More precisely, this property refers to an immediately preceding version of a data item; hence, the new version (i.e. the subject) has been created using the old version (i.e. the object). We strongly encourage to also describe this creation of the new version explicitly.
domain: Data Item
range: Data Item

has close match
sub property of: is in mapping relation with
type: SymmetricProperty
property disjoint with: is in scheme
sub property of: topObjectProperty
property disjoint with: is top concept in scheme
sub property of: is in semantic relation with
property disjoint with: has member
type: ObjectProperty
property disjoint with: bottomObjectProperty
property disjoint with: has member list
property disjoint with: has top concept
definition: skos:closeMatch is used to link two concepts that are sufficiently similar that they can be used interchangeably in some information retrieval applications. In order to avoid the possibility of "compound errors" when combining mappings across more than two concept schemes, skos:closeMatch is not declared to be a transitive property.
type: Property

Reverse path
disjoint with: Nothing
subclass of: Path
subclass of: SP System class
subclass of: Resource
subclass of: Thing
type: Class
comment: A path with reversed direction.

COUNT
disjoint with: Nothing
subclass of: SP System class
subclass of: Resource
subclass of: Thing
subclass of: Aggregation
type: Class
comment: Counts the number of times a variable is used. The variable is stored in the variable property. This might be left blank to indicate COUNT(*).

BitKeeper Repository
disjoint with: Nothing
subclass of: Repository
subclass of: http://lodlaundromat.org/.well-known/genid/samples/pellet///class//4f5f5734e1719911a6ea81b78b619b4b/bf83860cd7dab8f53104c5f50b382094#2
subclass of: Thing
type: Class
comment: Dépôt BitKeeper du code source. @fr
label: BitKeeperのリポジトリ @ja
comment: Úložiště zdrojových kódů BitKeeper. @cs
label: Dépôt BitKeeper @fr
comment: BitKeeper Quellcode-Versionierungssystem. @de
comment: Repositorio BitKeeper del código fuente. @es
comment: ソースコードのBitKeeperのリポジトリ @ja
label: Úložiště BitKeeper @cs
comment: BitKeeper source code repository.
label: Repositorio BitKeeper @es

CVS Repository
disjoint with: Nothing
subclass of: Repository
subclass of: http://lodlaundromat.org/.well-known/genid/samples/pellet///class//4f5f5734e1719911a6ea81b78b619b4b/bf83860cd7dab8f53104c5f50b382094#2
subclass of: Thing
type: Class
comment: Dépôt CVS du code source. @fr
comment: Úložiště zdrojových kódů CVS. @cs
label: Úložiště CVS @cs
comment: CVS Quellcode-Versionierungssystem. @de
comment: CVS source code repository.
comment: ソースコードのCVSのリポジトリ @ja
label: Dépôt CVS @fr
label: CVSのリポジトリ @ja
comment: Repositorio CVS del código fuente. @es
label: Repositorio CVS @es

arg4
sub property of: topObjectProperty
sub property of: arg
property disjoint with: bottomObjectProperty
type: ObjectProperty
type: Property
comment: The forth argument of a function call.

SP System class
disjoint with: Nothing
subclass of: Resource
subclass of: Thing
type: Class
comment: An "artificial" root class that groups all SP classes. This makes them look much less overwhelming in UI tools. Typical end users don't need to see those classes anyway.

accessed
property disjoint with: documenter
property disjoint with: bottomObjectProperty
sub property of: topObjectProperty
property disjoint with: tester
property disjoint with: used
property disjoint with: maintainer
property disjoint with: operated by
property disjoint with: guided by
property disjoint with: used by
property disjoint with: vendor
property disjoint with: translator
type: ObjectProperty
sub property of: wasAssociatedWith
property disjoint with: developer
property disjoint with: helper
comment: This property refers to the service that provided the Web representation during the execution of a data access.
domain: Data Access
range: Data Providing Service

graph IRI
sub property of: topObjectProperty
property disjoint with: bottomObjectProperty
type: ObjectProperty
type: Property
sub property of: SP system property
range: Resource
comment: Points to graph names (IRIs) in various sp:Update operations.

Let
disjoint with: Nothing
subclass of: Element
subclass of: SP System class
subclass of: Resource
subclass of: Bind
subclass of: Thing
type: Class
type: DeprecatedClass
comment: Deprecated: use sp:Bind instead. A variable assignment (LET (?<varName> := <expression>)). Not part of the SPARQL 1.0 standard, but (for example) ARQ.

Aggregation
disjoint with: Nothing
subclass of: SP System class
subclass of: Resource
subclass of: Thing
type: Class
comment: Base class of aggregation types (not part of the SPARQL 1.0 standard but supported by ARQ and other engines).

SP system property
sub property of: topDataProperty
property disjoint with: bottomDataProperty
type: DatatypeProperty
type: Property
comment: An abstract base proprerty that groups together the SP system properties. Users typically don't need to see them anyway.

separator
property disjoint with: order by
sub property of: SP system property
property disjoint with: having
property disjoint with: default
sub property of: topDataProperty
property disjoint with: named
property disjoint with: mod min
property disjoint with: subject
property disjoint with: limit
property disjoint with: templates
property disjoint with: group by
property disjoint with: distinct
property disjoint with: bottomDataProperty
property disjoint with: all
property disjoint with: mod max
property disjoint with: using named
property disjoint with: reduced
property disjoint with: result nodes
type: DatatypeProperty
property disjoint with: with
property disjoint with: silent
property disjoint with: graph name node
property disjoint with: offset
property disjoint with: bindings
property disjoint with: from named
property disjoint with: document
type: Property
range: string
domain: GROUP_CONCAT
comment: Stores the separator="..." value of a GROUP_CONCAT (sp:GroupConcat) aggregation.

Triple pattern
disjoint with: Nothing
subclass of: Resource
subclass of: Element
type: Class
subclass of: Thing
subclass of: Triple
subclass of: SP System class
subclass of: Tuple
comment: A triple pattern used in the body of a query.

result variables
sub property of: topObjectProperty
property disjoint with: bottomObjectProperty
type: ObjectProperty
type: Property
sub property of: SP system property
range: List
domain: Select query
comment: An rdf:List of variables that are returned by a Select query.

variable
sub property of: topObjectProperty
property disjoint with: bottomObjectProperty
type: ObjectProperty
type: Property
sub property of: SP system property
range: Variable
domain: Bind
comment: The variable of a Bind element.

Query Template
subclass of: http://lodlaundromat.org/.well-known/genid/samples/pellet///class//4f5f5734e1719911a6ea81b78b619b4b/d3e700bc1857a8001f8ca87e5b965b3a#4
disjoint with: File
subclass of: Data Item
subclass of: Thing
disjoint with: Nothing
subclass of: Entity
subclass of: http://lodlaundromat.org/.well-known/genid/samples/pellet///class//4f5f5734e1719911a6ea81b78b619b4b/d3e700bc1857a8001f8ca87e5b965b3a#7
subclass of: Plan
subclass of: Creation Guideline
subclass of: InformationRealization
type: Class
comment: A QueryTemplate is a query that contains placeholders which are replaced by actual data to create an executable query.

Human Actor
disjoint with: Nothing
subclass of: Thing
type: Class
type: DeprecatedClass
comment: This class is deprecated and will be removed from the Provenance Vocabulary in the next revision. prv:HumanActor was renamed to prv:HumanAgent in the process of making the Provenance Vocabulary a specialization of W3C's PROV-O. Hence, use prv:HumanAgent instead.

download mirror
sub property of: topObjectProperty
property disjoint with: bottomObjectProperty
type: ObjectProperty
label: zrcadlo stránky pro stažení @cs
label: miroir pour le téléchargement @fr
domain: Project
label: ダウンロードミラー @ja
comment: Mirror of software download web page.
comment: Spiegel der Seite von die Projekt-Software heruntergeladen werden kann. @de
type: Property
comment: Zrcadlo stránky pro stažení softwaru. @cs
comment: Miroir de la page de téléchargement du programme. @fr
comment: Mirror de la página web de descarga. @es
label: mirror de descarga @es
label: Spiegel der Seite zum Herunterladen @de
comment: このプロジェクトのダウンロードミラー @ja

Command
disjoint with: Nothing
subclass of: SP System class
subclass of: Resource
subclass of: Thing
type: Class
comment: A shared superclass for sp:Query and sp:Update that can be used to specify that the range of property can be either one.

limit
property disjoint with: silent
sub property of: topDataProperty
property disjoint with: having
property disjoint with: from named
property disjoint with: named
sub property of: SP system property
property disjoint with: graph name node
property disjoint with: reduced
property disjoint with: default
property disjoint with: document
type: DatatypeProperty
property disjoint with: templates
property disjoint with: order by
property disjoint with: all
property disjoint with: subject
property disjoint with: bindings
property disjoint with: separator
property disjoint with: text
property disjoint with: varName
property disjoint with: bottomDataProperty
property disjoint with: result nodes
property disjoint with: with
property disjoint with: using named
property disjoint with: distinct
property disjoint with: group by
type: Property
range: long
domain: Query
comment: The LIMIT solution modifier of a Query.

Subversion Repository
disjoint with: Nothing
subclass of: Repository
subclass of: Thing
type: Class
label: Dépôt Subversion @fr
comment: Subversion source code repository.
label: Úložiště Subversion @cs
comment: Úložiště zdrojových kódů Subversion. @cs
comment: Dépôt Subversion du code source. @fr
label: Subversionのリポジトリ @ja
comment: ソースコードのSubversionのリポジトリ @ja
label: Repositorio Subversion @es
comment: Subversion Quellcode-Versionierungssystem. @de
comment: Repositorio Subversion del código fuente. @es

Drop
disjoint with: Nothing
subclass of: Update
subclass of: SP System class
subclass of: Resource
subclass of: Thing
subclass of: Command
type: Class
comment: An Update operation that removes a specified graph from the Graph Store. Must specify the graph using sp:graphIRI, or sp:default, sp:named or sp:all. May have the SILENT flag, encoded using sp:silent.

service URI
sub property of: topObjectProperty
property disjoint with: bottomObjectProperty
type: ObjectProperty
type: Property
sub property of: SP system property
range: Resource
domain: Service
comment: Used by sp:Service to specify the URI of the SPARQL end point to invoke. Must point to a URI node.

Data Creating Entity
subclass of: Agent
disjoint with: Data Providing Service
disjoint with: Service
disjoint with: Data Accessor
subclass of: Data Creator
subclass of: Thing
disjoint with: Server
type: Class
subclass of: Human Agent
disjoint with: Non-Human Agent
disjoint with: WebClient
disjoint with: Data Creating Service
disjoint with: Data Creating Device
disjoint with: Nothing
disjoint with: WebServer
disjoint with: Sensor
comment: DataCreatingEntity is a concept that represents a human agent who performed the creation of a data item, either directly or by being responsible for a non-human data creator (see the concepts prvTypes:DataCreatingService and prvTypes:DataCreatingDevice).

audience
sub property of: topDataProperty
property disjoint with: bottomDataProperty
type: DatatypeProperty
type: Property
label: 目指したユーザ @ja
comment: Description of target user base
comment: 目指したユーザたちの説明 @ja
domain: Project
range: Literal

serialized by
property disjoint with: guided by
property disjoint with: bottomObjectProperty
sub property of: topObjectProperty
property disjoint with: equivalent graph
property disjoint with: used
property disjoint with: immediately preceded by
type: ObjectProperty
property disjoint with: contained in
property disjoint with: subgraph of
comment: This property refers to a file that serialized a data item.
domain: Data Item
range: File

Minus
disjoint with: Nothing
subclass of: Element
subclass of: Element group
subclass of: SP System class
subclass of: Resource
subclass of: Thing
type: Class
comment: A MINUS element group.

Ordered Collection
disjoint with: Concept Scheme
disjoint with: Concept
disjoint with: Nothing
subclass of: http://lodlaundromat.org/.well-known/genid/samples/pellet///class//4f5f5734e1719911a6ea81b78b619b4b/d8234c3b1439a879aea940e9009663be#1
subclass of: Collection
subclass of: Thing
type: Class
definition: An ordered collection of concepts, where both the grouping and the ordering are meaningful.
scope note: Ordered collections can be used where you would like a set of concepts to be displayed in a specific order, and optionally under a 'node label'.

Clear
disjoint with: Nothing
subclass of: Update
subclass of: SP System class
subclass of: Resource
subclass of: Thing
subclass of: Command
type: Class
comment: An Update operation that removes all triples from a specified graph. Must specify the graph using sp:graphIRI, or sp:default, sp:named or sp:all. May have the SILENT flag, encoded using sp:silent.

Data Accessor
disjoint with: Person
disjoint with: Data Publisher
subclass of: Agent
disjoint with: Group
subclass of: Thing
type: Class
disjoint with: Nothing
disjoint with: Data Creating Entity
subclass of: Non-Human Agent
subclass of: WebClient
disjoint with: Human Agent
disjoint with: Organization
equivalent class: WebClient
comment: DataAccessor is a concept that represents a system (i.e. a non-human agent) which performed the data access in order to retrieve an information resource from the Web.

Alt path
disjoint with: Nothing
subclass of: Path
subclass of: SP System class
subclass of: Resource
subclass of: Thing
type: Class
comment: An alternative path with the union of sp:path1 and sp:path2.

Exists
disjoint with: Nothing
subclass of: Element
subclass of: Element group
subclass of: SP System class
subclass of: Resource
subclass of: Thing
type: Class
comment: An EXISTS element group.

Collection
disjoint with: Concept Scheme
disjoint with: Concept
disjoint with: Nothing
subclass of: http://lodlaundromat.org/.well-known/genid/samples/pellet///class//4f5f5734e1719911a6ea81b78b619b4b/d8234c3b1439a879aea940e9009663be#1
subclass of: Thing
type: Class
definition: A meaningful collection of concepts.
scope note: Labelled collections can be used where you would like a set of concepts to be displayed under a 'node label' in the hierarchy.

Implements specification
sub property of: topObjectProperty
property disjoint with: bottomObjectProperty
type: ObjectProperty
type: Property
label: 実装した明細書 @ja
comment: A specification that a project implements. Could be a standard, API or legally defined level of conformance.
comment: このプロジェクトが実装したシステムの明細書。標準やAPIや明細書のようなもの。 @ja
domain: Project
range: Specification

Delete
subclass of: Modify
subclass of: Command
subclass of: Update
subclass of: Resource
subclass of: Thing
type: Class
disjoint with: Nothing
subclass of: SP System class
type: DeprecatedClass
comment: Deprecated - use sp:Modify instead. Represents a DELETE FROM (part of SPARQL UPDATE language). The graph IRIs are stored in sp:graphIRI. The template patterns to delete are stored in sp:deletePattern. The WHERE clause is represented using sp:where.

node
sub property of: SP system property
sub property of: topDataProperty
property disjoint with: bottomDataProperty
type: DatatypeProperty
type: Property
domain: Reverse link path

Service
disjoint with: Nothing
subclass of: Element
subclass of: Element group
subclass of: SP System class
subclass of: Resource
subclass of: Thing
type: Class
comment: A SERVICE call that matches a nested sub-pattern against a SPARQL end point specified by a URI.

var names
sub property of: topObjectProperty
property disjoint with: bottomObjectProperty
type: ObjectProperty
type: Property
sub property of: SP system property
range: List
domain: Values
comment: The names of the variables (xsd:strings) of the variables declared for a VALUES element.

Query
subclass of: InformationRealization
disjoint with: File
subclass of: http://lodlaundromat.org/.well-known/genid/samples/pellet///class//4f5f5734e1719911a6ea81b78b619b4b/d3e700bc1857a8001f8ca87e5b965b3a#7
subclass of: Entity
subclass of: Creation Guideline
disjoint with: Nothing
subclass of: http://lodlaundromat.org/.well-known/genid/samples/pellet///class//4f5f5734e1719911a6ea81b78b619b4b/d3e700bc1857a8001f8ca87e5b965b3a#4
subclass of: Data Item
type: Class
subclass of: Plan
subclass of: Thing

Provenance Vocabulary types module namespace
created: 2009-11-07T12:00:00Z
description: Extends the Provenance Vocabulary by defining subclasses of the types of provenance elements introduced in the core ontology.
modified: 2012-03-14T12:00:00Z
type: Thing
type: Ontology
imports: Provenance Vocabulary Core Ontology namespace
creator: Olaf Hartig
creator: Jun Zhao

Execution
disjoint with: Nothing
subclass of: Thing
type: Class
type: DeprecatedClass
comment: This class is deprecated and will be removed from the Provenance Vocabulary in the next revision. prv:Execution was deprecated in the process of making the Provenance Vocabulary a specialization of W3C's PROV-O. Hence, use prov:Activity instead.

Values
disjoint with: Nothing
subclass of: Element
subclass of: SP System class
subclass of: Resource
subclass of: Thing
type: Class
comment: A VALUES element. sp:varNames points to an rdf:List of strings for the variables, sp:values to an rdf:List of rdf:Lists with nodes for each variable, in the order defined by the variables list.

performed by
sub property of: topObjectProperty
sub property of: wasAssociatedWith
property disjoint with: bottomObjectProperty
type: ObjectProperty
comment: This property refers to an agent that/who performed an activity.

definition
definition: A statement or formal explanation of the meaning of a concept.
type: AnnotationProperty
sub property of: note
type: Property

change note
definition: A note about a modification to a concept.
type: AnnotationProperty
sub property of: note
type: Property

preferred label
definition: The preferred lexical label for a resource, in a given language.
type: AnnotationProperty
sub property of: label
comment: A resource has no more than one value of skos:prefLabel per language tag, and no more than one value of skos:prefLabel without language tag.
comment: The range of skos:prefLabel is the class of RDF plain literals.
comment: skos:prefLabel, skos:altLabel and skos:hiddenLabel are pairwise disjoint properties.
type: Property

hidden label
definition: A lexical label for a resource that should be hidden when generating visual displays of the resource, but should still be accessible to free text search operations.
type: AnnotationProperty
sub property of: label
comment: The range of skos:hiddenLabel is the class of RDF plain literals.
comment: skos:prefLabel, skos:altLabel and skos:hiddenLabel are pairwise disjoint properties.
type: Property

history note
definition: A note about the past state/use/meaning of a concept.
type: AnnotationProperty
sub property of: note
type: Property

editorial note
definition: A note for an editor, translator or maintainer of the vocabulary.
type: AnnotationProperty
sub property of: note
type: Property

scope note
definition: A note that helps to clarify the meaning and/or the use of a concept.
type: AnnotationProperty
sub property of: note
type: Property

alternative label
definition: An alternative lexical label for a resource.
example: Acronyms, abbreviations, spelling variants, and irregular plural/singular forms may be included among the alternative labels for a concept. Mis-spelled terms are normally included as hidden labels (see skos:hiddenLabel).
type: AnnotationProperty
sub property of: label
comment: The range of skos:altLabel is the class of RDF plain literals.
comment: skos:prefLabel, skos:altLabel and skos:hiddenLabel are pairwise disjoint properties.
type: Property

http://lodlaundromat.org/.well-known/genid/samples/pellet///class//4f5f5734e1719911a6ea81b78b619b4b/d3e700bc1857a8001f8ca87e5b965b3a#2
type: Restriction
on property: accessed
max cardinality: 1

note
definition: A general note, for any purpose.
scope note: This property may be used directly, or as a super-property for more specific note types.
type: AnnotationProperty
type: Property

SPIN SPARQL Syntax
type: Ontology
version info: 1.5.0
comment: An RDF schema to syntactically represent SPARQL queries and update commands as RDF triples.

http://lodlaundromat.org/.well-known/genid/samples/pellet///class//4f5f5734e1719911a6ea81b78b619b4b/d3e700bc1857a8001f8ca87e5b965b3a#3
type: Restriction
on property: accessed
max cardinality: 1

example
definition: An example of the use of a concept.
type: AnnotationProperty
sub property of: note
type: Property