has narrower transitive
range: Thing
domain: Thing
definition: skos:narrowerTransitive is a transitive superproperty of skos:narrower.
scope note: By convention, skos:narrowerTransitive is not used to make assertions. Rather, the properties can be used to draw inferences about the transitive closure of the hierarchical relation, which is useful e.g. when implementing a simple query expansion algorithm in a search application.
type: ObjectProperty
sub property of: is in semantic relation with
type: TransitiveProperty
inverse of: has broader transitive
type: Property
note: By convention, skos:narrowerTransitive is not used to make assertions. Rather, the properties can be used to draw inferences about the transitive closure of the hierarchical relation, which is useful e.g. when implementing a simple query expansion algorithm in a search application.
note: skos:narrowerTransitive is a transitive superproperty of skos:narrower.
domain: Concept
domain: Resource
domain: http://lodlaundromat.org/.well-known/genid/samples/jena///predicate//4f5f5734e1719911a6ea81b78b619b4b/d8234c3b1439a879aea940e9009663be#1
range: Concept
range: Resource
range: http://lodlaundromat.org/.well-known/genid/samples/jena///predicate//4f5f5734e1719911a6ea81b78b619b4b/d8234c3b1439a879aea940e9009663be#1

dataset description
subclass of: Resource
subclass of: Thing
type: Class
comment: A web resource whose foaf:primaryTopic or foaf:topics include void:Datasets.
subclass of: Document

Creation Guideline
subclass of: Thing
subclass of: Resource
type: Class
comment: CreationGuideline is a concept that represents a guideline used to guide the execution of a data creation. Examples for creation guidelines are transformation rules, mapping definitions, entailment rules, and database queries.
subclass of: Plan
subclass of: Data Item
subclass of: InformationRealization
subclass of: http://lodlaundromat.org/.well-known/genid/samples/jena///predicate//4f5f5734e1719911a6ea81b78b619b4b/d3e700bc1857a8001f8ca87e5b965b3a#7
subclass of: Entity
subclass of: http://lodlaundromat.org/.well-known/genid/samples/jena///predicate//4f5f5734e1719911a6ea81b78b619b4b/d3e700bc1857a8001f8ca87e5b965b3a#4

Git Repository
subclass of: Resource
label: Dépôt Git @fr
comment: Repositorio Git del código fuente. @es
type: Class
label: Úložiště Git @cs
comment: Dépôt Git du code source. @fr
comment: Úložiště zdrojových kódů Git. @cs
label: Gitのリポジトリ @ja
label: Repositorio Git @es
label: Git repository @de
comment: ソースコードのGitのリポジトリ @ja
subclass of: Repository
comment: Git source code repository.
comment: Git Quellcode-Versionierungssystem. @de

guided by
range: Thing
domain: Thing
type: Property
type: ObjectProperty
comment: This property refers to a creation guideline which guided the execution of a data creation. Examples for creation guidelines are transformation rules, mapping definitions, entailment rules, and database queries. Notice, all creation guidelines have provenance; we strongly encourage to describe this provenance as well, at least as far as available information permits.
domain: Data Creation
range: Creation Guideline
sub property of: used
domain: Resource
range: Resource
domain: Activity
range: Entity
range: http://lodlaundromat.org/.well-known/genid/samples/jena///predicate//4f5f5734e1719911a6ea81b78b619b4b/d3e700bc1857a8001f8ca87e5b965b3a#7
range: InformationRealization
range: http://lodlaundromat.org/.well-known/genid/samples/jena///predicate//4f5f5734e1719911a6ea81b78b619b4b/d3e700bc1857a8001f8ca87e5b965b3a#4
range: Plan
range: Data Item

darcs Repository
subclass of: Resource
label: Dépôt darcs @fr
subclass of: Repository
comment: Dépôt darcs du code source. @fr
comment: Repositorio darcs del código fuente. @es
type: Class
comment: darcs source code repository.
label: darcsのリポジトリ @ja
label: Repositorio darcs @es
comment: ソースコードのdarcsのリポジトリ @ja

is in mapping relation with
range: Thing
domain: Thing
definition: Relates two concepts coming, by convention, from different schemes, and that have comparable meanings
comment: These concept mapping relations mirror semantic relations, and the data model defined below is similar (with the exception of skos:exactMatch) to the data model defined for semantic relations. A distinct vocabulary is provided for concept mapping relations, to provide a convenient way to differentiate links within a concept scheme from links between concept schemes. However, this pattern of usage is not a formal requirement of the SKOS data model, and relies on informal definitions of best practice.
type: ObjectProperty
sub property of: is in semantic relation with
type: Property
note: Relates two concepts coming, by convention, from different schemes, and that have comparable meanings
domain: Concept
domain: Resource
domain: http://lodlaundromat.org/.well-known/genid/samples/jena///predicate//4f5f5734e1719911a6ea81b78b619b4b/d8234c3b1439a879aea940e9009663be#1
range: Concept
range: Resource
range: http://lodlaundromat.org/.well-known/genid/samples/jena///predicate//4f5f5734e1719911a6ea81b78b619b4b/d8234c3b1439a879aea940e9009663be#1

interest
range: Thing
domain: Thing
type: Property
type: ObjectProperty
comment: A page about a topic of interest to this person.
domain: Agent
range: Document
term status: testing
domain: Resource
range: Resource

work info homepage
range: Thing
domain: Thing
type: Property
type: ObjectProperty
comment: A work info homepage of some person; a page about their work for some organization.
domain: Person
range: Document
term status: testing
domain: SpatialThing
domain: Agent
domain: Human Agent
domain: Resource
range: Resource

account service homepage
range: Thing
domain: Thing
type: Property
type: ObjectProperty
comment: Indicates a homepage of the service provide for this online account.
domain: Online Account
range: Document
term status: testing
domain: Resource
range: Resource

Data Item
subclass of: Thing
subclass of: Resource
type: Class
comment: Immutable is a concept that represents entities which are immutable.
subclass of: Entity

has broader
sub property of: is in semantic relation with
range: Thing
domain: Thing
definition: Relates a concept to a concept that is more general in meaning.
comment: Broader concepts are typically rendered as parents in a concept hierarchy (tree).
scope note: By convention, skos:broader is only used to assert an immediate (i.e. direct) hierarchical link between two conceptual resources.
type: ObjectProperty
sub property of: has broader transitive
inverse of: has narrower
type: Property
note: By convention, skos:broader is only used to assert an immediate (i.e. direct) hierarchical link between two conceptual resources.
note: Relates a concept to a concept that is more general in meaning.
domain: Concept
domain: Resource
domain: http://lodlaundromat.org/.well-known/genid/samples/jena///predicate//4f5f5734e1719911a6ea81b78b619b4b/d8234c3b1439a879aea940e9009663be#1
range: Concept
range: Resource
range: http://lodlaundromat.org/.well-known/genid/samples/jena///predicate//4f5f5734e1719911a6ea81b78b619b4b/d8234c3b1439a879aea940e9009663be#1

has member
range: Thing
domain: Thing
definition: Relates a collection to one of its members.
type: ObjectProperty
domain: Collection
range: http://lodlaundromat.org/.well-known/genid/samples/jena///predicate//4f5f5734e1719911a6ea81b78b619b4b/d8234c3b1439a879aea940e9009663be#1
type: Property
note: Relates a collection to one of its members.
domain: Resource
domain: http://lodlaundromat.org/.well-known/genid/samples/jena///predicate//4f5f5734e1719911a6ea81b78b619b4b/d8234c3b1439a879aea940e9009663be#1
range: Resource

member
range: Thing
domain: Thing
type: Property
type: ObjectProperty
comment: Indicates a member of a Group
domain: Group
range: Agent
term status: stable
domain: Resource
domain: Human Agent
domain: Agent
range: Resource

personal mailbox
domain: Thing
type: Property
type: InverseFunctionalProperty
type: ObjectProperty
comment: A personal mailbox, ie. an Internet mailbox associated with exactly one owner, the first owner of this mailbox. This is a 'static inverse functional property', in that there is (across time and change) at most one individual that ever has any particular value for foaf:mbox.
domain: Agent
range: Thing
term status: stable
domain: Resource
range: Resource

Concept Scheme
subclass of: Thing
subclass of: Resource
type: Class
definition: A set of concepts, optionally including statements about semantic relationships between those concepts.
scope note: A concept scheme may be defined to include concepts from different sources.
example: Thesauri, classification schemes, subject heading lists, taxonomies, 'folksonomies', and other types of controlled vocabulary are all examples of concept schemes. Concept schemes are also embedded in glossaries and terminologies.
disjoint with: Concept
note: Thesauri, classification schemes, subject heading lists, taxonomies, 'folksonomies', and other types of controlled vocabulary are all examples of concept schemes. Concept schemes are also embedded in glossaries and terminologies.
note: A concept scheme may be defined to include concepts from different sources.
note: A set of concepts, optionally including statements about semantic relationships between those concepts.
disjoint with: Collection

technical feature
subclass of: Resource
subclass of: Thing
type: Class
comment: A technical feature of a void:Dataset, such as a supported RDF serialization format.

has top concept
range: Thing
domain: Thing
definition: Relates, by convention, a concept scheme to a concept which is topmost in the broader/narrower concept hierarchies for that scheme, providing an entry point to these hierarchies.
type: ObjectProperty
domain: Concept Scheme
range: Concept
inverse of: is top concept in scheme
type: Property
note: Relates, by convention, a concept scheme to a concept which is topmost in the broader/narrower concept hierarchies for that scheme, providing an entry point to these hierarchies.
domain: Resource
range: http://lodlaundromat.org/.well-known/genid/samples/jena///predicate//4f5f5734e1719911a6ea81b78b619b4b/d8234c3b1439a879aea940e9009663be#1
range: Resource

Non-Human Agent
subclass of: Thing
subclass of: Resource
type: Class
comment: NonHumanAgent is a general class that represents agents who are not social beings.
disjoint with: Human Agent
subclass of: Agent

weblog
range: Thing
domain: Thing
sub property of: page
type: Property
range: Document
term status: testing
comment: A weblog of some thing (whether person, group, company etc.).
domain: Agent
type: InverseFunctionalProperty
type: ObjectProperty
domain: Resource
range: Resource

Online Account
subclass of: Resource
type: Class
comment: An online account.
subclass of: Thing
term status: testing

has broader match
sub property of: is in semantic relation with
sub property of: has broader transitive
range: Thing
domain: Thing
definition: skos:broadMatch is used to state a hierarchical mapping link between two conceptual resources in different concept schemes.
type: ObjectProperty
sub property of: is in mapping relation with
sub property of: has broader
inverse of: has narrower match
type: Property
note: skos:broadMatch is used to state a hierarchical mapping link between two conceptual resources in different concept schemes.
domain: Concept
domain: Resource
domain: http://lodlaundromat.org/.well-known/genid/samples/jena///predicate//4f5f5734e1719911a6ea81b78b619b4b/d8234c3b1439a879aea940e9009663be#1
range: Concept
range: Resource
range: http://lodlaundromat.org/.well-known/genid/samples/jena///predicate//4f5f5734e1719911a6ea81b78b619b4b/d8234c3b1439a879aea940e9009663be#1

Online Chat Account
subclass of: Resource
subclass of: Thing
type: Class
comment: An online chat account.
subclass of: Online Account
term status: unstable

Artifact
subclass of: Resource
subclass of: Thing
type: Class
type: DeprecatedClass
comment: This class is deprecated and will be removed from the Provenance Vocabulary in the next revision. prv:Artifact was deprecated in the process of making the Provenance Vocabulary a specialization of W3C's PROV-O. Hence, use prov:Entity (or the more specific prv:Immutable) instead.

has related
range: Thing
domain: Thing
definition: Relates a concept to a concept with which there is an associative semantic relationship.
type: ObjectProperty
sub property of: is in semantic relation with
type: SymmetricProperty
comment: skos:related is disjoint with skos:broaderTransitive
type: Property
note: Relates a concept to a concept with which there is an associative semantic relationship.
domain: Concept
domain: Resource
domain: http://lodlaundromat.org/.well-known/genid/samples/jena///predicate//4f5f5734e1719911a6ea81b78b619b4b/d8234c3b1439a879aea940e9009663be#1
range: Concept
range: Resource
range: http://lodlaundromat.org/.well-known/genid/samples/jena///predicate//4f5f5734e1719911a6ea81b78b619b4b/d8234c3b1439a879aea940e9009663be#1

knows
range: Thing
domain: Thing
type: Property
type: ObjectProperty
comment: A person known by this person (indicating some level of reciprocated interaction between the parties).
domain: Person
range: Person
term status: stable
domain: SpatialThing
domain: Agent
domain: Human Agent
domain: Resource
range: Agent
range: Resource
range: Human Agent
range: SpatialThing

Data Access
subclass of: Thing
subclass of: Resource
type: Class
comment: DataAccess is a concept that represents the completed execution of an activity by which an immutable data item has been retrieved from the Web.
disjoint with: Data Creation
subclass of: http://lodlaundromat.org/.well-known/genid/samples/jena///predicate//4f5f5734e1719911a6ea81b78b619b4b/d3e700bc1857a8001f8ca87e5b965b3a#2
subclass of: http://lodlaundromat.org/.well-known/genid/samples/jena///predicate//4f5f5734e1719911a6ea81b78b619b4b/d3e700bc1857a8001f8ca87e5b965b3a#3
subclass of: Activity

page
range: Thing
type: Property
type: ObjectProperty
comment: A page or document about this thing.
domain: Thing
range: Document
inverse of: topic
term status: testing
domain: Resource
range: Resource

Human Agent
subclass of: Resource
subclass of: Thing
type: Class
comment: HumanAgent is a general class that represents agents who are social beings such as persons, organizations, companies.
disjoint with: Non-Human Agent
subclass of: Agent

Concept
subclass of: Thing
subclass of: http://lodlaundromat.org/.well-known/genid/samples/jena///predicate//4f5f5734e1719911a6ea81b78b619b4b/d8234c3b1439a879aea940e9009663be#1
subclass of: Resource
type: Class
definition: An idea or notion; a unit of thought.
note: An idea or notion; a unit of thought.
disjoint with: Concept Scheme
disjoint with: Collection

account
range: Thing
domain: Thing
type: Property
type: ObjectProperty
comment: Indicates an account held by this agent.
domain: Agent
range: Online Account
term status: testing
domain: Resource
range: Resource

homepage
range: Thing
comment: A homepage for some thing.
range: Document
type: Property
term status: stable
sub property of: page
sub property of: is primary topic of
domain: Thing
type: ObjectProperty
type: InverseFunctionalProperty
domain: Resource
range: Resource

Label Property
subclass of: Resource
subclass of: Thing
type: Class
comment: A foaf:LabelProperty is any RDF property with texual values that serve as labels.
term status: unstable

PersonalProfileDocument
subclass of: Resource
subclass of: Thing
type: Class
comment: A personal profile RDF document.
subclass of: Document
term status: testing

Data Providing Service
subclass of: Thing
subclass of: Resource
type: Class
comment: DataProvidingService is a concept that represents a non-human agent - usually a Web service or a server - that processes data access requests and actually sends the requested Web representations over the Web.
subclass of: Non-Human Agent
subclass of: Agent

Jun Zhao
type: Person
type: Thing
type: Human Agent
type: SpatialThing
type: Agent
made: Provenance Vocabulary Core Ontology namespace
different from: http://lodlaundromat.org/.well-known/genid/4f5f5734e1719911a6ea81b78b619b4b#10
different from: jita
different from: http://lodlaundromat.org/.well-known/genid/4f5f5734e1719911a6ea81b78b619b4b#2

used
range: Thing
domain: Thing
type: ObjectProperty
comment: This property is deprecated and will be removed from the Provenance Vocabulary in the next revision. prv:employedArtifact was deprecated in the process of making the Provenance Vocabulary a specialization of W3C's PROV-O. Hence, use prov:used instead.
type: DeprecatedProperty
type: Property
domain: Resource
range: Resource

has broader transitive
range: Thing
domain: Thing
definition: skos:broaderTransitive is a transitive superproperty of skos:broader.
scope note: By convention, skos:broaderTransitive is not used to make assertions. Rather, the properties can be used to draw inferences about the transitive closure of the hierarchical relation, which is useful e.g. when implementing a simple query expansion algorithm in a search application.
type: ObjectProperty
sub property of: is in semantic relation with
type: TransitiveProperty
inverse of: has narrower transitive
type: Property
note: By convention, skos:broaderTransitive is not used to make assertions. Rather, the properties can be used to draw inferences about the transitive closure of the hierarchical relation, which is useful e.g. when implementing a simple query expansion algorithm in a search application.
note: skos:broaderTransitive is a transitive superproperty of skos:broader.
domain: Concept
domain: Resource
domain: http://lodlaundromat.org/.well-known/genid/samples/jena///predicate//4f5f5734e1719911a6ea81b78b619b4b/d8234c3b1439a879aea940e9009663be#1
range: Concept
range: Resource
range: http://lodlaundromat.org/.well-known/genid/samples/jena///predicate//4f5f5734e1719911a6ea81b78b619b4b/d8234c3b1439a879aea940e9009663be#1

Actor
subclass of: Resource
subclass of: Thing
type: Class
type: DeprecatedClass
comment: This class is deprecated and will be removed from the Provenance Vocabulary in the next revision. prv:Actor was deprecated in the process of making the Provenance Vocabulary a specialization of W3C's PROV-O. Hence, use one of the more specific classes prv:HumanAgent and prv:NonHumanAgent instead; or, if such a specialization is unsuitable for the use case at hand, directly use the general class prov:Agent as defined by PROV-O.

File
subclass of: http://lodlaundromat.org/.well-known/genid/samples/jena///predicate//4f5f5734e1719911a6ea81b78b619b4b/d3e700bc1857a8001f8ca87e5b965b3a#4
subclass of: http://lodlaundromat.org/.well-known/genid/samples/jena///predicate//4f5f5734e1719911a6ea81b78b619b4b/d3e700bc1857a8001f8ca87e5b965b3a#7
subclass of: Resource
subclass of: Thing
type: Class
comment: File is a general class that represents computer files/documents of any kind.
disjoint with: Data Item
subclass of: Entity

has narrower match
sub property of: has narrower transitive
range: Thing
domain: Thing
sub property of: is in semantic relation with
definition: skos:narrowMatch is used to state a hierarchical mapping link between two conceptual resources in different concept schemes.
type: ObjectProperty
sub property of: is in mapping relation with
sub property of: has narrower
inverse of: has broader match
type: Property
note: skos:narrowMatch is used to state a hierarchical mapping link between two conceptual resources in different concept schemes.
domain: Resource
domain: Concept
domain: http://lodlaundromat.org/.well-known/genid/samples/jena///predicate//4f5f5734e1719911a6ea81b78b619b4b/d8234c3b1439a879aea940e9009663be#1
range: Resource
range: Concept
range: http://lodlaundromat.org/.well-known/genid/samples/jena///predicate//4f5f5734e1719911a6ea81b78b619b4b/d8234c3b1439a879aea940e9009663be#1

topic
domain: Thing
type: Property
type: ObjectProperty
comment: A topic of some page or document.
domain: Document
range: Thing
inverse of: page
term status: testing
domain: Resource
range: Resource

Data Item
subclass of: Thing
subclass of: http://lodlaundromat.org/.well-known/genid/samples/jena///predicate//4f5f5734e1719911a6ea81b78b619b4b/d3e700bc1857a8001f8ca87e5b965b3a#4
subclass of: http://lodlaundromat.org/.well-known/genid/samples/jena///predicate//4f5f5734e1719911a6ea81b78b619b4b/d3e700bc1857a8001f8ca87e5b965b3a#7
subclass of: Resource
type: Class
comment: DataItem is a general concept that represents data items of any kind.
disjoint with: File
subclass of: Entity
subclass of: InformationRealization

maker
sub property of: creator
range: Thing
equivalent property: creator
comment: An agent that made this thing.
term status: stable
domain: Thing
inverse of: made
type: Property
range: Agent
type: ObjectProperty
domain: Resource
range: Resource

is top concept in scheme
range: Thing
domain: Thing
definition: Relates a concept to the concept scheme that it is a top level concept of.
type: ObjectProperty
sub property of: is in scheme
inverse of: has top concept
type: Property
domain: Concept
range: Concept Scheme
note: Relates a concept to the concept scheme that it is a top level concept of.
domain: Resource
range: Resource
domain: http://lodlaundromat.org/.well-known/genid/samples/jena///predicate//4f5f5734e1719911a6ea81b78b619b4b/d8234c3b1439a879aea940e9009663be#1

old homepage
sub property of: page
sub property of: is primary topic of
label: stará domovská stránka @cs
label: 前のホームページ @ja
type: InverseFunctionalProperty
sub property of: homepage
label: ancienne page web @fr
domain: Project
type: Property
comment: URL adresa předešlé domovské stránky projektu asociované s právě jedním projektem. @cs
comment: URL of a project's past homepage, associated with exactly one project.
label: Alte Homepage @de
comment: L'URL d'une ancienne page web d'un projet, associée avec un unique projet. @fr
comment: URL der letzten Projekt-Homepage, verbunden mit genau einem Projekt. @de
comment: El URL de la antigua página de un proyecto, asociada con exactamente un proyecto. @es
comment: このプロジェクトの前のホームページ。他のプロジェクトの前のホームページじゃないこと。 @ja
label: página web antigua @es
type: ObjectProperty
domain: Thing
domain: Resource
range: Thing
range: Document
range: Resource

runs
range: Thing
domain: Thing
type: Property
type: ObjectProperty
comment: This property refers to the software that was run by a non-human actor (usually a service).
domain: Non-Human Agent
domain: Resource
domain: Agent
range: Resource

openid
sub property of: page
range: Thing
domain: Thing
range: Document
type: ObjectProperty
term status: testing
type: Property
domain: Agent
type: InverseFunctionalProperty
sub property of: is primary topic of
comment: An OpenID for an Agent.
domain: Resource
range: Resource

yielded by
range: Thing
domain: Thing
type: ObjectProperty
comment: This property is deprecated and will be removed from the Provenance Vocabulary in the next revision. prv:yieldedBy was deprecated in the process of making the Provenance Vocabulary a specialization of W3C's PROV-O. Hence, use prov:wasGeneratedBy instead.
type: DeprecatedProperty
type: Property
domain: Resource
range: Resource

dataset
subclass of: Resource
subclass of: Thing
type: Class
comment: A set of RDF triples that are published, maintained or aggregated by a single provider.

has related match
range: Thing
domain: Thing
sub property of: is in semantic relation with
definition: skos:relatedMatch is used to state an associative mapping link between two conceptual resources in different concept schemes.
type: ObjectProperty
sub property of: is in mapping relation with
sub property of: has related
type: SymmetricProperty
type: Property
note: skos:relatedMatch is used to state an associative mapping link between two conceptual resources in different concept schemes.
domain: Concept
domain: Resource
domain: http://lodlaundromat.org/.well-known/genid/samples/jena///predicate//4f5f5734e1719911a6ea81b78b619b4b/d8234c3b1439a879aea940e9009663be#1
range: Concept
range: Resource
range: http://lodlaundromat.org/.well-known/genid/samples/jena///predicate//4f5f5734e1719911a6ea81b78b619b4b/d8234c3b1439a879aea940e9009663be#1

executed at
type: Property
type: DeprecatedProperty
comment: This property has been renamed to prv:completedAt. Hence, prv:performedAt is deprecated and will be removed from the Provenance Vocabulary in the next revision.
type: DatatypeProperty

retrieved by
range: Thing
domain: Thing
type: Property
type: ObjectProperty
comment: This property refers to the data access by which an immutable entity has been retrieved from the Web. Each entity that has this property is a Web representation.
type: FunctionalProperty
domain: Data Item
domain: http://lodlaundromat.org/.well-known/genid/samples/jena///predicate//4f5f5734e1719911a6ea81b78b619b4b/d3e700bc1857a8001f8ca87e5b965b3a#4
range: Data Access
sub property of: wasGeneratedBy
domain: Resource
range: Resource
domain: Entity
range: http://lodlaundromat.org/.well-known/genid/samples/jena///predicate//4f5f5734e1719911a6ea81b78b619b4b/d3e700bc1857a8001f8ca87e5b965b3a#3
range: http://lodlaundromat.org/.well-known/genid/samples/jena///predicate//4f5f5734e1719911a6ea81b78b619b4b/d3e700bc1857a8001f8ca87e5b965b3a#2
range: Activity

Jun Zhao
type: Person
type: Thing
type: Human Agent
type: SpatialThing
type: Agent
made: Provenance Vocabulary Core Ontology namespace
different from: http://lodlaundromat.org/.well-known/genid/4f5f5734e1719911a6ea81b78b619b4b#10
different from: jita
different from: http://lodlaundromat.org/.well-known/genid/4f5f5734e1719911a6ea81b78b619b4b#2

Version
subclass of: Resource
comment: Información sobre la versión de un release del proyecto. @es
comment: リリースのバーション情報 @jp
comment: Détails sur une version d'une realease d'un projet. @fr
comment: Informace o uvolněné verzi projektu. @cs
type: Class
label: バーション @ja
comment: Version information of a project release.
label: Verze @cs
comment: Versionsinformation eines Projekt Releases. @de
label: Versión @es

Online E-commerce Account
subclass of: Resource
subclass of: Thing
type: Class
comment: An online e-commerce account.
subclass of: Online Account
term status: unstable

Specification
type: Class
label: 明細書じ @ja
comment: A specification of a system's aspects, technical or otherwise.
comment: あるシステムの詳しく書いた明細書。多分技術的なもの。 @ja
subclass of: Resource

Project
subclass of: Resource
type: Class
label: Proyecto @es
subclass of: Project
comment: プログラミングのプロジェクト @ja
comment: Projekt. @cs
label: Projet @fr
comment: Un proyecto. @es
label: Projekt @cs
comment: Ein Projekt. @de
label: Prijekt @de
comment: Un projet. @fr
comment: A project.
label: プロジェクト @ja

Data Publisher
subclass of: Thing
subclass of: Resource
type: Class
comment: DataPublisher is a concept that represents entities such as persons, groups, or organizations who use a data providing service (see concept prv:DataProvidingService) to publish data on the Web.
subclass of: Human Agent
subclass of: Agent

Group
subclass of: Resource
subclass of: Thing
subclass of: Agent
subclass of: Human Agent
type: Class
comment: A class of Agents.
term status: stable

workplace homepage
range: Thing
domain: Thing
type: Property
type: ObjectProperty
comment: A workplace homepage of some person; the homepage of an organization they work for.
domain: Person
range: Document
term status: testing
domain: SpatialThing
domain: Agent
domain: Human Agent
domain: Resource
range: Resource

account
range: Thing
domain: Thing
type: Property
type: ObjectProperty
comment: Indicates an account held by this agent.
domain: Agent
range: Online Account
term status: archaic
domain: Resource
range: Resource

involved
range: Thing
domain: Thing
type: ObjectProperty
comment: This property is deprecated and will be removed from the Provenance Vocabulary in the next revision. prv:involvedActor was deprecated in the process of making the Provenance Vocabulary a specialization of W3C's PROV-O. Hence, use prov:wasAssociatedWith instead.
type: DeprecatedProperty
type: Property
domain: Resource
range: Resource

http://lodlaundromat.org/.well-known/genid/samples/jena///predicate//4f5f5734e1719911a6ea81b78b619b4b/d3e700bc1857a8001f8ca87e5b965b3a#2
subclass of: Resource
subclass of: Thing
type: Class
type: Restriction
on property: accessed
max cardinality: 1

Image
subclass of: Resource
subclass of: Thing
type: Class
comment: An image.
subclass of: Document
term status: testing

Person
subclass of: Resource
subclass of: Thing
subclass of: Agent
comment: A person.
term status: stable
subclass of: SpatialThing
subclass of: Human Agent
disjoint with: Project
type: Class
subclass of: Person
disjoint with: Organization

GNU Arch repository
subclass of: Resource
subclass of: Thing
subclass of: http://lodlaundromat.org/.well-known/genid/samples/jena///predicate//4f5f5734e1719911a6ea81b78b619b4b/bf83860cd7dab8f53104c5f50b382094#2
label: GNU Archのリポジトリ @ja
label: Dépôt GNU Arch @fr
type: Class
subclass of: Repository
comment: GNU Arch source code repository.
comment: Úložiště zdrojových kódů GNU Arch. @cs
label: Repositorio GNU Arch @es
comment: Dépôt GNU Arch du code source. @fr
label: Úložiště GNU Arch @cs
comment: ソースコードのGNU Archのリポジトリ @ja
comment: Repositorio GNU Arch del código fuente. @es
comment: GNU Arch Quellcode-Versionierungssystem. @de

phone
range: Thing
domain: Thing
type: Property
type: ObjectProperty
comment: A phone, specified using fully qualified tel: URI scheme (refs: http://www.w3.org/Addressing/schemes.html#tel).
term status: testing
domain: Resource
range: Resource

Mercurial Repository
subclass of: Resource
type: Class
label: Mercurialのリポジトリ @ja
comment: Mercurial source code repository.
comment: ソースコードのMercurialのリポジトリ @ja
subclass of: Repository

depicts
domain: Thing
type: Property
type: ObjectProperty
comment: A thing depicted in this representation.
domain: Image
range: Thing
inverse of: depiction
term status: testing
domain: Document
domain: Resource
range: Resource

Data Creation
subclass of: Thing
subclass of: Resource
type: Class
comment: DataCreation is a concept that represents the execution of an activity by which data items have been created.
disjoint with: Data Access
subclass of: Activity

contained in
range: Thing
domain: Thing
type: ObjectProperty
comment: This property refers to a data item that contained a data item. Hence, this property refers to another data item of a larger granularity (e.g. an RDF triple is usually contained in an RDF graph).
domain: Data Item
range: Data Item
type: Property
domain: Resource
domain: Entity
domain: InformationRealization
domain: http://lodlaundromat.org/.well-known/genid/samples/jena///predicate//4f5f5734e1719911a6ea81b78b619b4b/d3e700bc1857a8001f8ca87e5b965b3a#4
domain: http://lodlaundromat.org/.well-known/genid/samples/jena///predicate//4f5f5734e1719911a6ea81b78b619b4b/d3e700bc1857a8001f8ca87e5b965b3a#7
range: Resource
range: Entity
range: http://lodlaundromat.org/.well-known/genid/samples/jena///predicate//4f5f5734e1719911a6ea81b78b619b4b/d3e700bc1857a8001f8ca87e5b965b3a#7
range: InformationRealization
range: http://lodlaundromat.org/.well-known/genid/samples/jena///predicate//4f5f5734e1719911a6ea81b78b619b4b/d3e700bc1857a8001f8ca87e5b965b3a#4

used
type: Property
range: Thing
domain: Thing
type: ObjectProperty
comment: This property refers to a source data item that has been used during the creation of a data item. Examples for source data are the content of a document used for machine learning, the statements in a knowledge base used to entail a new statement, and the entries in a database used to answer a query. Notice, all source data has provenance; we strongly encourage to describe this provenance as well, at least as far as available information permits.
domain: Data Creation
range: Data Item
sub property of: used
domain: Resource
range: Resource
domain: Activity
range: Entity
range: http://lodlaundromat.org/.well-known/genid/samples/jena///predicate//4f5f5734e1719911a6ea81b78b619b4b/d3e700bc1857a8001f8ca87e5b965b3a#7
range: InformationRealization
range: http://lodlaundromat.org/.well-known/genid/samples/jena///predicate//4f5f5734e1719911a6ea81b78b619b4b/d3e700bc1857a8001f8ca87e5b965b3a#4

is in scheme
range: Thing
domain: Thing
definition: Relates a resource (for example a concept) to a concept scheme in which it is included.
scope note: A concept may be a member of more than one concept scheme.
type: ObjectProperty
range: Concept Scheme
type: Property
note: A concept may be a member of more than one concept scheme.
note: Relates a resource (for example a concept) to a concept scheme in which it is included.
domain: Resource
range: Resource

linkset
subclass of: Resource
subclass of: Thing
type: Class
comment: A collection of RDF links between two void:Datasets.
subclass of: dataset

Repository
subclass of: Resource
label: Úložiště @cs
comment: ソースコードのリポジトリ @ja
label: リポジトリ @ja
comment: Source code repository.
comment: Dépôt du code source. @fr
label: Dépôt @fr
label: Repositorio @es
comment: Quellcode-Versionierungssystem. @de
type: Class
comment: Úložiště zdrojových kódů. @cs
comment: Repositorio del código fuente. @es

is in semantic relation with
range: Thing
domain: Thing
definition: Links a concept to a concept related by meaning.
scope note: This property should not be used directly, but as a super-property for all properties denoting a relationship of meaning between concepts.
type: ObjectProperty
domain: Concept
range: Concept
type: Property
note: This property should not be used directly, but as a super-property for all properties denoting a relationship of meaning between concepts.
note: Links a concept to a concept related by meaning.
domain: Resource
domain: http://lodlaundromat.org/.well-known/genid/samples/jena///predicate//4f5f5734e1719911a6ea81b78b619b4b/d8234c3b1439a879aea940e9009663be#1
range: http://lodlaundromat.org/.well-known/genid/samples/jena///predicate//4f5f5734e1719911a6ea81b78b619b4b/d8234c3b1439a879aea940e9009663be#1
range: Resource

has member list
range: Thing
domain: Thing
definition: Relates an ordered collection to the RDF list containing its members.
type: ObjectProperty
domain: Ordered Collection
type: FunctionalProperty
range: List
comment: For any resource, every item in the list given as the value of the skos:memberList property is also a value of the skos:member property.
type: Property
note: Relates an ordered collection to the RDF list containing its members.
domain: http://lodlaundromat.org/.well-known/genid/samples/jena///predicate//4f5f5734e1719911a6ea81b78b619b4b/d8234c3b1439a879aea940e9009663be#1
domain: Resource
domain: Collection
range: Resource

current project
domain: Thing
type: Property
type: ObjectProperty
comment: A current project this person works on.
domain: Person
range: Thing
term status: testing
domain: SpatialThing
domain: Agent
domain: Human Agent
domain: Resource
range: Resource

has exact match
sub property of: is in semantic relation with
sub property of: is in mapping relation with
range: Thing
domain: Thing
definition: skos:exactMatch is used to link two concepts, indicating a high degree of confidence that the concepts can be used interchangeably across a wide range of information retrieval applications. skos:exactMatch is a transitive property, and is a sub-property of skos:closeMatch.
type: ObjectProperty
sub property of: has close match
type: SymmetricProperty
type: TransitiveProperty
comment: skos:exactMatch is disjoint with each of the properties skos:broadMatch and skos:relatedMatch.
type: Property
note: skos:exactMatch is used to link two concepts, indicating a high degree of confidence that the concepts can be used interchangeably across a wide range of information retrieval applications. skos:exactMatch is a transitive property, and is a sub-property of skos:closeMatch.
domain: Resource
domain: Concept
domain: http://lodlaundromat.org/.well-known/genid/samples/jena///predicate//4f5f5734e1719911a6ea81b78b619b4b/d8234c3b1439a879aea940e9009663be#1
range: Resource
range: Concept
range: http://lodlaundromat.org/.well-known/genid/samples/jena///predicate//4f5f5734e1719911a6ea81b78b619b4b/d8234c3b1439a879aea940e9009663be#1

Bazaar Branch
subclass of: Resource
type: Class
label: Bazzarのリポジトリ @ja
comment: Bazaar source code branch.
comment: ソースコードのBazzarのリポジトリ @ja
subclass of: Repository

http://lodlaundromat.org/.well-known/genid/samples/jena///predicate//4f5f5734e1719911a6ea81b78b619b4b/d3e700bc1857a8001f8ca87e5b965b3a#3
subclass of: Resource
subclass of: Thing
type: Class
type: Restriction
on property: accessed
max cardinality: 1

homepage
sub property of: is primary topic of
sub property of: page
label: page web @fr
sub property of: homepage
label: Homepage @de
label: página web @es
comment: El URL de la página de un proyecto, asociada con exactamente un proyecto. @es
label: ホームページ @ja
comment: URL of a project's homepage, associated with exactly one project.
domain: Project
comment: URL der Projekt-Homepage, verbunden mit genau einem Projekt. @de
comment: このプロジェクトのホームページのURL。このホームページは他のプロジェクトのホームページじゃないこと。 @ja
label: domovská stránka @cs
comment: L'URL de la page web d'un projet, associée avec un unique projet. @fr
type: InverseFunctionalProperty
type: Property
comment: URL adresa domovské stránky projektu asociované s právě jedním projektem. @cs
type: ObjectProperty
domain: Thing
domain: Resource
range: Thing
range: Document
range: Resource

used by
range: Thing
domain: Thing
type: ObjectProperty
comment: This property refers to a data publisher who used a data providing services at the time the provenance description refers to.
domain: Data Providing Service
range: Data Publisher
sub property of: actedOnBehalfOf
type: Property
domain: Resource
range: Resource
domain: Agent
domain: Non-Human Agent
range: Human Agent
range: Agent

has narrower
sub property of: is in semantic relation with
range: Thing
domain: Thing
definition: Relates a concept to a concept that is more specific in meaning.
scope note: By convention, skos:broader is only used to assert an immediate (i.e. direct) hierarchical link between two conceptual resources.
comment: Narrower concepts are typically rendered as children in a concept hierarchy (tree).
type: ObjectProperty
sub property of: has narrower transitive
inverse of: has broader
type: Property
note: By convention, skos:broader is only used to assert an immediate (i.e. direct) hierarchical link between two conceptual resources.
note: Relates a concept to a concept that is more specific in meaning.
domain: Concept
domain: Resource
domain: http://lodlaundromat.org/.well-known/genid/samples/jena///predicate//4f5f5734e1719911a6ea81b78b619b4b/d8234c3b1439a879aea940e9009663be#1
range: Concept
range: Resource
range: http://lodlaundromat.org/.well-known/genid/samples/jena///predicate//4f5f5734e1719911a6ea81b78b619b4b/d8234c3b1439a879aea940e9009663be#1

schoolHomepage
range: Thing
domain: Thing
type: Property
type: ObjectProperty
comment: A homepage of a school attended by the person.
domain: Person
range: Document
term status: testing
domain: SpatialThing
domain: Agent
domain: Human Agent
domain: Resource
range: Resource

Organization
subclass of: Agent
subclass of: Resource
subclass of: Thing
type: Class
term status: stable
subclass of: Human Agent
disjoint with: Person
disjoint with: Document
comment: An organization.

accessed
range: Thing
domain: Thing
type: ObjectProperty
comment: This property refers to the Web resource that has been accessed during the execution of a data access. More precisely, the request of the referenced Web resource resulted in retrieving the representation that has been retrieved by the corresponding prv:DataAccess execution.
domain: Data Access
range: WebResource
type: Property
domain: Activity
domain: Resource
domain: http://lodlaundromat.org/.well-known/genid/samples/jena///predicate//4f5f5734e1719911a6ea81b78b619b4b/d3e700bc1857a8001f8ca87e5b965b3a#3
domain: http://lodlaundromat.org/.well-known/genid/samples/jena///predicate//4f5f5734e1719911a6ea81b78b619b4b/d3e700bc1857a8001f8ca87e5b965b3a#2
range: Resource

operated by
range: Thing
domain: Thing
type: ObjectProperty
comment: This property refers to a human agent who was operating a non-human agent. For instance, a service provider operates a data providing service (see concept prv:DataProvidingService). Another example is a human agent who operates a non-human data creating agent.
domain: Non-Human Agent
range: Human Agent
sub property of: actedOnBehalfOf
type: Property
domain: Resource
range: Resource
domain: Agent
range: Agent

focus
domain: Thing
type: Property
type: ObjectProperty
comment: The underlying or 'focal' entity associated with some SKOS-described concept.
domain: Concept
range: Thing
term status: testing
domain: Resource
domain: http://lodlaundromat.org/.well-known/genid/samples/jena///predicate//4f5f5734e1719911a6ea81b78b619b4b/d8234c3b1439a879aea940e9009663be#1
range: Resource

topic_interest
domain: Thing
type: Property
type: ObjectProperty
comment: A thing of interest to this person.
domain: Agent
range: Thing
term status: testing
domain: Resource
range: Resource

completed at
sub property of: endedAtTime
type: FunctionalProperty
comment: This property refers to the time an activity has been completed.
type: DatatypeProperty
equivalent property: endedAtTime
type: Property

made
domain: Thing
type: Property
type: ObjectProperty
comment: Something that was made by this agent.
domain: Agent
range: Thing
inverse of: maker
term status: stable
domain: Resource
range: Resource

past project
domain: Thing
type: Property
type: ObjectProperty
comment: A project this person has previously worked on.
domain: Person
range: Thing
term status: testing
domain: SpatialThing
domain: Agent
domain: Human Agent
domain: Resource
range: Resource

Non-Human Actor
subclass of: Resource
subclass of: Thing
type: Class
type: DeprecatedClass
comment: This class is deprecated and will be removed from the Provenance Vocabulary in the next revision. prv:NonHumanActor was renamed to prv:NonHumanAgent in the process of making the Provenance Vocabulary a specialization of W3C's PROV-O. Hence, use prv:NonHumanAgent instead.

created by
type: Property
range: Thing
domain: Thing
type: ObjectProperty
comment: This property refers to the creation of a data item (or a file that serializes data items).
domain: http://lodlaundromat.org/.well-known/genid/samples/jena///predicate//4f5f5734e1719911a6ea81b78b619b4b/d3e700bc1857a8001f8ca87e5b965b3a#7
range: Data Creation
sub property of: wasGeneratedBy
property chain axiom: http://lodlaundromat.org/.well-known/genid/samples/jena///predicate//4f5f5734e1719911a6ea81b78b619b4b/d3e700bc1857a8001f8ca87e5b965b3a#10
domain: Resource
range: Resource
range: Activity

immediately preceded by
range: Thing
domain: Thing
type: ObjectProperty
comment: This property may be used to make the relationship between different version of a data item explicit. More precisely, this property refers to an immediately preceding version of a data item; hence, the new version (i.e. the subject) has been created using the old version (i.e. the object). We strongly encourage to also describe this creation of the new version explicitly.
domain: Data Item
range: Data Item
sub property of: http://lodlaundromat.org/.well-known/genid/samples/jena///predicate//4f5f5734e1719911a6ea81b78b619b4b/d3e700bc1857a8001f8ca87e5b965b3a#1
sub property of: replaces
type: Property
domain: Resource
range: Resource
domain: Entity
domain: InformationRealization
domain: http://lodlaundromat.org/.well-known/genid/samples/jena///predicate//4f5f5734e1719911a6ea81b78b619b4b/d3e700bc1857a8001f8ca87e5b965b3a#4
domain: http://lodlaundromat.org/.well-known/genid/samples/jena///predicate//4f5f5734e1719911a6ea81b78b619b4b/d3e700bc1857a8001f8ca87e5b965b3a#7
range: Entity
range: http://lodlaundromat.org/.well-known/genid/samples/jena///predicate//4f5f5734e1719911a6ea81b78b619b4b/d3e700bc1857a8001f8ca87e5b965b3a#7
range: InformationRealization
range: http://lodlaundromat.org/.well-known/genid/samples/jena///predicate//4f5f5734e1719911a6ea81b78b619b4b/d3e700bc1857a8001f8ca87e5b965b3a#4

has close match
range: Thing
domain: Thing
sub property of: is in semantic relation with
definition: skos:closeMatch is used to link two concepts that are sufficiently similar that they can be used interchangeably in some information retrieval applications. In order to avoid the possibility of "compound errors" when combining mappings across more than two concept schemes, skos:closeMatch is not declared to be a transitive property.
type: ObjectProperty
sub property of: is in mapping relation with
type: SymmetricProperty
type: Property
note: skos:closeMatch is used to link two concepts that are sufficiently similar that they can be used interchangeably in some information retrieval applications. In order to avoid the possibility of "compound errors" when combining mappings across more than two concept schemes, skos:closeMatch is not declared to be a transitive property.
domain: Concept
domain: Resource
domain: http://lodlaundromat.org/.well-known/genid/samples/jena///predicate//4f5f5734e1719911a6ea81b78b619b4b/d8234c3b1439a879aea940e9009663be#1
range: Concept
range: Resource
range: http://lodlaundromat.org/.well-known/genid/samples/jena///predicate//4f5f5734e1719911a6ea81b78b619b4b/d8234c3b1439a879aea940e9009663be#1

based near
range: Thing
domain: Thing
type: Property
type: ObjectProperty
comment: A location that something is based near, for some broadly human notion of near.
domain: SpatialThing
range: SpatialThing
term status: testing
domain: Resource
range: Resource

primary topic
domain: Thing
domain: Document
type: FunctionalProperty
range: Thing
type: Property
term status: stable
type: ObjectProperty
comment: The primary topic of some page or document.
inverse of: is primary topic of
domain: Resource
range: Resource

is primary topic of
range: Thing
comment: A document that this thing is the primary topic of.
domain: Thing
sub property of: page
type: InverseFunctionalProperty
range: Document
type: Property
term status: stable
inverse of: primary topic
type: ObjectProperty
domain: Resource
range: Resource

BitKeeper Repository
subclass of: http://lodlaundromat.org/.well-known/genid/samples/jena///predicate//4f5f5734e1719911a6ea81b78b619b4b/bf83860cd7dab8f53104c5f50b382094#2
subclass of: Resource
subclass of: Thing
comment: Dépôt BitKeeper du code source. @fr
label: BitKeeperのリポジトリ @ja
type: Class
comment: Úložiště zdrojových kódů BitKeeper. @cs
label: Dépôt BitKeeper @fr
comment: BitKeeper Quellcode-Versionierungssystem. @de
comment: Repositorio BitKeeper del código fuente. @es
comment: ソースコードのBitKeeperのリポジトリ @ja
label: Úložiště BitKeeper @cs
comment: BitKeeper source code repository.
subclass of: Repository
label: Repositorio BitKeeper @es

CVS Repository
subclass of: Resource
subclass of: Thing
subclass of: http://lodlaundromat.org/.well-known/genid/samples/jena///predicate//4f5f5734e1719911a6ea81b78b619b4b/bf83860cd7dab8f53104c5f50b382094#2
comment: Dépôt CVS du code source. @fr
comment: Úložiště zdrojových kódů CVS. @cs
label: Úložiště CVS @cs
comment: CVS Quellcode-Versionierungssystem. @de
comment: CVS source code repository.
subclass of: Repository
comment: ソースコードのCVSのリポジトリ @ja
label: Dépôt CVS @fr
label: CVSのリポジトリ @ja
comment: Repositorio CVS del código fuente. @es
label: Repositorio CVS @es
type: Class

accessed
range: Thing
domain: Thing
type: Property
type: ObjectProperty
comment: This property refers to the service that provided the Web representation during the execution of a data access.
domain: Data Access
range: Data Providing Service
sub property of: wasAssociatedWith
domain: Resource
range: Resource
domain: Activity
domain: http://lodlaundromat.org/.well-known/genid/samples/jena///predicate//4f5f5734e1719911a6ea81b78b619b4b/d3e700bc1857a8001f8ca87e5b965b3a#3
domain: http://lodlaundromat.org/.well-known/genid/samples/jena///predicate//4f5f5734e1719911a6ea81b78b619b4b/d3e700bc1857a8001f8ca87e5b965b3a#2
range: Agent
range: Non-Human Agent

image
range: Thing
domain: Thing
type: Property
type: ObjectProperty
comment: An image that can be used to represent some thing (ie. those depictions which are particularly representative of something, eg. one's photo on a homepage).
domain: Person
range: Image
sub property of: depiction
term status: testing
domain: Resource
range: Resource
range: Document
domain: SpatialThing
domain: Agent
domain: Human Agent

Project
subclass of: Resource
subclass of: Thing
type: Class
comment: A project (a collective endeavour of some kind).
disjoint with: Person
disjoint with: Document
term status: testing

Human Actor
subclass of: Resource
subclass of: Thing
type: Class
type: DeprecatedClass
comment: This class is deprecated and will be removed from the Provenance Vocabulary in the next revision. prv:HumanActor was renamed to prv:HumanAgent in the process of making the Provenance Vocabulary a specialization of W3C's PROV-O. Hence, use prv:HumanAgent instead.

Online Gaming Account
subclass of: Resource
subclass of: Thing
type: Class
comment: An online gaming account.
subclass of: Online Account
term status: unstable

Document
subclass of: Resource
subclass of: Thing
type: Class
comment: A document.
disjoint with: Organization
disjoint with: Project
term status: testing

Subversion Repository
subclass of: Resource
label: Dépôt Subversion @fr
comment: Subversion source code repository.
subclass of: Repository
label: Úložiště Subversion @cs
comment: Úložiště zdrojových kódů Subversion. @cs
type: Class
comment: Dépôt Subversion du code source. @fr
label: Subversionのリポジトリ @ja
comment: ソースコードのSubversionのリポジトリ @ja
label: Repositorio Subversion @es
comment: Subversion Quellcode-Versionierungssystem. @de
comment: Repositorio Subversion del código fuente. @es

tipjar
range: Thing
domain: Thing
type: Property
type: ObjectProperty
comment: A tipjar document for this agent, describing means for payment and reward.
domain: Agent
range: Document
sub property of: page
term status: testing
domain: Resource
range: Resource

publications
range: Thing
domain: Thing
type: Property
type: ObjectProperty
comment: A link to the publications of this person.
domain: Person
range: Document
term status: testing
domain: SpatialThing
domain: Agent
domain: Human Agent
domain: Resource
range: Resource

serialized by
range: Thing
domain: Thing
type: ObjectProperty
comment: This property refers to a file that serialized a data item.
domain: Data Item
range: File
type: Property
domain: Resource
domain: Entity
domain: InformationRealization
domain: http://lodlaundromat.org/.well-known/genid/samples/jena///predicate//4f5f5734e1719911a6ea81b78b619b4b/d3e700bc1857a8001f8ca87e5b965b3a#4
domain: http://lodlaundromat.org/.well-known/genid/samples/jena///predicate//4f5f5734e1719911a6ea81b78b619b4b/d3e700bc1857a8001f8ca87e5b965b3a#7
range: Entity
range: Resource
range: http://lodlaundromat.org/.well-known/genid/samples/jena///predicate//4f5f5734e1719911a6ea81b78b619b4b/d3e700bc1857a8001f8ca87e5b965b3a#4
range: http://lodlaundromat.org/.well-known/genid/samples/jena///predicate//4f5f5734e1719911a6ea81b78b619b4b/d3e700bc1857a8001f8ca87e5b965b3a#7

Ordered Collection
subclass of: Thing
subclass of: Resource
type: Class
definition: An ordered collection of concepts, where both the grouping and the ordering are meaningful.
scope note: Ordered collections can be used where you would like a set of concepts to be displayed in a specific order, and optionally under a 'node label'.
subclass of: Collection
subclass of: http://lodlaundromat.org/.well-known/genid/samples/jena///predicate//4f5f5734e1719911a6ea81b78b619b4b/d8234c3b1439a879aea940e9009663be#1
note: Ordered collections can be used where you would like a set of concepts to be displayed in a specific order, and optionally under a 'node label'.
note: An ordered collection of concepts, where both the grouping and the ordering are meaningful.

depiction
range: Thing
type: Property
type: ObjectProperty
comment: A depiction of some thing.
domain: Thing
range: Image
inverse of: depicts
term status: testing
domain: Resource
range: Document
range: Resource

Agent
subclass of: Thing
subclass of: Resource
subclass of: Agent
type: Class
comment: An agent (eg. person, group, software or physical artifact).
equivalent class: Agent
term status: stable

Collection
subclass of: Thing
subclass of: Resource
type: Class
subclass of: http://lodlaundromat.org/.well-known/genid/samples/jena///predicate//4f5f5734e1719911a6ea81b78b619b4b/d8234c3b1439a879aea940e9009663be#1
definition: A meaningful collection of concepts.
scope note: Labelled collections can be used where you would like a set of concepts to be displayed under a 'node label' in the hierarchy.
disjoint with: Concept
disjoint with: Concept Scheme
note: Labelled collections can be used where you would like a set of concepts to be displayed under a 'node label' in the hierarchy.
note: A meaningful collection of concepts.

Execution
subclass of: Resource
subclass of: Thing
type: Class
type: DeprecatedClass
comment: This class is deprecated and will be removed from the Provenance Vocabulary in the next revision. prv:Execution was deprecated in the process of making the Provenance Vocabulary a specialization of W3C's PROV-O. Hence, use prov:Activity instead.

performed by
range: Thing
domain: Thing
type: Property
type: ObjectProperty
comment: This property refers to an agent that/who performed an activity.
sub property of: wasAssociatedWith
domain: Resource
range: Resource

thumbnail
range: Thing
domain: Thing
type: Property
type: ObjectProperty
comment: A derived thumbnail image.
domain: Image
range: Image
term status: testing
domain: Document
domain: Resource
range: Document
range: Resource

revision
comment: Revision identifier of a software release.
comment: Indentificador de la versión de un release de software. @es
label: Version @de
comment: Identifikátor zpřístupněné revize softwaru. @cs
domain: Version
type: Property
label: リビジョンコート @ja
comment: Versionsidentifikator eines Software-Releases. @de
label: révision @fr
label: versión @es
comment: Identifiant de révision d'une release du programme. @fr
comment: このリリースのリビジョン識別子 @ja
range: Literal
label: verze @cs
domain: Resource
range: Resource

age
type: Property
type: FunctionalProperty
type: DatatypeProperty
comment: The age in years of some agent.
domain: Agent
range: Literal
term status: unstable
domain: Resource
domain: Thing
range: Resource

Surname
type: Property
type: DatatypeProperty
comment: The surname of some person.
domain: Person
range: Literal
term status: archaic
domain: SpatialThing
domain: Thing
domain: Agent
domain: Human Agent
domain: Resource
range: Resource

Description of a Project (DOAP) vocabulary
rights: Copyright © 2004-2009 Edd Dumbill
description: Slovník Description of a Project (DOAP, Popis projektu), popsaný použitím W3C RDF Schema a Web Ontology Language. @cs
type: Ontology
description: Das Vokabular "Description of a Project (DOAP)", beschrieben durch W3C RDF Schema and the Web Ontology Language. @de
description: Le vocabulaire Description Of A Project (DOAP, Description D'Un Projet), décrit en utilisant RDF Schema du W3C et OWL. @fr
format: application/rdf+xml
description: El vocabulario Description of a Project (DOAP, Descripción de un Proyecto), descrito usando RDF Schema de W3C y Web Ontology Language. @es
maker: Edd Dumbill
creator: Edd Dumbill
description: The Description of a Project (DOAP) vocabulary, described using W3C RDF Schema and the Web Ontology Language.
imports: index.rdf
description: プロジェクトの説明の語彙(DOAP)。W3C RDF SchemaとWeb Ontology Languageで作られた。 @ja
type: Thing

change note
definition: A note about a modification to a concept.
type: AnnotationProperty
sub property of: note
type: Property
note: A note about a modification to a concept.

note
definition: A general note, for any purpose.
scope note: This property may be used directly, or as a super-property for more specific note types.
type: AnnotationProperty
type: Property
note: This property may be used directly, or as a super-property for more specific note types.
note: A general note, for any purpose.

geekcode
type: Property
type: DatatypeProperty
comment: A textual geekcode for this person, see http://www.geekcode.com/geek.html
domain: Person
range: Literal
term status: archaic
domain: SpatialThing
domain: Thing
domain: Agent
domain: Human Agent
domain: Resource
range: Resource

documenter
comment: Proveedor de documentación para el proyecto. @es
type: Property
comment: Collaborateur à la documentation du projet. @fr
comment: このプロジェクトのドキュメントの貢献者 @ja
label: dokumentarista @cs
label: Dokumentator @de
range: Person
label: escritor de ayuda @es
domain: Project
comment: Spoluautor dokumentace projektu. @cs
label: 文章制作者 @ja
comment: Contributor of documentation to the project.
label: rédacteur de l'aide @fr
comment: Mitarbeiter an der Dokumentation eines Projektes. @de
domain: Resource
domain: Thing
range: Thing
range: Agent
range: Resource
range: Human Agent
range: SpatialThing

download mirror
label: zrcadlo stránky pro stažení @cs
label: miroir pour le téléchargement @fr
domain: Project
label: ダウンロードミラー @ja
comment: Mirror of software download web page.
comment: Spiegel der Seite von die Projekt-Software heruntergeladen werden kann. @de
type: Property
comment: Zrcadlo stránky pro stažení softwaru. @cs
comment: Miroir de la page de téléchargement du programme. @fr
comment: Mirror de la página web de descarga. @es
label: mirror de descarga @es
label: Spiegel der Seite zum Herunterladen @de
comment: このプロジェクトのダウンロードミラー @ja
domain: Resource
domain: Thing

SKOS Vocabulary
type: Ontology
contributor: Dave Beckett
contributor: Nikki Rogers
contributor: Participants in W3C's Semantic Web Deployment Working Group.
description: An RDF vocabulary for describing the basic structure and content of concept schemes such as thesauri, classification schemes, subject heading lists, taxonomies, 'folksonomies', other types of controlled vocabulary, and also concept schemes embedded in glossaries and terminologies.
creator: Alistair Miles
creator: Sean Bechhofer
maker: Alistair Miles
maker: Sean Bechhofer
type: Thing

Vocabulary of Interlinked Datasets (VoID)
created: 2010-01-26
preferred namespace uri: http://rdfs.org/ns/void#
preferred namespace prefix: void
type: SemanticAsset
part of: vocab.deri.ie
type: Ontology
creator: Michael Hausenblas
creator: Jun Zhao
description: The Vocabulary of Interlinked Datasets (VoID) is an RDF Schema vocabulary for expressing metadata about RDF datasets. It is intended as a bridge between the publishers and users of RDF data, with applications ranging from data discovery to cataloging and archiving of datasets. This document provides a formal definition of the new RDF classes and properties introduced for VoID. It is a companion to the main specification document for VoID, Describing Linked Datasets with the VoID Vocabulary.
status: UnderDevelopment
publisher: Digital Enterprise Research Institute, NUI Galway
creator: Keith Alexander
creator: Richard Cyganiak
modified: 2011-03-06
type: Thing

helper
type: Property
range: Person
comment: Spoluautor projektu. @cs
label: 貢献者 @ja
comment: Projekt-Mitarbeiter. @de
comment: Collaborateur au projet. @fr
comment: このプロジェクトの貢献者 @ja
label: collaborateur @fr
domain: Project
label: colaborador @es
comment: Project contributor.
label: Helfer @de
label: spoluautor @cs
comment: Colaborador del proyecto. @es
domain: Resource
domain: Thing
range: Thing
range: Agent
range: Resource
range: Human Agent
range: SpatialThing

screenshots
comment: スクリーンショットのあるウェブページ @ja
domain: Project
label: スクリーンショット @ja
label: snímek obrazovky @cs
comment: Web page with screenshots of project.
type: Property
comment: Página web con capturas de pantalla del proyecto. @es
comment: Page web avec des captures d'écran du projet. @fr
label: Screenshots @de
comment: Webová stránka projektu se snímky obrazovky. @cs
comment: Web-Seite mit Screenshots eines Projektes. @de
label: captures d'écran @fr
label: capturas de pantalla @es
domain: Resource
domain: Thing

browse
comment: Webové rozhraní pro prohlížení úložiště. @cs
comment: Web browser interface to repository.
comment: Interface web au dépôt. @fr
label: ウェブのユーザインタフェース @ja
comment: Interface web del repositorio. @es
label: navegar @es
comment: Web-Browser Interface für das Repository. @de
label: visualiser @fr
type: Property
domain: Repository
label: prohlížeč @cs
comment: このリポジトリのウェブのウェブのユーザインタフェース @ja
domain: Resource

language
type: Property
label: 言語 @ja
comment: ISO language code a project has been translated into
comment: このプロジェクトの翻訳された言語のISO言語コート
domain: Project
range: Literal
domain: Resource
domain: Thing
range: Resource

wiki
comment: L'URL du Wiki pour la discussion collaborative sur le projet. @fr
comment: このプロジェクトの討論用ウィキ @ja
label: ウィキ @ja
label: Wiki @de
comment: URL of Wiki for collaborative discussion of project.
comment: Wiki-URL für die kollaborative Dikussion eines Projektes. @de
comment: URL adresa wiki projektu pro společné diskuse. @cs
type: Property
domain: Project
comment: URL del Wiki para discusión colaborativa del proyecto. @es
domain: Resource
domain: Thing

Target
type: Property
comment: One of the two datasets linked by the Linkset.
domain: linkset
range: dataset
domain: Thing
domain: dataset
domain: Resource
range: Thing
range: Resource

example
definition: An example of the use of a concept.
type: AnnotationProperty
sub property of: note
type: Property
note: An example of the use of a concept.

number of properties
type: Property
type: DatatypeProperty
comment: The total number of distinct properties in a void:Dataset. In other words, the number of distinct resources that occur in the predicate position of triples in the dataset.
domain: dataset
range: integer
domain: Resource
domain: Thing
range: Resource
range: decimal

MSN chat ID
sub property of: nickname
type: InverseFunctionalProperty
comment: An MSN chat ID
domain: Agent
type: DatatypeProperty
term status: testing
type: Property
range: Literal
type: ObjectProperty
domain: Resource
domain: Thing
range: Resource

Yahoo chat ID
domain: Agent
term status: testing
range: Literal
comment: A Yahoo chat ID
type: DatatypeProperty
sub property of: nickname
type: Property
type: InverseFunctionalProperty
type: ObjectProperty
domain: Resource
domain: Thing
range: Resource

translator
label: traductor @es
range: Person
label: 翻訳者 @ja
type: Property
comment: Proveedor de traducciones al proyecto. @es
comment: Mitarbeiter an den Übersetzungen eines Projektes. @de
domain: Project
label: Übersetzer @de
comment: Contributor of translations to the project.
comment: Collaborateur à la traduction du projet. @fr
label: traducteur @fr
comment: Spoluautor překladu projektu. @cs
comment: このプロジェクトを翻訳する貢献者 @ja
label: překladatel @cs
domain: Resource
domain: Thing
range: Thing
range: Agent
range: Resource
range: Human Agent
range: SpatialThing

name
label: nombre @es
type: Property
comment: A name of something.
label: nom @fr
label: Name @de
sub property of: label
range: Literal
comment: El nombre de algo. @es
comment: Der Name von Irgendwas @de
comment: Jméno něčeho. @cs
comment: 何かの名前 @ja
label: 名前 @ja
label: jméno @cs
comment: Le nom de quelque chose. @fr
range: Resource

Given name
type: Property
type: DatatypeProperty
comment: The given name of some person.
term status: testing

class
type: Property
type: FunctionalProperty
comment: The rdfs:Class that is the rdf:type of all entities in a class-based partition.
domain: dataset
range: Class
domain: Resource
domain: Thing
range: Resource

funded by
type: Property
type: ObjectProperty
comment: An organization funding a project or person.
domain: Thing
range: Thing
term status: archaic
domain: Resource
range: Resource

account name
type: Property
type: DatatypeProperty
comment: Indicates the name (identifier) associated with this online account.
domain: Online Account
range: Literal
term status: testing
domain: Resource
domain: Thing
range: Resource

number of triples
type: Property
type: DatatypeProperty
comment: The total number of triples contained in a void:Dataset.
domain: dataset
range: integer
domain: Resource
domain: Thing
range: Resource
range: decimal

Edd Dumbill
type: Person
type: Human Agent
type: SpatialThing
type: Agent
type: Thing
made: Description of a Project (DOAP) vocabulary
different from: http://lodlaundromat.org/.well-known/genid/4f5f5734e1719911a6ea81b78b619b4b#10
different from: jita
different from: http://lodlaundromat.org/.well-known/genid/4f5f5734e1719911a6ea81b78b619b4b#2

property partition
type: Property
comment: A subset of a void:Dataset that contains only the triples of a certain rdf:Property.
domain: dataset
range: dataset
sub property of: has subset
domain: Resource
domain: Thing
range: Resource
range: Thing

Provenance Vocabulary Core Ontology namespace
type: Ontology
description: The Provenance Vocabulary provides classes and properties for describing provenance of Web data. The vocabulary focuses on two main use cases: 1.) It enables consumers of Web data to describe provenance of data retrieved from the Web and of data derived from such Web data. 2.) It enables providers of Web data to publish provenance-related metadata about their data. Notice, the vocabulary is not intended for describing provenance of other kinds of Web content. The Provenance Vocabulary is designed as a Web data specific specialization of the W3C PROV Ontology (PROV-O); classes and properties provided by the vocabulary are domain specific extensions of the more general concepts introduced in PROV-O. As a consequence, any Provenance Vocabulary based description of provenance can be easily interpreted and exchanged according to the W3C PROV family of standards.
created: 2009-08-25T12:00:00Z
modified: 2012-03-14T12:00:00Z
creator: Jun Zhao
creator: Olaf Hartig
maker: Jun Zhao
maker: Olaf Hartig
type: Thing

scope note
definition: A note that helps to clarify the meaning and/or the use of a concept.
type: AnnotationProperty
sub property of: note
type: Property
note: A note that helps to clarify the meaning and/or the use of a concept.

preferred label
definition: The preferred lexical label for a resource, in a given language.
type: AnnotationProperty
sub property of: label
comment: A resource has no more than one value of skos:prefLabel per language tag, and no more than one value of skos:prefLabel without language tag.
comment: The range of skos:prefLabel is the class of RDF plain literals.
comment: skos:prefLabel, skos:altLabel and skos:hiddenLabel are pairwise disjoint properties.
type: Property
note: The preferred lexical label for a resource, in a given language.

status
type: Property
type: DatatypeProperty
comment: A string expressing what the user is happy for the general public (normally) to know about their current activity.
domain: Agent
range: Literal
term status: unstable
domain: Resource
domain: Thing
range: Resource

DNA checksum
type: Property
type: DatatypeProperty
comment: A checksum for the DNA of some thing. Joke.
range: Literal
term status: archaic
range: Resource

category
label: 分類 @ja
comment: Eine Kategorie eines Projektes. @de
comment: Kategorie projektu. @cs
comment: このプロジェクトの分類。 @ja
comment: A category of project.
label: categoría @es
domain: Project
label: kategorie @cs
comment: Una categoría de proyecto. @es
label: Kategorie @de
type: Property
comment: Une catégorie de projet. @fr
label: catégorie @fr
domain: Resource
domain: Thing

created
comment: Erstellungsdatum von Irgendwas, angegeben im YYYY-MM-DD Format, z.B. 2004-04-05. @de
label: erstellt @de
label: vytvořeno @cs
comment: Datum, kdy bylo něco vytvořeno ve formátu RRRR-MM-DD, např. 2004-04-05 @cs
comment: Fecha en la que algo fue creado, en formato AAAA-MM-DD. e.g. 2004-04-05 @es
label: 作成日付 @ja
range: Literal
type: Property
label: creado @es
comment: 何かが作成された日付、AAAA-MM-JJの型、例えば2004-04-05。 @ja
label: créé @fr
comment: Date when something was created, in YYYY-MM-DD form. e.g. 2004-04-05
comment: Date à laquelle a été créé quelque chose, au format AAAA-MM-JJ (par ex. 2004-04-05) @fr
range: Resource

number of documents
type: Property
type: DatatypeProperty
comment: The total number of documents, for datasets that are published as a set of individual documents, such as RDF/XML documents or RDFa-annotated web pages. Non-RDF documents, such as web pages in HTML or images, are usually not included in this count. This property is intended for datasets where the total number of triples or entities is hard to determine. void:triples or void:entities should be preferred where practical.
domain: dataset
range: integer
domain: Resource
domain: Thing
range: Resource
range: decimal

sha1sum (hex)
type: Property
type: DatatypeProperty
comment: A sha1sum hash, in hex.
domain: Document
term status: unstable
domain: Resource
domain: Thing

open search description
type: Property
comment: An OpenSearch description document for a free-text search service over a void:Dataset.
domain: dataset
range: Document
domain: Resource
domain: Thing
range: Resource
range: Thing

vocabulary
type: Property
comment: A vocabulary that is used in the dataset.
domain: dataset
domain: Resource
domain: Thing

developer
comment: プロジェクトのソフトウェアの開発者 @ja
label: Entwickler @de
comment: Vývojář softwaru projektu. @cs
comment: Desarrollador de software para el proyecto. @es
comment: Développeur pour le projet. @fr
label: vývojář @cs
type: Property
comment: Developer of software for the project.
label: développeur @fr
domain: Project
label: 開発者 @ja
range: Person
comment: Software-Entwickler für eine Projekt. @de
label: desarrollador @es
domain: Resource
domain: Thing
range: Thing
range: Agent
range: Resource
range: Human Agent
range: SpatialThing

myersBriggs
type: Property
type: DatatypeProperty
comment: A Myers Briggs (MBTI) personality classification.
domain: Person
range: Literal
term status: testing
domain: SpatialThing
domain: Thing
domain: Agent
domain: Human Agent
domain: Resource
range: Resource

example resource of dataset
type: Property
domain: dataset
range: Resource
domain: Resource
domain: Thing

logo
type: Property
type: ObjectProperty
type: InverseFunctionalProperty
comment: A logo representing some thing.
domain: Thing
range: Thing
term status: testing
domain: Resource
range: Resource

RDF description of O
primary topic: 3.[Objects, Pragmatics and Technicalities]: specific level
type: Thing
type: Document
topic: 3.[Objects, Pragmatics and Technicalities]: specific level
different from: http://lodlaundromat.org/.well-known/genid/4f5f5734e1719911a6ea81b78b619b4b#2

has an URI look-up endpoint at
type: Property
comment: Defines a simple URI look-up protocol for accessing a dataset.
domain: dataset
domain: Resource
domain: Thing

vendor
type: Property
label: 提供組織 @ja
comment: Vendor organization: commercial, free or otherwise
comment: 提供組織、商業の組織や自由の組織。 @ja
domain: Project
range: Organization
domain: Resource
domain: Thing
range: Agent
range: Resource
range: Thing
range: Human Agent

number of entities
type: Property
type: DatatypeProperty
comment: The total number of entities that are described in a void:Dataset.
domain: dataset
range: integer
domain: Resource
domain: Thing
range: Resource
range: decimal

repository
comment: Repositorio del código fuente. @es
type: Property
label: repositorio @es
comment: Source code repository.
comment: Úložiště zdrojových kódů. @cs
label: dépôt @fr
range: Repository
label: Repository @de
label: リポジトリ @ja
comment: このプロジェクトのソースコードのリポジトリ @ja
label: úložiště @cs
domain: Project
comment: Dépôt du code source. @fr
comment: Quellcode-Versionierungssystem. @de
domain: Resource
domain: Thing
range: Resource

alternative label
definition: An alternative lexical label for a resource.
example: Acronyms, abbreviations, spelling variants, and irregular plural/singular forms may be included among the alternative labels for a concept. Mis-spelled terms are normally included as hidden labels (see skos:hiddenLabel).
type: AnnotationProperty
sub property of: label
comment: The range of skos:altLabel is the class of RDF plain literals.
comment: skos:prefLabel, skos:altLabel and skos:hiddenLabel are pairwise disjoint properties.
type: Property
note: Acronyms, abbreviations, spelling variants, and irregular plural/singular forms may be included among the alternative labels for a concept. Mis-spelled terms are normally included as hidden labels (see skos:hiddenLabel).
note: An alternative lexical label for a resource.

name
type: Property
type: DatatypeProperty
comment: A name for some thing.
domain: Thing
range: Literal
sub property of: label
term status: testing
domain: Resource
range: Resource

ICQ chat ID
sub property of: nickname
term status: testing
domain: Agent
range: Literal
comment: An ICQ chat ID
type: InverseFunctionalProperty
type: Property
type: DatatypeProperty
type: ObjectProperty
domain: Resource
domain: Thing
range: Resource

hidden label
definition: A lexical label for a resource that should be hidden when generating visual displays of the resource, but should still be accessible to free text search operations.
type: AnnotationProperty
sub property of: label
comment: The range of skos:hiddenLabel is the class of RDF plain literals.
comment: skos:prefLabel, skos:altLabel and skos:hiddenLabel are pairwise disjoint properties.
type: Property
note: A lexical label for a resource that should be hidden when generating visual displays of the resource, but should still be accessible to free text search operations.

family_name
type: Property
type: DatatypeProperty
comment: The family name of some person.
domain: Person
range: Literal
term status: archaic
domain: SpatialThing
domain: Thing
domain: Agent
domain: Human Agent
domain: Resource
range: Resource

mailing list
label: lista de correo @es
label: メーリングリスト @ja
type: Property
comment: メーリングリストのホームページやメールアドレス @ja
label: liste de diffusion @fr
comment: Domovská stránka nebo e–mailová adresa e–mailové diskuse. @cs
comment: Page web de la liste de diffusion, ou adresse de courriel. @fr
comment: Homepage der Mailing Liste oder E-Mail Adresse. @de
comment: Mailing list home page or email address.
label: Mailing Liste @de
label: e–mailová diskuse @cs
comment: Página web de la lista de correo o dirección de correo. @es
domain: Project
domain: Resource
domain: Thing

in dataset
type: Property
comment: Points to the void:Dataset that a document is a part of.
domain: Document
range: dataset
domain: Resource
domain: Thing
range: Thing
range: Resource

http://lodlaundromat.org/.well-known/genid/4f5f5734e1719911a6ea81b78b619b4b#5
executed at: 2015-02-20T08:17:14.456Z
performed by: http://lodlaundromat.org/.well-known/genid/4f5f5734e1719911a6ea81b78b619b4b#10
used: http://lodlaundromat.org/.well-known/genid/4f5f5734e1719911a6ea81b78b619b4b#6
type: Data Creation
type: Thing
was associated with: http://lodlaundromat.org/.well-known/genid/4f5f5734e1719911a6ea81b78b619b4b#10
type: Activity
different from: http://lodlaundromat.org/.well-known/genid/4f5f5734e1719911a6ea81b78b619b4b#9

feature
type: Property
domain: dataset
range: technical feature
domain: Resource
domain: Thing
range: Thing
range: Resource

Subjects Target
type: Property
type: FunctionalProperty
comment: The dataset describing the subjects of triples contained in the Linkset.
domain: linkset
range: dataset
sub property of: Target
domain: Resource
domain: Thing
domain: dataset
range: Resource
range: Thing

blog
type: Property
label: ブログ @ja
comment: URI of a blog related to a project
comment: このプロジェクトに関するブログのURI @ja
domain: Project
range: Resource
domain: Resource
domain: Thing

root resource
type: Property
comment: A top concept or entry point for a void:Dataset that is structured in a tree-like fashion. All resources in a dataset can be reached by following links from its root resources in a small number of steps.
domain: dataset
domain: Resource
domain: Thing

lastName
type: Property
type: DatatypeProperty
comment: The last name of a person.
domain: Person
range: Literal
term status: testing
domain: SpatialThing
domain: Thing
domain: Agent
domain: Human Agent
domain: Resource
range: Resource

property
type: Property
type: FunctionalProperty
comment: The rdf:Property that is the predicate of all triples in a property-based partition.
domain: dataset
range: Property
domain: Resource
domain: Thing
range: Resource

a link predicate
type: Property
domain: linkset
range: Property
domain: Thing
domain: dataset
domain: Resource
range: Resource

gender
type: Property
type: FunctionalProperty
type: DatatypeProperty
comment: The gender of this Agent (typically but not necessarily 'male' or 'female').
domain: Agent
range: Literal
term status: testing
domain: Resource
domain: Thing
range: Resource

theme
type: Property
type: ObjectProperty
comment: A theme.
domain: Thing
range: Thing
term status: archaic
domain: Resource
range: Resource

Talis
type: Agent
member: Keith Alexander
type: Group
type: Thing
type: Human Agent
different from: http://lodlaundromat.org/.well-known/genid/4f5f5734e1719911a6ea81b78b619b4b#10
different from: jita

Data Dump
type: Property
comment: An RDF dump, partial or complete, of a void:Dataset.
domain: dataset
range: Resource
domain: Resource
domain: Thing

Digital Enterprise Research Institute, NUI Galway
type: Agent
member: Richard Cyganiak
type: Group
type: Thing
type: Human Agent
different from: http://lodlaundromat.org/.well-known/genid/4f5f5734e1719911a6ea81b78b619b4b#10
different from: jita

distinct objects
type: Property
type: DatatypeProperty
comment: The total number of distinct objects in a void:Dataset. In other words, the number of distinct resources that occur in the object position of triples in the dataset. Literals are included in this count.
domain: dataset
range: integer
domain: Resource
domain: Thing
range: Resource
range: decimal

DESCRIBE <http://aims.fao.org/aos/jita/O>
type: SPARQLQuery
type: Describe
type: Thing
type: Data Item
type: Plan
type: Creation Guideline
type: Entity
type: InformationRealization
type: http://lodlaundromat.org/.well-known/genid/samples/jena///predicate//4f5f5734e1719911a6ea81b78b619b4b/d3e700bc1857a8001f8ca87e5b965b3a#4
type: http://lodlaundromat.org/.well-known/genid/samples/jena///predicate//4f5f5734e1719911a6ea81b78b619b4b/d3e700bc1857a8001f8ca87e5b965b3a#7

jabber ID
type: Property
type: DatatypeProperty
type: InverseFunctionalProperty
comment: A jabber ID for something.
domain: Agent
range: Literal
term status: testing
type: ObjectProperty
domain: Resource
domain: Thing
range: Resource

operating system
label: operační systém @cs
comment: Système d'exploitation auquel est limité le projet. Omettez cette propriété si le projet n'est pas limité à un système d'exploitation. @fr
type: Property
comment: Sistema opertivo al cuál está limitado el proyecto. Omita esta propiedad si el proyecto no es específico de un sistema opertaivo en particular. @es
label: système d'exploitation @fr
comment: Betriebssystem auf dem das Projekt eingesetzt werden kann. Diese Eigenschaft kann ausgelassen werden, wenn das Projekt nicht BS-spezifisch ist. @de
range: Literal
label: Betriebssystem @de
comment: このプロジェクトの限られたオペレーティングシステム。もし、プロジェクトはどのOSも大丈夫なら、このプロパティを書き落としていい。 @ja
label: sistema operativo @es
comment: Operační systém, na jehož použití je projekt limitován. Vynechejte tuto vlastnost, pokud je projekt nezávislý na operačním systému. @cs
domain: Project
comment: Operating system that a project is limited to. Omit this property if the project is not OS-specific.
label: オペレーティングシステム @ja
domain: Version
domain: Resource
domain: Thing
range: Resource

AIM chat ID
type: Property
type: DatatypeProperty
domain: Agent
comment: An AIM chat ID
type: InverseFunctionalProperty
term status: testing
range: Literal
sub property of: nickname
type: ObjectProperty
domain: Resource
domain: Thing
range: Resource

has URI regular expression pattern
type: Property
comment: Defines a regular expression pattern matching URIs in the dataset.
domain: dataset
domain: Resource
domain: Thing

Olaf Hartig
type: Person
type: Human Agent
type: SpatialThing
type: Agent
type: Thing
made: Provenance Vocabulary Core Ontology namespace
different from: http://lodlaundromat.org/.well-known/genid/4f5f5734e1719911a6ea81b78b619b4b#10
different from: jita
different from: http://lodlaundromat.org/.well-known/genid/4f5f5734e1719911a6ea81b78b619b4b#2

license
comment: L'URI d'une description RDF de la licence sous laquelle le programme est distribué. @fr
type: Property
comment: El URI de una descripción RDF de la licencia bajo la cuál se distribuye el software. @es
comment: Die URI einer RDF-Beschreibung einer Lizenz unter der die Software herausgegeben wird. @de
label: Lizenz @de
comment: URI adresa RDF popisu licence, pod kterou je software distribuován. @cs
comment: このプロジェクトの散布ライセンスのRDF説明のURI @ja
label: licence @fr
label: licencia @es
comment: The URI of an RDF description of the license the software is distributed under.
label: ライセンス @ja

Implements specification
type: Property
label: 実装した明細書 @ja
comment: A specification that a project implements. Could be a standard, API or legally defined level of conformance.
comment: このプロジェクトが実装したシステムの明細書。標準やAPIや明細書のようなもの。 @ja
domain: Project
range: Specification
domain: Resource
domain: Thing
range: Resource

distinct subjects
type: Property
type: DatatypeProperty
comment: The total number of distinct subjects in a void:Dataset. In other words, the number of distinct resources that occur in the subject position of triples in the dataset.
domain: dataset
range: integer
domain: Resource
domain: Thing
range: Resource
range: decimal

Keith Alexander
type: Person
type: Human Agent
type: SpatialThing
type: Agent
type: Thing
different from: http://lodlaundromat.org/.well-known/genid/4f5f5734e1719911a6ea81b78b619b4b#10
different from: jita
different from: http://lodlaundromat.org/.well-known/genid/4f5f5734e1719911a6ea81b78b619b4b#2

short description
label: Kurzbeschreibung @de
comment: Descripción corta (8 o 9 palabras) en texto plano de un proyecto. @es
comment: Short (8 or 9 words) plain text description of a project.
type: Property
label: description courte @fr
label: 簡単な説明 @ja
range: Literal
comment: Krátký (8 nebo 9 slov) čistě textový popis projektu. @cs
comment: 日本語の二十文字ぐらいの説明 @ja
label: descripción corta @es
comment: Kurzbeschreibung (8 oder 9 Wörter) eines Projects als einfacher Text. @de
comment: Texte descriptif concis (8 ou 9 mots) d'un projet. @fr
label: krátký popis @cs
range: Resource

Department of Zoology, University of Oxford
type: Agent
member: Jun Zhao
type: Group
type: Thing
type: Human Agent
different from: http://lodlaundromat.org/.well-known/genid/4f5f5734e1719911a6ea81b78b619b4b#10
different from: jita

plan
type: Property
type: DatatypeProperty
comment: Aplan comment, in the tradition of finger and '.plan' files.
domain: Person
range: Literal
term status: testing
domain: SpatialThing
domain: Thing
domain: Agent
domain: Human Agent
domain: Resource
range: Resource

has subset
type: Property
domain: dataset
range: dataset
domain: Resource
domain: Thing
range: Thing
range: Resource

http://lodlaundromat.org/.well-known/genid/4f5f5734e1719911a6ea81b78b619b4b#3
revision: 0.4
type: Version
type: Thing

Michael Hausenblas
type: Person
type: Human Agent
type: SpatialThing
type: Agent
type: Thing
different from: http://lodlaundromat.org/.well-known/genid/4f5f5734e1719911a6ea81b78b619b4b#10
different from: jita
different from: http://lodlaundromat.org/.well-known/genid/4f5f5734e1719911a6ea81b78b619b4b#2

Document that defines the core ontology of the Provenance Vocabulary
type: Document
alternate: ns.rdf
primary topic: Provenance Vocabulary Core Ontology namespace
description: This documents specifies the Provenance Vocabulary Core Ontology which defines the main classes and properties provided by the Provenance Vocabulary.
assurance: Detached signature
title: Provenance Vocabulary Core Ontology Specification
license: http://creativecommons.org/licenses/by/1.0/
conforms to: rdfa-syntax
type: Thing
topic: Provenance Vocabulary Core Ontology namespace
different from: http://lodlaundromat.org/.well-known/genid/4f5f5734e1719911a6ea81b78b619b4b#2

membershipClass
type: Property
type: AnnotationProperty
comment: Indicates the class of individuals that are a member of a Group
term status: unstable

description
comment: Čistě textový, 2 až 4 věty dlouhý popis projektu. @cs
label: descripción @es
comment: Texte descriptif d'un projet, long de 2 à 4 phrases. @fr
comment: プロジェクトの文の説明、2から4までの行数。 @ja
comment: Descripción en texto plano de un proyecto, de 2 a 4 enunciados de longitud. @es
label: popis @cs
range: Literal
type: Property
comment: Beschreibung eines Projekts als einfacher Text mit der Länge von 2 bis 4 Sätzen. @de
comment: Plain text description of a project, of 2-4 sentences in length.
label: Beschreibung @de
label: 説明 @ja
range: Resource

programming language
comment: Programming language a project is implemented in or intended for use with.
range: Literal
comment: Lenguaje de programación en el que un proyecto es implementado o con el cuál pretende usarse. @es
comment: Programmiersprache in der ein Projekt implementiert ist oder intendiert wird zu benutzen. @de
comment: Langage de programmation avec lequel un projet est implémenté, ou avec lequel il est prévu de l'utiliser. @fr
comment: このプログラミングの実装のプログラミング言語、または目指した言語。 @ja
label: programovací jazyk @cs
comment: Programovací jazyk, ve kterém je projekt implementován nebo pro který je zamýšlen k použití. @cs
label: langage de programmation @fr
label: プログラミング言語 @ja
type: Property
label: lenguaje de programación @es
label: Programmiersprache @de
domain: Project
domain: Resource
domain: Thing
range: Resource

title
type: Property
type: DatatypeProperty
comment: Title (Mr, Mrs, Ms, Dr. etc)
term status: testing

release
comment: Une release (révision) d'un projet. @fr
comment: Un release (versión) de un proyecto. @es
comment: A project release.
label: Release @de
comment: Relase (verze) projektu. @cs
comment: Ein Release (Version) eines Projekts. @de
comment: このプロジェクトのリリース @ja
range: Version
type: Property
domain: Project
label: リリース @ja
domain: Resource
domain: Thing
range: Resource

repository location
comment: このリポジトリの場所。 @ja
label: umístění úložiště @cs
comment: Lokation eines Repositorys. @de
label: lugar del respositorio @es
type: Property
comment: Location of a repository.
domain: Repository
label: emplacement du dépôt @fr
comment: lugar de un repositorio. @es
label: Repository Lokation @de
comment: Emplacement d'un dépôt. @fr
label: このリポジトリのURL @ja
comment: Umístění úložiště. @cs
domain: Resource

definition
definition: A statement or formal explanation of the meaning of a concept.
type: AnnotationProperty
sub property of: note
type: Property
note: A statement or formal explanation of the meaning of a concept.

birthday
type: Property
type: FunctionalProperty
type: DatatypeProperty
comment: The birthday of this Agent, represented in mm-dd string form, eg. '12-31'.
domain: Agent
range: Literal
term status: unstable
domain: Resource
domain: Thing
range: Resource

sha1sum of a personal mailbox URI name
type: Property
type: InverseFunctionalProperty
type: DatatypeProperty
comment: The sha1sum of the URI of an Internet mailbox associated with exactly one owner, the first owner of the mailbox.
domain: Agent
range: Literal
term status: testing
type: ObjectProperty
domain: Resource
domain: Thing
range: Resource

Detached signature
type: Endorsement
endorser: pubkey2011
type: Thing

history note
definition: A note about the past state/use/meaning of a concept.
type: AnnotationProperty
sub property of: note
type: Property
note: A note about the past state/use/meaning of a concept.

file-release
type: Property
label: soubor revize @cs
label: ファイル @ja
comment: URI of download associated with this release.
comment: URI adresa stažení asociované s revizí. @cs
label: このリリースのダウンロードできるファイルのURI @ja
domain: Version
domain: Resource

service endpoint
type: Property
label: サービスサイト @ja
comment: The URI of a web service endpoint where software as a service may be accessed
comment: ことプロジェクトが提供したサーブスを載せるサイト。 @ja
domain: Project
range: Resource
domain: Resource
domain: Thing

URI space
type: Property
type: DatatypeProperty
comment: A URI that is a common string prefix of all the entity URIs in a void:Dataset.
domain: dataset
range: Literal
domain: Resource
domain: Thing
range: Resource

nickname
type: Property
type: DatatypeProperty
comment: A short informal nickname characterising an agent (includes login identifiers, IRC and other chat nicknames).
term status: testing

notation
definition: A notation, also known as classification code, is a string of characters such as "T58.5" or "303.4833" used to uniquely identify a concept within the scope of a given concept scheme.
scope note: By convention, skos:notation is used with a typed literal in the object position of the triple.
type: DatatypeProperty
type: Property
note: By convention, skos:notation is used with a typed literal in the object position of the triple.
note: A notation, also known as classification code, is a string of characters such as "T58.5" or "303.4833" used to uniquely identify a concept within the scope of a given concept scheme.

has a SPARQL endpoint at
type: Property
domain: dataset
domain: Resource
domain: Thing

Objects Target
type: Property
type: FunctionalProperty
comment: The dataset describing the objects of the triples contained in the Linkset.
domain: linkset
range: dataset
sub property of: Target
domain: Resource
domain: Thing
domain: dataset
range: Resource
range: Thing

Skype ID
type: Property
type: DatatypeProperty
comment: A Skype ID
domain: Agent
range: Literal
sub property of: nickname
term status: testing
domain: Resource
domain: Thing
range: Resource

3.[Objects, Pragmatics and Technicalities]: specific level
preferred label: 3.[Obiecte, Aspecte pragmatice și tehnice]: nivel specific @ro
preferred label: 3.[Objecten, pragmatiek en formaliteiten]: specifiek niveau @nl
type: Concept
preferred label: 3.[Objetos, Aspetos pragmáticos e aspetos técnicos]: nível específico @pt
preferred label: 3.[Предмет, прагматика и организационные вопросы]: специфический уровень @ru
narrower: SO
preferred label: 3.[Objetos, prácticas y aspectos técnicos]: nivel específico @es
preferred label: 3.[Oggetti, questioni pragmatiche e tecniche]: livello specifico @it
preferred label: 3.[Objekty, Praktické otázky a techniky]: specifická úroveň @cs
narrower: IT
preferred label: 3.[Objekt, Pragmatik och Teknikaliteter]: specifik nivå @sv
narrower: HO
preferred label: 3.[Obiekty, Pragmatyka i aspekty techniczne]: poziom szczegółowy @pl
preferred label: 3.[Nesneler, Pragmatik ve Teknik ayrıntılar]: özel düzey @tr
preferred label: 3.[Πραγματογνωσία, πραγματολογία και τεχνικές λεπτομέρειες]: ειδικό επίπεδο @el
preferred label: 3.[Objets, questions pratiques et techniques]: niveau spécifique @fr
preferred label: 3. [ الكائنات ، البراجماتية والجوانب الفنية] : مستوى معين @ar
preferred label: 3.[Aspectes tècnics, pràctics i suports]: nivell específic @ca
narrower: SE
is in scheme: jita
narrower: TR
type: Thing
type: http://lodlaundromat.org/.well-known/genid/samples/jena///predicate//4f5f5734e1719911a6ea81b78b619b4b/d8234c3b1439a879aea940e9009663be#1
has narrower transitive: TR
has narrower transitive: SE
has narrower transitive: HO
has narrower transitive: IT
has narrower transitive: SO
is in semantic relation with: TR
is in semantic relation with: SE
is in semantic relation with: HO
is in semantic relation with: IT
is in semantic relation with: SO
different from: jita

bug database
label: databáze chyb @cs
label: suivi des bugs @fr
label: Fehlerdatenbank @de
label: バグページ @ja
comment: Suivi des bugs pour un projet. @fr
comment: Bug tracker for a project.
comment: Fehlerdatenbank eines Projektes. @de
comment: Bug tracker para un proyecto. @es
comment: このプロジェクのバグ管理ページ @ja
type: Property
domain: Project
label: base de datos de bugs @es
comment: Správa chyb projektu. @cs
domain: Resource
domain: Thing

download page
label: stránka pro stažení @cs
comment: Web-Seite von der die Projekt-Software heruntergeladen werden kann. @de
label: ダウンロードページ @ja
label: page de téléchargement @fr
label: Seite zum Herunterladen @de
comment: Webová stránka, na které lze stáhnout projektový software. @cs
comment: Web page from which the project software can be downloaded.
domain: Project
comment: Page web à partir de laquelle on peut télécharger le programme. @fr
comment: このプロジェクトのダウンロードできるウェブページ @ja
type: Property
comment: Página web de la cuál se puede bajar el software. @es
label: página de descarga @es
domain: Resource
domain: Thing

LiDRC
type: Agent
member: Michael Hausenblas
type: Group
type: Thing
type: Human Agent
different from: http://lodlaundromat.org/.well-known/genid/4f5f5734e1719911a6ea81b78b619b4b#10
different from: jita

class partition
type: Property
comment: A subset of a void:Dataset that contains only the entities of a certain rdfs:Class.
domain: dataset
range: dataset
sub property of: has subset
domain: Resource
domain: Thing
range: Resource
range: Thing

anonymous root
comment: Repository für anonymen Zugriff @de
label: raíz anónima @es
label: anonymní kořen @cs
comment: Repositorio para acceso anónimo. @es
comment: Úložiště pro anonymní přístup. @cs
comment: Dépôt pour accès anonyme. @fr
range: Literal
domain: Repository
type: Property
label: 匿名ルート @ja
label: racine anonyme @fr
label: Anonymes Root @de
comment: 匿名でアクセスできるパス @ja
comment: Repository for anonymous access.
domain: Resource
range: Resource

tester
label: testeur @fr
comment: このプロジェクトのため、試験をする人や品質メンテナー。
label: Tester @de
range: Person
domain: Project
label: 試験者 @ja
comment: Tester nebo jiný spoluautor kontrolující kvalitu. @cs
comment: Un testeur ou un collaborateur au contrôle qualité. @fr
comment: Ein Tester oder anderer Mitarbeiter der Qualitätskontrolle. @de
comment: A tester or other quality control contributor.
type: Property
comment: Un tester u otro proveedor de control de calidad. @es
domain: Resource
domain: Thing
range: Thing
range: Agent
range: Resource
range: Human Agent
range: SpatialThing

module
type: Property
comment: このリポジトリのモジュール名前 @ja
domain: http://lodlaundromat.org/.well-known/genid/samples/jena///predicate//4f5f5734e1719911a6ea81b78b619b4b/bf83860cd7dab8f53104c5f50b382094#2
label: モジュール名前 @ja
label: modul @cs
label: Modul @de
label: módulo @es
comment: Jméno modulu v úložišti. @cs
comment: Nom du module d'un dépôt. @fr
comment: Nombre del módulo de un repositorio. @es
comment: Module name of a repository.
comment: Modul-Name eines Subversion. @de
domain: Resource
domain: Thing

audience
type: Property
label: 目指したユーザ @ja
comment: Description of target user base
comment: 目指したユーザたちの説明 @ja
domain: Project
range: Literal
domain: Resource
domain: Thing
range: Resource

platform
type: Property
label: プラットフォーム @ja
comment: Indicator of software platform (non-OS specific), e.g. Java, Firefox, ECMA CLR
comment: このプロジェクトの必要なプラットフォーム（OSに関係ない）。例えば：Java、Firefox、ECMA CLRとか。 @ja
domain: Project
domain: Version
range: Literal
domain: Resource
domain: Thing
range: Resource

Friend of a Friend (FOAF) vocabulary
type: Ontology
description: The Friend of a Friend (FOAF) RDF vocabulary, described using W3C RDF Schema and the Web Ontology Language.

firstName
type: Property
type: DatatypeProperty
comment: The first name of a person.
domain: Person
range: Literal
term status: testing
domain: SpatialThing
domain: Thing
domain: Agent
domain: Human Agent
domain: Resource
range: Resource

classes
type: Property
type: DatatypeProperty
comment: The total number of distinct classes in a void:Dataset. In other words, the number of distinct resources occuring as objects of rdf:type triples in the dataset.
domain: dataset
range: integer
domain: Resource
domain: Thing
range: Resource
range: decimal

maintainer
comment: Správce projektu, vedoucí projektu. @cs
type: Property
comment: Développeur principal d'un projet, un meneur du projet. @fr
comment: このプロジェクトのメンテなー及びリーダ。 @ja
label: Projektverantwortlicher @de
label: メンテナー @ja
range: Person
comment: Hauptentwickler eines Projektes, der Projektleiter @de
comment: Desarrollador principal de un proyecto, un líder de proyecto. @es
label: développeur principal @fr
domain: Project
label: správce @cs
label: desarrollador principal @es
comment: Maintainer of a project, a project leader.
domain: Resource
domain: Thing
range: Thing
range: Agent
range: Resource
range: Human Agent
range: SpatialThing

http://lodlaundromat.org/.well-known/genid/4f5f5734e1719911a6ea81b78b619b4b#9
accessed: jita
executed at: 2015-02-20T08:17:14.456Z
performed by: http://lodlaundromat.org/.well-known/genid/4f5f5734e1719911a6ea81b78b619b4b#10
type: Data Access
type: Thing
was associated with: jita
type: http://lodlaundromat.org/.well-known/genid/samples/jena///predicate//4f5f5734e1719911a6ea81b78b619b4b/d3e700bc1857a8001f8ca87e5b965b3a#2
type: Activity
type: http://lodlaundromat.org/.well-known/genid/samples/jena///predicate//4f5f5734e1719911a6ea81b78b619b4b/d3e700bc1857a8001f8ca87e5b965b3a#3
was associated with: http://lodlaundromat.org/.well-known/genid/4f5f5734e1719911a6ea81b78b619b4b#10
different from: http://lodlaundromat.org/.well-known/genid/4f5f5734e1719911a6ea81b78b619b4b#5
different from: http://lodlaundromat.org/.well-known/genid/4f5f5734e1719911a6ea81b78b619b4b#7

Richard Cyganiak
type: Person
type: Human Agent
type: SpatialThing
type: Agent
type: Thing
different from: http://lodlaundromat.org/.well-known/genid/4f5f5734e1719911a6ea81b78b619b4b#10
different from: jita
different from: http://lodlaundromat.org/.well-known/genid/4f5f5734e1719911a6ea81b78b619b4b#2

Given name
type: Property
type: DatatypeProperty
comment: The given name of some person.
term status: archaic

editorial note
definition: A note for an editor, translator or maintainer of the vocabulary.
type: AnnotationProperty
sub property of: note
type: Property
note: A note for an editor, translator or maintainer of the vocabulary.

familyName
type: Property
type: DatatypeProperty
comment: The family name of some person.
domain: Person
range: Literal
term status: testing
domain: SpatialThing
domain: Thing
domain: Agent
domain: Human Agent
domain: Resource
range: Resource