Moving Image
subclass of: Resource
comment: A series of visual representations imparting an impression of motion when shown in succession.
member of: DCMIType
description: Examples include animations, movies, television programs, videos, zoetropes, or visual output from a simulation. Instances of the type Moving Image must also be describable as instances of the broader type Image.
issued: 2003-11-18
type: Class
modified: 2008-01-14
subclass of: Image
has version: MovingImage-003

Event
subclass of: Resource
member of: DCMIType
description: Metadata for an event provides descriptive information that is the basis for discovery of the purpose, location, duration, and responsible agents associated with an event. Examples include an exhibition, webcast, conference, workshop, open day, performance, battle, trial, wedding, tea party, conflagration.
has version: Event-003
issued: 2000-07-11
modified: 2008-01-14
type: Class
comment: A non-persistent, time-based occurrence.

maker
sub property of: creator
range: Thing
equivalent property: creator
comment: An agent that made this thing.
term status: stable
domain: Thing
inverse of: made
type: Property
range: Agent
type: ObjectProperty
range: Resource
range: http://lodlaundromat.org/.well-known/genid/samples/jena///class//4b28a6ea5a0560c5a3c2e6dec52272c0/218f3af31162c0199ca266130c18209c#11
range: http://lodlaundromat.org/.well-known/genid/samples/jena///class//4b28a6ea5a0560c5a3c2e6dec52272c0/218f3af31162c0199ca266130c18209c#14
domain: Resource

identifier
range: Thing
domain: Thing
type: Property
type: ObjectProperty
comment: adms:identifier is used to link any resource to an instance of adms:Identifier which is its range. N.B. it is not appropriate to use dcterms:identifer to link to the Identifier class as its range is rdfs:Literal. ADMS uses this to provide any identifier for the Asset.
range: Identifier
range: Resource
domain: Resource

Physical Object
subclass of: Resource
member of: DCMIType
description: Note that digital representations of, or surrogates for, these objects should use Image, Text or one of the other types.
has version: PhysicalObject-003
issued: 2002-07-13
modified: 2008-01-14
type: Class
comment: An inanimate, three-dimensional object or substance.

Still Image
subclass of: Resource
subclass of: Image
has version: StillImage-003
description: Examples include paintings, drawings, graphic designs, plans and maps. Recommended best practice is to assign the type Text to images of textual materials. Instances of the type Still Image must also be describable as instances of the broader type Image.
member of: DCMIType
comment: A static visual representation.
modified: 2008-01-14
type: Class
issued: 2003-11-18

depiction
range: Thing
type: Property
type: ObjectProperty
comment: A depiction of some thing.
domain: Thing
range: Image
inverse of: depicts
term status: testing
range: Document
range: Resource
domain: Resource

subOrganization of
range: Thing
domain: Thing
comment: Rappresenta un contenimento gerarchico di una Organization o di una OrganizationalUnit. È l'inverso di `org:hasSubOrganization`. Ha nome come nome alternativo hasSubOrg. @it
label: sous-Organization de @fr
comment: Distribución jerárquica de organizaciones o unidades. Indica que una organización contiene a otra organización. Es la relación inversa de `org:hasSubOrganization` @es
comment: Représente une relation hierarchique des Organisations ou des Unités Opérationnelles; indique une Organisation sujet qui contient cette Organisation. Inverse de `org:hasSubOrganization`. @fr
type: Property
domain: Organization
inverse of: has SubOrganization
range: Organization
comment: Represents hierarchical containment of Organizations or OrganizationalUnits; indicates an Organization which contains this Organization. Inverse of `org:hasSubOrganization`.
type: ObjectProperty
comment: 組織または組織単位の階層的包含を表わします。この組織を含む組織を示します。 @ja
label: sotto-Organization di @it
label: es suborganización de @es
sub property of: transitive sub-organization
range: Resource
range: Agent
range: http://lodlaundromat.org/.well-known/genid/samples/jena///class//4b28a6ea5a0560c5a3c2e6dec52272c0/218f3af31162c0199ca266130c18209c#14
range: http://lodlaundromat.org/.well-known/genid/samples/jena///class//4b28a6ea5a0560c5a3c2e6dec52272c0/218f3af31162c0199ca266130c18209c#11
domain: Resource
domain: Agent
domain: http://lodlaundromat.org/.well-known/genid/samples/jena///class//4b28a6ea5a0560c5a3c2e6dec52272c0/218f3af31162c0199ca266130c18209c#14
domain: http://lodlaundromat.org/.well-known/genid/samples/jena///class//4b28a6ea5a0560c5a3c2e6dec52272c0/218f3af31162c0199ca266130c18209c#11

has SubOrganization
range: Thing
domain: Thing
comment: Represents hierarchical containment of Organizations or Organizational Units; indicates an organization which is a sub-part or child of this organization. Inverse of `org:subOrganizationOf`.
comment: 組織または組織単位の階層的包含を表わします。この組織のサブパートまたは子である組織を示します。 @ja
inverse of: subOrganization of
type: Property
label: tiene suborganización @es
type: ObjectProperty
label: a une Sous-Organization @fr
domain: Organization
range: Organization
comment: Indique le statut de dépendance hiérarchique pour des Organisations ou des Unités Opérationnelles; indique une Organisation qui est une sous-partie ou une branche d'une Organisation plus large. C'est la propriété inverse de `org:subOrganizationOf`. @fr
comment: Rappresenta un contenimento gerarchico di una Organization o di una OrganizationalUnit. Indica una organizzazione che è parte di una organizzazione più grande. È l'inverso di `org:subOrganizationOf`. @it
comment: Organización jerárquica de organizaciones o unidades. Indica que una organización es parte de otra organización más amplia o pertenece a ella. Es la relación inversa de `org:subOrganizationOf`. @es
label: ha sotto-Organization @it
range: http://lodlaundromat.org/.well-known/genid/samples/jena///class//4b28a6ea5a0560c5a3c2e6dec52272c0/218f3af31162c0199ca266130c18209c#14
range: Agent
range: http://lodlaundromat.org/.well-known/genid/samples/jena///class//4b28a6ea5a0560c5a3c2e6dec52272c0/218f3af31162c0199ca266130c18209c#11
range: Resource
domain: Agent
domain: Resource
domain: http://lodlaundromat.org/.well-known/genid/samples/jena///class//4b28a6ea5a0560c5a3c2e6dec52272c0/218f3af31162c0199ca266130c18209c#14
domain: http://lodlaundromat.org/.well-known/genid/samples/jena///class//4b28a6ea5a0560c5a3c2e6dec52272c0/218f3af31162c0199ca266130c18209c#11

knows
range: Thing
domain: Thing
type: Property
type: ObjectProperty
comment: A person known by this person (indicating some level of reciprocated interaction between the parties).
domain: Person
range: Person
term status: stable
range: SpatialThing
range: Resource
range: http://lodlaundromat.org/.well-known/genid/samples/jena///class//4b28a6ea5a0560c5a3c2e6dec52272c0/218f3af31162c0199ca266130c18209c#14
range: http://lodlaundromat.org/.well-known/genid/samples/jena///class//4b28a6ea5a0560c5a3c2e6dec52272c0/218f3af31162c0199ca266130c18209c#11
range: Agent
domain: Agent
domain: Resource
domain: http://lodlaundromat.org/.well-known/genid/samples/jena///class//4b28a6ea5a0560c5a3c2e6dec52272c0/218f3af31162c0199ca266130c18209c#14
domain: SpatialThing
domain: http://lodlaundromat.org/.well-known/genid/samples/jena///class//4b28a6ea5a0560c5a3c2e6dec52272c0/218f3af31162c0199ca266130c18209c#11

Online Account
subclass of: Resource
type: Class
comment: An online account.
subclass of: Thing
term status: testing

company activity
range: Thing
domain: Thing
type: Property
type: ObjectProperty
comment: The activity of a company should be recorded using a controlled vocabulary expressed as a SKOS concept scheme. Several such vocabularies exist, many of which map to the UN's ISIC codes. Where a particular controlled vocabulary is in use within a given context, such as SIC codes in the UK, it is acceptable to use these, however, the preferred choice for European interoperability is NACE. rov:orgActivity is a sub class of org:classification which has a range of skos:Concept.
sub property of: classification
range: Concept
range: Resource
domain: Organization
domain: Resource
domain: Agent
domain: http://lodlaundromat.org/.well-known/genid/samples/jena///class//4b28a6ea5a0560c5a3c2e6dec52272c0/218f3af31162c0199ca266130c18209c#14
domain: http://lodlaundromat.org/.well-known/genid/samples/jena///class//4b28a6ea5a0560c5a3c2e6dec52272c0/218f3af31162c0199ca266130c18209c#11

Text
subclass of: Resource
member of: DCMIType
description: Examples include books, letters, dissertations, poems, newspapers, articles, archives of mailing lists. Note that facsimiles or images of texts are still of the genre Text.
has version: Text-003
issued: 2000-07-11
modified: 2008-01-14
type: Class
comment: A resource consisting primarily of words for reading.

Phil Archer
affiliation: W3C/ERCIM
type: Thing
made: Registered Organization Vocabulary
made: Asset Description Metadata Schema (ADMS)
type: Agent
type: http://lodlaundromat.org/.well-known/genid/samples/jena///class//4b28a6ea5a0560c5a3c2e6dec52272c0/218f3af31162c0199ca266130c18209c#11
type: http://lodlaundromat.org/.well-known/genid/samples/jena///class//4b28a6ea5a0560c5a3c2e6dec52272c0/218f3af31162c0199ca266130c18209c#14

European Commission - Joint Research Centre (JRC)
type: Thing

site Address
range: Thing
domain: Thing
type: Property
label: es la dirección de la sede @es
comment: Dirección de la sede según una codificación adecuada. Se recomienda el uso de vCard (que utiliza el vocabulario en http://www.w3.org/TR/vcard-rdf/), pero el rango no se restringe únicamente al uso de este vocabulario sino que se permite el uso de otros códigos. La dirección puede constar de una dirección de correo electrónico, un número de teléfono o información de geo-localización, y no se limita a una dirección postal física. @es
comment: Indicates an address for the site in a suitable encoding. Use of vCard (using the http://www.w3.org/TR/vcard-rdf/ vocabulary) is encouraged but the range is left open to allow other encodings to be used. The address may include email, telephone, and geo-location information and is not restricted to a physical address.
comment: Indique une adresse pour le site dans un encodage approprié. L'usage du vocabulaire vCard ( http://www.w3.org/TR/vcard-rdf/) est encouragé, mais le range est ouvert pour permettre l'utilisation d'autres vocabulaires. L'adresse peut comporter le courriel, le téléphone, et l'information de géolocalisation; et n'est donc pas seulement limitée à une adresse physique. @fr
comment: Indica un indirizzo per la sede in una codifica appropriata. Il codominio è lasciato libero ma è consigliabile l'uso del vocabolario vCard (http://www.w3.org/TR/vcard-rdf/). L'indirizzo può includere email, numero di telefono e informazioni di geolocalizzazione e non è vincolato ad essere un indirizzo fisico. @it
type: ObjectProperty
label: indirizzo della sede @it
domain: Site
label: adresse du Site @fr
comment: 適切にコード化されたサイトのアドレスを示します。vCard[vcard-rdf]語彙などの有名なアドレスのコード化の使用が奨励されますが、他の符号化の使用を可能とするために値域はオープンのままにされます。アドレスには、電子メール、電話およびジオロケーション情報を含むことができ、物理的なアドレスに制限されません。 @ja
range: Resource
domain: Resource

European Commission, Joint Research Centre
type: Thing

Online Chat Account
subclass of: Resource
subclass of: Thing
type: Class
comment: An online chat account.
subclass of: Online Account
term status: unstable

thumbnail
range: Thing
domain: Thing
type: Property
type: ObjectProperty
comment: A derived thumbnail image.
domain: Image
range: Image
term status: testing
range: Document
range: Resource
domain: Document
domain: Resource

Formal Organization
subclass of: Resource
subclass of: Thing
label: organización formal @es
comment: Organización reconocida a nivel mundial, en particular en jurisdicciones legales, con derechos y responsabilidades asociadas. Algunos ejemplos son: organización corporativa, organización benéfica, organización gubernamental, organización religiosa. Se debe tener en cuenta que ésta es una superclase de `gr:BusinessEntity` y que se recomienda el uso del vocabulario GoodRelations para referirse a clasificaciones de negocios tales como DUNS o NAICS. @es
label: Organisation Formelle @fr
comment: 関連する権利と責任を有する（特に法的管轄区域において）世界中に広く認識されている組織。例には、企業、慈善団体、政府や教会が含まれます。 @ja
type: Class
subclass of: Organization
comment: Un'organizzazione che è riconosciuta a livello mondiale o, in generale, all'interno di una qualche giurisdizione, e che quindi possiede diritti e responsabilità. Ad esempio aziende, enti governativi, associazioni di volontariato. Si noti che questa è una superclasse di `gr:BusinessEntity` e che quindi è raccomandabile usare il vocabolario GoodRelations per esprimere classificazioni di tipo industriale e commerciale come DUNS e NAICS. @it
comment: Une Organisation reconnue, en particulier par les juridictions locales, ayant des droits et des responsabilités. Exemples : entreprises, association à but non-lucratif, collectivité, église. Notez que c'est une super-classe de `gr:BusinessEntity` et qu'il est recommandé d'utiliser le vocabulaire GoodRelations pour indiquer les classifications économiques comme le code NACE. @fr
label: Organizzazione formale @it
comment: An Organization which is recognized in the world at large, in particular in legal jurisdictions, with associated rights and responsibilities. Examples include a Corporation, Charity, Government or Church. Note that this is a super class of `gr:BusinessEntity` and it is recommended to use the GoodRelations vocabulary to denote Business classifications such as DUNS or NAICS.
subclass of: Agent
subclass of: http://lodlaundromat.org/.well-known/genid/samples/jena///class//4b28a6ea5a0560c5a3c2e6dec52272c0/218f3af31162c0199ca266130c18209c#14
subclass of: http://lodlaundromat.org/.well-known/genid/samples/jena///class//4b28a6ea5a0560c5a3c2e6dec52272c0/218f3af31162c0199ca266130c18209c#11

interest
range: Thing
domain: Thing
type: Property
type: ObjectProperty
comment: A page about a topic of interest to this person.
domain: Agent
range: Document
term status: testing
range: Resource
domain: Resource
domain: http://lodlaundromat.org/.well-known/genid/samples/jena///class//4b28a6ea5a0560c5a3c2e6dec52272c0/218f3af31162c0199ca266130c18209c#14
domain: http://lodlaundromat.org/.well-known/genid/samples/jena///class//4b28a6ea5a0560c5a3c2e6dec52272c0/218f3af31162c0199ca266130c18209c#11

original organization
range: Thing
domain: Thing
label: es organización original @es
sub property of: used
range: Organization
label: organizzazione originale @it
comment: Indica una o più organizzazioni pregresse rispetto a un evento di cambiamento. A seconda dell'evento, queste organizzazioni potrebbero essere esistenti dopo l'evento o aver cessato la loro esistenza. È l'inverso di `org:changedBy`. @it
type: ObjectProperty
comment: Una o más organizaciones que existían antes de que sucediera el cambio en la organización. Dependiendo del tipo de cambio, dichas organizaciones pueden haber dejado de existir o no. Es la relación inversa de `org:changedBy`. @es
type: Property
inverse of: changed by
domain: Change Event
comment: Indique une ou plusieurs organisations qui ont existé avant un évènement de changement. Selon l'évènement, ces organisations ont pu continuer à exister ou non. Inverse de `org:changedBy`. @fr
label: organisation originelle @fr
comment: Indicates one or more organizations that existed before the change event. Depending on the event they may or may not have continued to exist after the event. Inverse of `org:changedBy`.
comment: 変更のきっかけとなった出来事以前に存在した1つ以上の組織を示します。出来事によって、出来事の後にそれらは存在し続けたかも、存在し続けなかったかもしれません。 @ja
range: http://lodlaundromat.org/.well-known/genid/samples/jena///class//4b28a6ea5a0560c5a3c2e6dec52272c0/218f3af31162c0199ca266130c18209c#14
range: Agent
range: http://lodlaundromat.org/.well-known/genid/samples/jena///class//4b28a6ea5a0560c5a3c2e6dec52272c0/218f3af31162c0199ca266130c18209c#11
range: Resource
domain: Resource
domain: Activity

post in
range: Thing
domain: Thing
inverse of: post
label: poste chez @fr
comment: Indicates the Organization in which the Post exists.
type: ObjectProperty
comment: ポストが存在する組織を示します。 @ja
range: Organization
comment: Organización en la que existe el puesto. @es
type: Property
comment: Indica l'Organization in cui il Post è presente. @it
label: es un puesto en @es
domain: Post
label: impiego in @it
comment: Indicate l'Organisation dans laquelle le Poste existe. @fr
range: http://lodlaundromat.org/.well-known/genid/samples/jena///class//4b28a6ea5a0560c5a3c2e6dec52272c0/218f3af31162c0199ca266130c18209c#14
range: Agent
range: http://lodlaundromat.org/.well-known/genid/samples/jena///class//4b28a6ea5a0560c5a3c2e6dec52272c0/218f3af31162c0199ca266130c18209c#11
range: Resource
domain: http://lodlaundromat.org/.well-known/genid/samples/jena///class//4b28a6ea5a0560c5a3c2e6dec52272c0/218f3af31162c0199ca266130c18209c#17
domain: Resource
domain: http://lodlaundromat.org/.well-known/genid/samples/jena///class//4b28a6ea5a0560c5a3c2e6dec52272c0/218f3af31162c0199ca266130c18209c#14
domain: http://lodlaundromat.org/.well-known/genid/samples/jena///class//4b28a6ea5a0560c5a3c2e6dec52272c0/218f3af31162c0199ca266130c18209c#11

depicts
domain: Thing
type: Property
type: ObjectProperty
comment: A thing depicted in this representation.
domain: Image
range: Thing
inverse of: depiction
term status: testing
range: Resource
domain: Document
domain: Resource

account
range: Thing
domain: Thing
type: Property
type: ObjectProperty
comment: Indicates an account held by this agent.
domain: Agent
range: Online Account
term status: testing
range: Resource
domain: Resource
domain: http://lodlaundromat.org/.well-known/genid/samples/jena///class//4b28a6ea5a0560c5a3c2e6dec52272c0/218f3af31162c0199ca266130c18209c#14
domain: http://lodlaundromat.org/.well-known/genid/samples/jena///class//4b28a6ea5a0560c5a3c2e6dec52272c0/218f3af31162c0199ca266130c18209c#11

Geometry
subclass of: Resource
type: Class
comment: The locn:Geometry class provides the means to identify a location as a point, line, polygon, etc. expressed using coordinates in some coordinate reference system.
usage note: This class defines the notion of "geometry" at the conceptual level, and it shall be encoded by using different formats (see usage note of the locn:geometry property).
term status: unstable

resulted in
range: Thing
domain: Thing
inverse of: resulted from
comment: Organización que ha sido creada o modificada tras un evento específico. Es la relación inversa de `org:resultedFrom`. @es
label: resulta en @es
label: risultato in @it
comment: 出来事の結果、作成、変更された組織を示します。 @ja
comment: Indique une organisation qui a été créée ou a été modifiée à la suite d'un Évènement de changement. Inverse de `org:resultedFrom`. @fr
comment: Indica l'organizzazione che è stata creata o mutata a seguito dell'evento. È l'inverso di `org:resultedFrom`. @it
range: Organization
type: ObjectProperty
label: a donné naissance à @fr
comment: Indicates an organization which was created or changed as a result of the event. Inverse of `org:resultedFrom`.
type: Property
domain: Change Event
range: http://lodlaundromat.org/.well-known/genid/samples/jena///class//4b28a6ea5a0560c5a3c2e6dec52272c0/218f3af31162c0199ca266130c18209c#14
range: Agent
range: http://lodlaundromat.org/.well-known/genid/samples/jena///class//4b28a6ea5a0560c5a3c2e6dec52272c0/218f3af31162c0199ca266130c18209c#11
range: Resource
domain: Resource
domain: Activity

geographic identifier
type: Property
comment: rdfs:seeAlso fully represents the ISA Programme Location Core Vocabulary concept of a geographic identifier.
usage note: Used in the ISA Programme Location Core Vocabulary to provide a URI that identifies the location. This should be expressed using the rdfs:seeAlso property unless the identifier is already the subject of the description. Examples include URIs from GeoNames.org and DBpedia such as http://dbpedia.org/resource/ISO_3166-2:XX where XX is the ISO 3166 two character code for a country.
term status: unstable

has site
range: Thing
domain: Thing
inverse of: site Of
domain: Organization
comment: Indica la sede in cui l'Organization ha una qualche presenza anche in modo indiretto (ad esempio un ufficio virtuale). È l'inverso di `org:siteOf`. @it
type: ObjectProperty
comment: Lugar en donde la organización tiene algún tipo de presencia, incluso si es de forma indirecta (por ejemplo, una oficina virtual o servicio profesional que hagan la función de dirección registrada de la compañía). Es la relación inversa de `org:siteOf`. @es
comment: Indique un site sur lequel l'Organisation possède une présence, même indirecte (domiciliation, boite postale). Inverse de `org:siteOf`. @fr
label: a un site @fr
label: ha sede @it
range: Site
type: Property
comment: Indicates a site at which the Organization has some presence even if only indirect (e.g. virtual office or a professional service which is acting as the registered address for a company). Inverse of `org:siteOf`.
comment: 組織が、間接（例えば、会社の登録住所として機能しているバーチャル・オフィスやプロフェッショナル・サービス）のみであったとしても、ある存在感を持っているサイトを示します。 @ja
label: tiene sede en @es
range: Resource
domain: Agent
domain: Resource
domain: http://lodlaundromat.org/.well-known/genid/samples/jena///class//4b28a6ea5a0560c5a3c2e6dec52272c0/218f3af31162c0199ca266130c18209c#14
domain: http://lodlaundromat.org/.well-known/genid/samples/jena///class//4b28a6ea5a0560c5a3c2e6dec52272c0/218f3af31162c0199ca266130c18209c#11

Location
subclass of: Resource
type: Class
comment: dcterms:Location class fully represents the ISA Programme Location Core Vocabulary class of Location.
usage note: This is the key class for the ISA Programme Location Core Vocabulary and represents any location, irrespective of size or other restriction.
term status: testing

schoolHomepage
range: Thing
domain: Thing
type: Property
type: ObjectProperty
comment: A homepage of a school attended by the person.
domain: Person
range: Document
term status: testing
range: Resource
domain: Agent
domain: Resource
domain: http://lodlaundromat.org/.well-known/genid/samples/jena///class//4b28a6ea5a0560c5a3c2e6dec52272c0/218f3af31162c0199ca266130c18209c#14
domain: SpatialThing
domain: http://lodlaundromat.org/.well-known/genid/samples/jena///class//4b28a6ea5a0560c5a3c2e6dec52272c0/218f3af31162c0199ca266130c18209c#11

Person
subclass of: Resource
subclass of: Thing
subclass of: Agent
comment: A person.
term status: stable
subclass of: SpatialThing
disjoint with: Project
type: Class
subclass of: Person
disjoint with: Organization
subclass of: http://lodlaundromat.org/.well-known/genid/samples/jena///class//4b28a6ea5a0560c5a3c2e6dec52272c0/218f3af31162c0199ca266130c18209c#14
subclass of: http://lodlaundromat.org/.well-known/genid/samples/jena///class//4b28a6ea5a0560c5a3c2e6dec52272c0/218f3af31162c0199ca266130c18209c#11

linked to
range: Thing
domain: Thing
label: está relacionado con @es
domain: Organization
type: ObjectProperty
comment: Indica una relazione arbitraria tra due organizzazioni. Ad esempio, specializzazioni di questa proprietà possono essere usate per denotare relazioni particolari tipo il finanziamento o la fornitura. @it
comment: Indicates an arbitrary relationship between two organizations. Specializations of this can be used to, for example, denote funding or supply chain relationships.
label: está relacionada con @es
type: Property
comment: Indique une relation arbitraire entre deux Organisations. Des spécialisations peuvent être utilisées pour, par exemple, qualifier une relation de fournisseur ou de financeur. @fr
label: collegato a @it
comment: 2つの組織の任意の関係を示します。 @ja
comment: Relación arbitraria entre dos organizaciones. Las especializaciones de esta relación se pueden utilizar para denotar relaciones de financiación o suministro, entre otras. @es
label: relié à @fr
range: Organization
range: http://lodlaundromat.org/.well-known/genid/samples/jena///class//4b28a6ea5a0560c5a3c2e6dec52272c0/218f3af31162c0199ca266130c18209c#14
range: Agent
range: http://lodlaundromat.org/.well-known/genid/samples/jena///class//4b28a6ea5a0560c5a3c2e6dec52272c0/218f3af31162c0199ca266130c18209c#11
range: Resource
domain: Agent
domain: Resource
domain: http://lodlaundromat.org/.well-known/genid/samples/jena///class//4b28a6ea5a0560c5a3c2e6dec52272c0/218f3af31162c0199ca266130c18209c#14
domain: http://lodlaundromat.org/.well-known/genid/samples/jena///class//4b28a6ea5a0560c5a3c2e6dec52272c0/218f3af31162c0199ca266130c18209c#11

changed by
range: Thing
domain: Thing
label: cambiata da @it
label: es modificado por @es
type: Property
type: ObjectProperty
range: Change Event
comment: Indique un évènement qui a impliqué un changement dans l'Organisation. Selon l'évènement, l'Organisation a continué à exister après l'évènement, ou pas. Inverse de `org:originalOrganization`. @fr
comment: Evento de cambio que resulta en una modificación en la organización. Dependiendo del evento, la organización puede dejar de existir tras el cambio. Es la relación inversa de `org:originalOrganization`. @es
label: es modificada por @es
inverse of: original organization
comment: Indicates a change event which resulted in a change to this organization. Depending on the event the organization may or may not have continued to exist after the event. Inverse of `org:originalOrganization`.
comment: Indica un evento che ha contribuito al cambiamento di questa organizzazione. A seconda dell'evento, l'organizzazione potrebbe essere esistente dopo l'evento o aver cessato la propria esistenza. È l'inverso di `org:originalOrganization`. @it
comment: この組織の変更のきっかけとなった出来事を示します。 @ja
domain: Organization
label: modifiée par @fr
range: Resource
range: Activity
domain: Agent
domain: Resource
domain: http://lodlaundromat.org/.well-known/genid/samples/jena///class//4b28a6ea5a0560c5a3c2e6dec52272c0/218f3af31162c0199ca266130c18209c#14
domain: http://lodlaundromat.org/.well-known/genid/samples/jena///class//4b28a6ea5a0560c5a3c2e6dec52272c0/218f3af31162c0199ca266130c18209c#11

topic
domain: Thing
type: Property
type: ObjectProperty
comment: A topic of some page or document.
domain: Document
range: Thing
inverse of: page
term status: testing
range: Resource
domain: Resource

head of
range: Thing
domain: Thing
type: ObjectProperty
comment: 人（または他のエージェント）が組織のリーダーや正式なトップであることを示します。 @ja
comment: Indique qu'une personne est le directeur ou le responsable formel d'une Organisation. Ceci indique souvent qu'il est au sommet de du graphe acyclique des `org:reportsTo`, même si une organisation peut avoir plus d'un responsable. @fr
sub property of: member of
comment: Persona que es jefe o jefa, representante ,,director o directora de la organización. Esto significa que dicha persona es el rango de la relación `org:reportsTo` en el organigrama de la organización (acíclico), aunque una organización puede tener más de un jefe. @es
label: responsabile di @it
type: Property
label: responsable de @fr
comment: Indicates that a person is the leader or formal head of the Organization. This will normally mean that they are the root of the `org:reportsTo` (acyclic) graph, though an organization may have more than one head.
domain: Person
range: Organization
label: es director ejecutivo de @es
comment: Indica che una persona è leader o responsabile formale di una Organization. Questo significa che la persona è alla radice del grafo (aciclico) creato dalle `org:reportsTo`, sebbene un'organizzazione possa avere più di un responsabile. @it
range: Resource
range: Agent
range: http://lodlaundromat.org/.well-known/genid/samples/jena///class//4b28a6ea5a0560c5a3c2e6dec52272c0/218f3af31162c0199ca266130c18209c#14
range: http://lodlaundromat.org/.well-known/genid/samples/jena///class//4b28a6ea5a0560c5a3c2e6dec52272c0/218f3af31162c0199ca266130c18209c#11
domain: Agent
domain: Resource
domain: http://lodlaundromat.org/.well-known/genid/samples/jena///class//4b28a6ea5a0560c5a3c2e6dec52272c0/218f3af31162c0199ca266130c18209c#11
domain: http://lodlaundromat.org/.well-known/genid/samples/jena///class//4b28a6ea5a0560c5a3c2e6dec52272c0/218f3af31162c0199ca266130c18209c#14
domain: SpatialThing

European Commission - Joint Research Centre (JRC)
type: Thing

Andrea Perego
affiliation: European Commission, Joint Research Centre
type: Thing
made: Registered Organization Vocabulary
made: Asset Description Metadata Schema (ADMS)
type: Agent
type: http://lodlaundromat.org/.well-known/genid/samples/jena///class//4b28a6ea5a0560c5a3c2e6dec52272c0/218f3af31162c0199ca266130c18209c#14
type: http://lodlaundromat.org/.well-known/genid/samples/jena///class//4b28a6ea5a0560c5a3c2e6dec52272c0/218f3af31162c0199ca266130c18209c#11

Image
subclass of: Resource
member of: DCMIType
description: Examples include images and photographs of physical objects, paintings, prints, drawings, other images and graphics, animations and moving pictures, film, diagrams, maps, musical notation. Note that Image may include both electronic and physical representations.
has version: Image-004
issued: 2000-07-11
modified: 2008-01-14
type: Class
comment: A visual representation other than text.

member
range: Thing
domain: Thing
equivalent property: has member
sub property of: has member
type: Property
type: ObjectProperty
comment: Indicates a member of a Group
domain: Group
range: Agent
term status: stable
range: Resource
range: http://lodlaundromat.org/.well-known/genid/samples/jena///class//4b28a6ea5a0560c5a3c2e6dec52272c0/218f3af31162c0199ca266130c18209c#11
range: http://lodlaundromat.org/.well-known/genid/samples/jena///class//4b28a6ea5a0560c5a3c2e6dec52272c0/218f3af31162c0199ca266130c18209c#14
domain: Organization
domain: Resource
domain: Agent
domain: http://lodlaundromat.org/.well-known/genid/samples/jena///class//4b28a6ea5a0560c5a3c2e6dec52272c0/218f3af31162c0199ca266130c18209c#14
domain: http://lodlaundromat.org/.well-known/genid/samples/jena///class//4b28a6ea5a0560c5a3c2e6dec52272c0/218f3af31162c0199ca266130c18209c#11

Project
subclass of: Resource
subclass of: Thing
type: Class
comment: A project (a collective endeavour of some kind).
disjoint with: Person
disjoint with: Document
term status: testing

post
inverse of: post in
range: Thing
domain: Thing
comment: 組織内に存在するポストを示します。 @ja
type: ObjectProperty
domain: Organization
label: possède un poste @fr
comment: Indica il Post che è presente in una Organization. @it
comment: Indicates a Post which exists within the Organization.
label: tiene puesto @es
label: impiego @it
range: Post
type: Property
comment: Indicate un Poste qui existe dans l'Organisation. @fr
comment: Posición que existe en una organización. @es
range: http://lodlaundromat.org/.well-known/genid/samples/jena///class//4b28a6ea5a0560c5a3c2e6dec52272c0/218f3af31162c0199ca266130c18209c#17
range: Resource
range: http://lodlaundromat.org/.well-known/genid/samples/jena///class//4b28a6ea5a0560c5a3c2e6dec52272c0/218f3af31162c0199ca266130c18209c#14
range: http://lodlaundromat.org/.well-known/genid/samples/jena///class//4b28a6ea5a0560c5a3c2e6dec52272c0/218f3af31162c0199ca266130c18209c#11
domain: Agent
domain: Resource
domain: http://lodlaundromat.org/.well-known/genid/samples/jena///class//4b28a6ea5a0560c5a3c2e6dec52272c0/218f3af31162c0199ca266130c18209c#14
domain: http://lodlaundromat.org/.well-known/genid/samples/jena///class//4b28a6ea5a0560c5a3c2e6dec52272c0/218f3af31162c0199ca266130c18209c#11

included asset
range: Thing
domain: Thing
type: Property
type: ObjectProperty
comment: Links to an Asset that is contained in the Asset being described, e.g. when there are several vocabularies defined in a single document.
domain: Asset
range: Asset
range: Resource
range: Dataset
domain: Resource
domain: Dataset

registered organization
range: Thing
domain: Thing
type: Property
type: ObjectProperty
comment: The has registered organization relationship can be used to link any dcterms:Agent (equivalent class foaf:Agent) to a Registered Organization that in some way acts as a registered legal entity for it. This is useful, for example, where an organization includes one or more legal entities, or where a natural person is also registered as a legal entity. rov:hasRegisteredOrganization has a range of rov:RegisteredOrganization.
domain: Agent
range: Registered Organization
range: http://lodlaundromat.org/.well-known/genid/samples/jena///class//4b28a6ea5a0560c5a3c2e6dec52272c0/218f3af31162c0199ca266130c18209c#14
range: Agent
range: http://lodlaundromat.org/.well-known/genid/samples/jena///class//4b28a6ea5a0560c5a3c2e6dec52272c0/218f3af31162c0199ca266130c18209c#11
range: Resource
range: Organization
range: Formal Organization
domain: Resource
domain: http://lodlaundromat.org/.well-known/genid/samples/jena///class//4b28a6ea5a0560c5a3c2e6dec52272c0/218f3af31162c0199ca266130c18209c#14
domain: http://lodlaundromat.org/.well-known/genid/samples/jena///class//4b28a6ea5a0560c5a3c2e6dec52272c0/218f3af31162c0199ca266130c18209c#11

Change Event
subclass of: Resource
subclass of: Thing
comment: Represents an event which resulted in a major change to an organization such as a merger or complete restructuring. It is intended for situations where the resulting organization is sufficient distinct from the original organizations that it has a distinct identity and distinct URI. Extension vocabularies should define sub-classes of this to denote particular categories of event. The instant or interval at which the event occurred should be given by `prov:startAtTime` and `prov:endedAtTime`, a description should be given by `dct:description`.
comment: Evento que da como resultado un cambio sustancial en la organización, por ejemplo, una fusión o una reestructuración total. Está pensado para situaciones en las que la organización resultante es lo suficientemente distinta de las organizaciones originales, tiene una identidad distinta y una URI también distinta. Se deberían definir subtipos de eventos mediante vocabularios específicos (Extension vocabularies) para referirse a categorías de eventos específicos. El momento o periodo en el que el evento ocurre se debería expresar mediante las propiedades `prov:startAtTime` y `prov:endedAtTime`, y una descripción del mismo se debería incluir mediante el uso de la propiedad `dct:description`. @es
comment: Rappresenta un evento risultato essere un importante cambiamento per un'organizzazione come ad esempio una fusione o una riorganizzazione. È pensato per quelle situazioni in cui l'organizzazione risultante si distingue da quella originale sufficientemente da essere rappresentata con una URI differente. Le estensioni del vocabolario dovrebbero definire le sotto-classi per esprimere particolari categorie di eventi. L'istante o l'intervallo in cui l'evento accade dovrebbe essere espresso tramite `prov:startAtTime` e`prov:endedAtTime`. Una descrizione dovrebbe essere fornita attraverso `dct:description`. @it
comment: 合併や完全な再編などの組織に大きな変化をもたらした出来事を表わします。これは、結果として作成される組織と元の組織とが、別のアイデンティティーと別のURIを持つに足るほど異なる状況を対象としています。 @ja
label: Evento di cambiamento @it
label: Évènement @fr
subclass of: Activity
type: Class
label: evento de cambio @es
comment: Représente un Évènement impliquant un changement majeur dans l'Organisation, comme une fusion ou une restructuration. Prévu pour des situations ou l'organisation finale est suffisamment différente des Organisations originales pour qu'elle ait une identité et une URI distinctes. Des vocabulaires d'extension devraient définir des sous-classes de celle-ci pour annoter les différentes catégories d'Évènemenents. Le moment ou l'intervalle de l'Évènement devrait être indiqué avec `prov:startAtTime` et `prov:endedAtTime`, et une description avec la classe `dct:description`. @fr
disjoint with: Role
disjoint with: Membership
disjoint with: Organization
disjoint with: Site

current project
domain: Thing
type: Property
type: ObjectProperty
comment: A current project this person works on.
domain: Person
range: Thing
term status: testing
range: Resource
domain: Agent
domain: Resource
domain: http://lodlaundromat.org/.well-known/genid/samples/jena///class//4b28a6ea5a0560c5a3c2e6dec52272c0/218f3af31162c0199ca266130c18209c#14
domain: SpatialThing
domain: http://lodlaundromat.org/.well-known/genid/samples/jena///class//4b28a6ea5a0560c5a3c2e6dec52272c0/218f3af31162c0199ca266130c18209c#11

homepage
range: Thing
comment: A homepage for some thing.
range: Document
type: Property
term status: stable
sub property of: page
sub property of: is primary topic of
domain: Thing
type: ObjectProperty
type: InverseFunctionalProperty
range: Resource
domain: Resource

Makx Dekkers
type: Thing
type: Agent
type: http://lodlaundromat.org/.well-known/genid/samples/jena///class//4b28a6ea5a0560c5a3c2e6dec52272c0/218f3af31162c0199ca266130c18209c#14
made: Registered Organization Vocabulary
made: Asset Description Metadata Schema (ADMS)
type: http://lodlaundromat.org/.well-known/genid/samples/jena///class//4b28a6ea5a0560c5a3c2e6dec52272c0/218f3af31162c0199ca266130c18209c#11

company status
range: Thing
domain: Thing
type: Property
type: ObjectProperty
comment: Terms like insolvent, bankrupt and in receivership are likely to have different legal implications in different jurisdictions. Best Practice for recording various other status levels is to use the relevant jurisdiction's terms and to do so in a consistent manner using a SKOS Concept Scheme. rov:orgStatus is a sub class of org:classification which has a range of skos:Concept.
sub property of: classification
range: Concept
range: Resource
domain: Organization
domain: Resource
domain: Agent
domain: http://lodlaundromat.org/.well-known/genid/samples/jena///class//4b28a6ea5a0560c5a3c2e6dec52272c0/218f3af31162c0199ca266130c18209c#14
domain: http://lodlaundromat.org/.well-known/genid/samples/jena///class//4b28a6ea5a0560c5a3c2e6dec52272c0/218f3af31162c0199ca266130c18209c#11

weblog
range: Thing
domain: Thing
sub property of: page
type: Property
range: Document
term status: testing
comment: A weblog of some thing (whether person, group, company etc.).
domain: Agent
type: InverseFunctionalProperty
type: ObjectProperty
range: Resource
domain: Resource
domain: http://lodlaundromat.org/.well-known/genid/samples/jena///class//4b28a6ea5a0560c5a3c2e6dec52272c0/218f3af31162c0199ca266130c18209c#14
domain: http://lodlaundromat.org/.well-known/genid/samples/jena///class//4b28a6ea5a0560c5a3c2e6dec52272c0/218f3af31162c0199ca266130c18209c#11

organization
range: Thing
domain: Thing
range: Organization
comment: Indica l'Organization in cui l'Agent è un membro. @it
comment: Indique l'Organization dont l'agent est membre. @fr
domain: Membership
comment: Organización a la que pertenece el agente en calidad de miembro. @es
comment: Indicates Organization in which the Agent is a member.
type: FunctionalProperty
type: Property
label: organizzazione @it
comment: エージェントがメンバーである組織を示します。 @ja
type: ObjectProperty
label: organisation @fr
label: es condición de miembro sobre organización @es
range: http://lodlaundromat.org/.well-known/genid/samples/jena///class//4b28a6ea5a0560c5a3c2e6dec52272c0/218f3af31162c0199ca266130c18209c#14
range: Agent
range: http://lodlaundromat.org/.well-known/genid/samples/jena///class//4b28a6ea5a0560c5a3c2e6dec52272c0/218f3af31162c0199ca266130c18209c#11
range: Resource
domain: Resource
domain: http://lodlaundromat.org/.well-known/genid/samples/jena///class//4b28a6ea5a0560c5a3c2e6dec52272c0/218f3af31162c0199ca266130c18209c#17

remuneration
range: Thing
domain: Thing
comment: Indique un salaire ou tout autre compensation associée au Rôle. Typiquement, ceci sera annoté en utilisant un schéma existant comme `gr:PriceSpecification` mais le champ de cette propriété est laissé ouvert afin de permettre aux applications de la spécialiser (par exemple remunerationEuro). @fr
comment: Indicates a salary or other reward associated with the role. Typically this will be denoted using an existing representation scheme such as `gr:PriceSpecification` but the range is left open to allow applications to specialize it (e.g. to remunerationInGBP).
comment: Indica il salario o altra forma di remunerazione associata al ruolo. In genere, questo si denota usando uno schema di rappresentazione esistente come il `gr:PriceSpecification` ma il codominio è lasciato libero di essere specializzato a seconda delle applicazioni. @it
label: rémuneration @fr
label: remunerazione @it
comment: Salario o cualquier otra remuneración asociada con la actividad. La forma usual de referirse a dicha remuneración será utilizando un esquema de representación como el propuesto en la ontología GoodRelations `gr:PriceSpecification`, pero el rango se deja abierto a que las distintas aplicaciones lo especialicen (por ejemplo, remunerationInGBP) @es
domain: Role
commenet: 役割に関係する給料やその他の報酬を示します。 @ja
label: recibe remuneración @es
type: Property
type: ObjectProperty
range: Resource
domain: Resource
domain: Concept

phone
range: Thing
domain: Thing
type: Property
type: ObjectProperty
comment: A phone, specified using fully qualified tel: URI scheme (refs: http://www.w3.org/Addressing/schemes.html#tel).
term status: testing
range: Resource
domain: Resource

Image
subclass of: Resource
subclass of: Thing
type: Class
comment: An image.
subclass of: Document
term status: testing

made
domain: Thing
type: Property
type: ObjectProperty
comment: Something that was made by this agent.
domain: Agent
range: Thing
inverse of: maker
term status: stable
range: Resource
domain: Resource
domain: http://lodlaundromat.org/.well-known/genid/samples/jena///class//4b28a6ea5a0560c5a3c2e6dec52272c0/218f3af31162c0199ca266130c18209c#14
domain: http://lodlaundromat.org/.well-known/genid/samples/jena///class//4b28a6ea5a0560c5a3c2e6dec52272c0/218f3af31162c0199ca266130c18209c#11

unit Of
sub property of: transitive sub-organization
range: Thing
domain: Thing
inverse of: has Unit
comment: 例えば、より大きな組織内の部局など、この単位がその一部分である組織を示します。 @ja
comment: Organización de la que es parte esta unidad, por ejemplo, un departamento incluido en una organización formal más amplia. @es
label: unità di @it
sub property of: subOrganization of
label: es unidad de @es
type: ObjectProperty
label: unité de @fr
comment: Indica un Organization di cui questa Unit fa parte, come ad esempio un dipartimento all'interno di una più vasta FormalOrganization. È l'inverso di `org:hasUnit`. @it
range: Formal Organization
comment: Indique l'Organisation dont cette Organisation ou Unité fait partie, par exemple un Départment au sein d'une Organisation Formelle plus large. Inverse de `org:hasUnit`. @fr
comment: Indicates an Organization of which this Unit is a part, e.g. a Department within a larger FormalOrganization. This is the inverse of `org:hasUnit`.
domain: OrganizationalUnit
type: Property
range: Organization
range: Resource
range: Agent
range: http://lodlaundromat.org/.well-known/genid/samples/jena///class//4b28a6ea5a0560c5a3c2e6dec52272c0/218f3af31162c0199ca266130c18209c#14
range: http://lodlaundromat.org/.well-known/genid/samples/jena///class//4b28a6ea5a0560c5a3c2e6dec52272c0/218f3af31162c0199ca266130c18209c#11
domain: Organization
domain: Resource
domain: Agent
domain: http://lodlaundromat.org/.well-known/genid/samples/jena///class//4b28a6ea5a0560c5a3c2e6dec52272c0/218f3af31162c0199ca266130c18209c#14
domain: http://lodlaundromat.org/.well-known/genid/samples/jena///class//4b28a6ea5a0560c5a3c2e6dec52272c0/218f3af31162c0199ca266130c18209c#11

interoperability level
range: Thing
domain: Thing
type: Property
type: ObjectProperty
comment: Links an Asset to its adms:InteroperabilityLevel. Since this is encoded using skos:Concept, that is the defined range for this property.
domain: Asset
range: Concept
range: Resource
domain: Resource
domain: Dataset

Service
subclass of: Resource
member of: DCMIType
description: Examples include a photocopying service, a banking service, an authentication service, interlibrary loans, a Z39.50 or Web server.
has version: Service-003
issued: 2000-07-11
modified: 2008-01-14
type: Class
comment: A system that provides one or more functions.

is primary topic of
range: Thing
comment: A document that this thing is the primary topic of.
domain: Thing
sub property of: page
type: InverseFunctionalProperty
range: Document
type: Property
term status: stable
inverse of: primary topic
type: ObjectProperty
range: Resource
domain: Resource

Sound
subclass of: Resource
member of: DCMIType
description: Examples include a music playback file format, an audio compact disc, and recorded speech or sounds.
has version: Sound-003
issued: 2000-07-11
modified: 2008-01-14
type: Class
comment: A resource primarily intended to be heard.

primary Site
range: Thing
domain: Thing
comment: Indicates a primary site for the Organization, this is the default means by which an Organization can be contacted and is not necessarily the formal headquarters.
type: Property
label: tiene sede principal en @es
comment: Oficina principal de la organización, la opción por defecto para ponerse en contacto con una organización, aunque no corresponde necesariamente con las oficinas centrales de la organización. @es
comment: 組織の主要サイトを示します。組織の窓口となりえるデフォルトの手段ですが、正式な本部とは限りません。 @ja
comment: Indica la sede principale per l'Organization. È da considerarsi come la sede di default in cui l'Organization deve essere contattata pur non essendo necessariamente il quartier generale. @it
range: Site
label: site principal @fr
sub property of: has site
type: ObjectProperty
domain: Organization
comment: Indique le site principal d'une Organisation, le moyen par défaut par lequel l'Organisation peut être contactée et pas nécessairement le siège social légal. @fr
label: sede principale @it
range: Resource
domain: Resource
domain: Agent
domain: http://lodlaundromat.org/.well-known/genid/samples/jena///class//4b28a6ea5a0560c5a3c2e6dec52272c0/218f3af31162c0199ca266130c18209c#14
domain: http://lodlaundromat.org/.well-known/genid/samples/jena///class//4b28a6ea5a0560c5a3c2e6dec52272c0/218f3af31162c0199ca266130c18209c#11

Document
subclass of: Resource
subclass of: Thing
type: Class
comment: A document.
disjoint with: Organization
disjoint with: Project
term status: testing

Online Gaming Account
subclass of: Resource
subclass of: Thing
type: Class
comment: An online gaming account.
subclass of: Online Account
term status: unstable

sample
range: Thing
domain: Thing
type: Property
type: ObjectProperty
comment: Links to a sample of an Asset (which is itself an Asset).
domain: Asset
range: Asset
range: Resource
range: Dataset
domain: Resource
domain: Dataset

W3C/ERCIM
type: Thing

based At
range: Thing
domain: Thing
comment: Indicates the site at which a person is based. We do not restrict the possibility that a person is based at multiple sites.
domain: Person
label: basé à @fr
comment: 人が基礎としているサイトを示します。人が複数のサイトを基礎としている可能性を制限しません。 @ja
comment: Lugar en el que trabaja una persona. No se restringe el hecho de que una persona pueda estar adscrita a múltiples ubicaciones. @es
comment: Indique le site sur lequel une personne est basée. Nous ne limitons pas le nombre de sites sur lesquels une personne peut être basée. @fr
label: basata a @it
label: trabaja en la sede @es
comment: Indica la sede in cui una è stabilita una persona. Non esclude la possibilità che una persona sia allocata su più sedi. @it
range: Site
type: ObjectProperty
type: Property
range: Resource
domain: Agent
domain: Resource
domain: http://lodlaundromat.org/.well-known/genid/samples/jena///class//4b28a6ea5a0560c5a3c2e6dec52272c0/218f3af31162c0199ca266130c18209c#14
domain: SpatialThing
domain: http://lodlaundromat.org/.well-known/genid/samples/jena///class//4b28a6ea5a0560c5a3c2e6dec52272c0/218f3af31162c0199ca266130c18209c#11

Organization
subclass of: Resource
subclass of: Agent
subclass of: Organization
subclass of: Thing
has key: http://lodlaundromat.org/.well-known/genid/samples/jena///class//4b28a6ea5a0560c5a3c2e6dec52272c0/218f3af31162c0199ca266130c18209c#10
type: Class
comment: Représente un groupe de personnes organisées en communauté où tout autre forme de structure sociale, commerciale ou politique. Le groupe a un but commun ou une raison d'être qui va au-delà de la somme des personnes qui en font partie et peut agir en tant que "Agent". Les organisations sont souvent décomposables en structures hiérarchisées. Il est recommandé que des labels lexicaux SKOS soient utilisés pour nommer l'Organisation. En particulier `skos:prefLabel` pour le nom principal (en général le nom légal), `skos:altLabel` pour les noms alternatifs (marques, sigles, appellations familières) et `skos:notation` pour indiquer un code provenant d'une liste de code. @fr
disjoint with: Role
label: Organizzazione @it
label: Organisation @fr
comment: Grupo de personas que se organiza en una comunidad u otro tipo de estructura social, comercial o política. Dicho grupo tiene un objetivo o motivo común para su existencia que va más allá del conjunto de personas que lo forman y que puede actuar como “agente”. A menudo las organizaciones se pueden agrupar en estructuras jerárquicas. Se recomienda el uso de etiquetas de SKOS para denominar a cada “organización”. En concreto, `skos:prefLabel` para la denominación principal o recomendada (aquella reconocida legalmente, siempre que sea posible), `skos:altLabel` para denominaciones alternativas (nombre comercial, sigla, denominación por la que se conoce a la organización coloquialmente) y `skos:notation` para referirse al código que identifique a la organización en una lista de códigos. Denominaciones alternativas: _colectivo_ _corporación_ _grupo_ @es
comment: Rappresenta una collezione di persone organizzate all'interno di una communità o di una qualche struttura sociale, commerciale o politica. Il gruppo condivide un obiettivo o una ragione d'essere che va oltre gli stessi membri appartenenti al gruppo e può agire come un Agent. Le organizzazioni si possono spesso suddividere in strutture gerarchiche. Si raccomanda di usare le label per l'Organization mediante le proprietà di SKOS. In particolare, `skos:prefLabel` per il nome principale (possibilmente un nome legalmente riconosciuto)”, `skos:altLabel` come nome alternativo (denominazione commerciale, denominazione colloquiale) e `skos:notation` per indicare un codice di una lista di codici. @it
disjoint with: Change Event
comment: Represents a collection of people organized together into a community or other social, commercial or political structure. The group has some common purpose or reason for existence which goes beyond the set of people belonging to it and can act as an Agent. Organizations are often decomposable into hierarchical structures. It is recommended that SKOS lexical labels should be used to label the Organization. In particular `skos:prefLabel` for the primary (possibly legally recognized name), `skos:altLabel` for alternative names (trading names, colloquial names) and `skos:notation` to denote a code from a code list. Alternative names: _Collective_ _Body_ _Org_ _Group_
equivalent class: Organization
comment: コミュニティー、その他の社会、商業、政治的な構造に共に編入された人々の集合を表わします。グループには、そこに属する人々を超えた、存在に対するある共通の目的や理由があり、エージェント（代理）を務めることができます。組織は、多くの場合、階層構造に分割できます。 @ja
disjoint with: Membership
label: organización @es
disjoint with: Site
subclass of: http://lodlaundromat.org/.well-known/genid/samples/jena///class//4b28a6ea5a0560c5a3c2e6dec52272c0/218f3af31162c0199ca266130c18209c#14
subclass of: http://lodlaundromat.org/.well-known/genid/samples/jena///class//4b28a6ea5a0560c5a3c2e6dec52272c0/218f3af31162c0199ca266130c18209c#11

reports to
range: Thing
domain: Thing
label: riporta a @it
label: est subordonné à @fr
comment: Relación de subordinación que se representa en los organigramas de las organizaciones. La semántica de la relación de subordinación varía según las organizaciones, pero su intención es abarcar tanto a las relaciones de supervisión directa (por ejemplo, aquellas en las que la autoridad determina los objetivos o el salario) como a las relaciones de subordinación más generales (por ejemplo, las llamadas líneas de autoridad o de mando (y responsabilidad) (http://www.promonegocios.net/organigramas/tipos-de-organigramas.html)). @es
domain: http://lodlaundromat.org/.well-known/genid/samples/jena///class//4b28a6ea5a0560c5a3c2e6dec52272c0/218f3af31162c0199ca266130c18209c#11
type: ObjectProperty
label: responde ante @es
comment: 組織図で描かれるかもしれないような上下関係を示します。エージェント間またはエージェントが就くことができるポスト間の上下関係を直接的に示すために使用できます。 @ja
comment: Indica una relazione di subordinazione all'interno dell'organigramma. La semantica precisa può variare a seconda dell'organizzazione, per esempio può essere usata per rappresentare la proprietà di supervisione oppure per le relazioni di rendicontazione. @it
type: Property
comment: Indicates a reporting relationship as might be depicted on an organizational chart. The precise semantics of the reporting relationship will vary by organization but is intended to encompass both direct supervisory relationships (e.g. carrying objective and salary setting authority) and more general reporting or accountability relationships (e.g. so called _dotted line_ reporting).
range: http://lodlaundromat.org/.well-known/genid/samples/jena///class//4b28a6ea5a0560c5a3c2e6dec52272c0/218f3af31162c0199ca266130c18209c#14
comment: Indique une relation de subordination comme elle pourrait figurer dans un organigramme. La sémantique précise de cette subordination pourra varier selon l'Organisation mais vise à englober aussi bien les relations hiérarchiques directes (définition d'objectifs, montant du salaire) que des relations plus générales ou organisationnelles (les liens en pointillés dans les organigrammes). @fr
range: Resource
domain: Resource

Phil Archer
affiliation: W3C/ERCIM
type: Thing
type: Agent
type: http://lodlaundromat.org/.well-known/genid/samples/jena///class//4b28a6ea5a0560c5a3c2e6dec52272c0/218f3af31162c0199ca266130c18209c#14
made: Registered Organization Vocabulary
made: Asset Description Metadata Schema (ADMS)
type: http://lodlaundromat.org/.well-known/genid/samples/jena///class//4b28a6ea5a0560c5a3c2e6dec52272c0/218f3af31162c0199ca266130c18209c#11

registration
range: Thing
domain: Thing
type: Property
type: ObjectProperty
comment: The registration is a fundamental relationship between a legal entity and the authority with which it is registered and that confers legal status upon it. rov:registration is a sub property of adms:identifier which has a range of adms:Identifier. rov:registration has a domain of rov:RegisteredOrganization.
domain: Registered Organization
sub property of: identifier
range: Identifier
range: Resource
domain: Resource
domain: Agent
domain: Formal Organization
domain: http://lodlaundromat.org/.well-known/genid/samples/jena///class//4b28a6ea5a0560c5a3c2e6dec52272c0/218f3af31162c0199ca266130c18209c#14
domain: http://lodlaundromat.org/.well-known/genid/samples/jena///class//4b28a6ea5a0560c5a3c2e6dec52272c0/218f3af31162c0199ca266130c18209c#11
domain: Organization

has Unit
range: Thing
domain: Thing
domain: Formal Organization
type: ObjectProperty
label: contiene unidad @es
inverse of: unit Of
sub property of: has SubOrganization
comment: 例えば、より大きな組織内の部局など、この組織の一部である単位を示します。 @ja
comment: Indica un'unità che è parte di questa Organization, come ad esempio un dipartimento facente parte di una più ampia FormalOrganization. È l'inverso di `org:unitOf`. @it
label: ha Unit @it
label: possède une Unité @fr
comment: Indique une Unité qui fait partie d'une Organisation, par exemple un Départment au sein d'une Organisation Formelle plus large. Inverse de `org:unitOf`. @fr
comment: Indicates a unit which is part of this Organization, e.g. a Department within a larger FormalOrganization. Inverse of `org:unitOf`.
type: Property
comment: Unidad que es parte de la organización, como, por ejemplo, un departamento incluido en una organización formal más amplia. @es
range: OrganizationalUnit
range: Organization
range: Resource
range: Agent
range: http://lodlaundromat.org/.well-known/genid/samples/jena///class//4b28a6ea5a0560c5a3c2e6dec52272c0/218f3af31162c0199ca266130c18209c#14
range: http://lodlaundromat.org/.well-known/genid/samples/jena///class//4b28a6ea5a0560c5a3c2e6dec52272c0/218f3af31162c0199ca266130c18209c#11
domain: Organization
domain: Resource
domain: Agent
domain: http://lodlaundromat.org/.well-known/genid/samples/jena///class//4b28a6ea5a0560c5a3c2e6dec52272c0/218f3af31162c0199ca266130c18209c#14
domain: http://lodlaundromat.org/.well-known/genid/samples/jena///class//4b28a6ea5a0560c5a3c2e6dec52272c0/218f3af31162c0199ca266130c18209c#11

member of
range: Thing
domain: Thing
comment: Indique qu'une personne est membre de l'Organisation sans précision sur la nature de cet engagement ou du rôle joué. Notez que le choix du nom de cette propriété ne vise pas à la limiter aux seuls engagements formels, elle peut également couvrir des concepts reliés comme l'affiliation ou le bénévolat. Des extensions peuvent spécialiser cette relation pour indiquer des rôles particuliers au sein de l'Organisation or des relations plus nuancées avec elle. Possède une propriété inverse optionnelle, `org:hasmember`. @fr
label: membre de @fr
comment: Indicates that a person is a member of the Organization with no indication of the nature of that membership or the role played. Note that the choice of property name is not meant to limit the property to only formal membership arrangements, it is also indended to cover related concepts such as affilliation or other involvement in the organization. Extensions can specialize this relationship to indicate particular roles within the organization or more nuanced relationships to the organization. Has an optional inverse, `org:hasmember`.
comment: エージェント（人または他の組織）が組織のメンバーであることを示します。ただし、その構成員の本質や担う役割は示しません。プロパティー名の選択は、プロパティーを正式な構成員配置のみに制限することが目的ではないことに注意してください。所属や組織へのその他の関与などの関連する概念をカバーすることも意図されています。拡張により、この関係を特殊化し、組織内の特定の役割やよりニュアンスを含んだ組織との関係を示すことができます。 @ja
label: es miembro de @es
type: Property
type: ObjectProperty
comment: Indica che una persona è membro di una Organization senza una precisa indicazione sulla natura di questa appartenenza e sul suo ruolo. Si noti che la scelta del nome di questa proprietà non intende limitarla alla sola rappresentazione formalmente di un'appartenenza. La proprietà può coprire anche altri coinvolgimenti nell'organizzazione. Questa proprietà può essere specializzata per indicare ruoli all'interno organizzazione o relazioni di diverse tipologie. Ha `org:hasmember` come proprietà inversa opzionale. @it
label: membro di @it
range: Organization
domain: Agent
inverse of: has member
comment: Persona que pertenece a la organización o es miembro de la misma, sin que conste la naturaleza de dicha pertenencia o el papel que desempeña. Se debe tener en cuenta que la elección de una denominación para esta propiedad no significa que la propiedad esté limitada a ciertos tipos de pertenencia formales, sino que pretende cubrir conceptos relacionados como el de afiliación u otras formas de participación en la organización. Se puede hacer uso de extensiones para especializar esta relación de forma que incluya tipos específicos de pertenencia a las organizaciones o relaciones especiales con la organización. @es
range: http://lodlaundromat.org/.well-known/genid/samples/jena///class//4b28a6ea5a0560c5a3c2e6dec52272c0/218f3af31162c0199ca266130c18209c#14
range: Agent
range: http://lodlaundromat.org/.well-known/genid/samples/jena///class//4b28a6ea5a0560c5a3c2e6dec52272c0/218f3af31162c0199ca266130c18209c#11
range: Resource
domain: Resource
domain: http://lodlaundromat.org/.well-known/genid/samples/jena///class//4b28a6ea5a0560c5a3c2e6dec52272c0/218f3af31162c0199ca266130c18209c#14
domain: http://lodlaundromat.org/.well-known/genid/samples/jena///class//4b28a6ea5a0560c5a3c2e6dec52272c0/218f3af31162c0199ca266130c18209c#11

Dataset
subclass of: Resource
member of: DCMIType
description: Examples include lists, tables, and databases. A dataset may be useful for direct machine processing.
has version: Dataset-003
issued: 2000-07-11
modified: 2008-01-14
type: Class
comment: Data encoded in a defined structure.

workplace homepage
range: Thing
domain: Thing
type: Property
type: ObjectProperty
comment: A workplace homepage of some person; the homepage of an organization they work for.
domain: Person
range: Document
term status: testing
range: Resource
domain: Agent
domain: Resource
domain: http://lodlaundromat.org/.well-known/genid/samples/jena///class//4b28a6ea5a0560c5a3c2e6dec52272c0/218f3af31162c0199ca266130c18209c#14
domain: SpatialThing
domain: http://lodlaundromat.org/.well-known/genid/samples/jena///class//4b28a6ea5a0560c5a3c2e6dec52272c0/218f3af31162c0199ca266130c18209c#11

transitive sub-organization
range: Thing
domain: Thing
comment: subOrganizationOfの推移閉包で、これを含むすべての組織の表現を与える。技術的に、これが推移閉包のスーパープロパティーであるため、追加の言明を含むことができますが、そのような使用法はお勧めできないことに注意してください。 @ja
type: TransitiveProperty
label: es suborganización de manera transitiva de @es
domain: Organization
comment: È la chiusura transitiva di subOrganizationOf, quindi rappresenta tutte le organizzazioni che la contengono. Tecnicamente, essendo una chiusura transitiva, può contenere asserzioni che non la riguardano e quindi il suo uso è sconsigliato. @it
comment: La versión transitiva de la propiedad “subOrganizationOf”, es decir, la representación de todas las organizaciones en las que esta está contenida. Téngase en cuenta que desde el punto de vista técnico esta es una propiedad que contiene a todas las propiedades transitivas, de forma que podría contener afirmaciones adicionales, aunque su uso no está aconsejado. @es
label: es suborganización de (transitiva) @es
comment: La version transitive de la propriété subOrganizationOf, renvoie une représentation de toutes les organisations qui contiennent celle-ci. Notez que ceci est une super-propriété de la relation transitive donc elle pourrait contenir des assertions additionnelles mais cet usage n'est pas recommandé. @fr
label: sotto-Organization transitiva @it
comment: The transitive closure of subOrganizationOf, giving a representation of all organizations that contain this one. Note that technically this is a super property of the transitive closure so it could contain additional assertions but such usage is discouraged.
type: ObjectProperty
label: sous-Organization transitive de @fr
type: Property
range: Organization
range: http://lodlaundromat.org/.well-known/genid/samples/jena///class//4b28a6ea5a0560c5a3c2e6dec52272c0/218f3af31162c0199ca266130c18209c#14
range: Agent
range: http://lodlaundromat.org/.well-known/genid/samples/jena///class//4b28a6ea5a0560c5a3c2e6dec52272c0/218f3af31162c0199ca266130c18209c#11
range: Resource
domain: Agent
domain: Resource
domain: http://lodlaundromat.org/.well-known/genid/samples/jena///class//4b28a6ea5a0560c5a3c2e6dec52272c0/218f3af31162c0199ca266130c18209c#14
domain: http://lodlaundromat.org/.well-known/genid/samples/jena///class//4b28a6ea5a0560c5a3c2e6dec52272c0/218f3af31162c0199ca266130c18209c#11

personal mailbox
domain: Thing
type: Property
type: InverseFunctionalProperty
type: ObjectProperty
comment: A personal mailbox, ie. an Internet mailbox associated with exactly one owner, the first owner of this mailbox. This is a 'static inverse functional property', in that there is (across time and change) at most one individual that ever has any particular value for foaf:mbox.
domain: Agent
range: Thing
term status: stable
range: Resource
domain: Resource
domain: http://lodlaundromat.org/.well-known/genid/samples/jena///class//4b28a6ea5a0560c5a3c2e6dec52272c0/218f3af31162c0199ca266130c18209c#14
domain: http://lodlaundromat.org/.well-known/genid/samples/jena///class//4b28a6ea5a0560c5a3c2e6dec52272c0/218f3af31162c0199ca266130c18209c#11

focus
domain: Thing
type: Property
type: ObjectProperty
comment: The underlying or 'focal' entity associated with some SKOS-described concept.
domain: Concept
range: Thing
term status: testing
range: Resource
domain: Resource

openid
sub property of: page
range: Thing
domain: Thing
range: Document
type: ObjectProperty
term status: testing
type: Property
domain: Agent
type: InverseFunctionalProperty
sub property of: is primary topic of
comment: An OpenID for an Agent.
range: Resource
domain: Resource
domain: http://lodlaundromat.org/.well-known/genid/samples/jena///class//4b28a6ea5a0560c5a3c2e6dec52272c0/218f3af31162c0199ca266130c18209c#14
domain: http://lodlaundromat.org/.well-known/genid/samples/jena///class//4b28a6ea5a0560c5a3c2e6dec52272c0/218f3af31162c0199ca266130c18209c#11

Asset
subclass of: Resource
type: Class
comment: An Asset is an abstract entity that reflects the intellectual content of the asset and represents those characteristics of the asset that are independent of its physical embodiment. This abstract entity combines the FRBR entities work (a distinct intellectual or artistic creation) and expression (the intellectual or artistic realization of a work). Assets can be versioned. Every time the intellectual content of an asset changes, the result is considered to be a new asset that can be linked to previous and next versions of the Asset. The physical embodiment of an Asset is called an Asset Distribution. A particular Asset may have zero or more Asset Distributions.
subclass of: Dataset

role
range: Thing
domain: Thing
label: rôle @fr
comment: Indica il Role che un Agent ricopre in una relazione di Membership con una Organization @it
type: Property
type: ObjectProperty
comment: Actividad que el agente desempeña en una relación de pertenencia a una organización. @es
label: desempeña la actividad de @es
label: ruolo @it
comment: Indicates the Role that the Agent plays in a Membership relationship with an Organization.
range: Role
comment: Indique le Rôle de l'Agent dans son Engagement avec l'Organisation. @fr
domain: http://lodlaundromat.org/.well-known/genid/samples/jena///class//4b28a6ea5a0560c5a3c2e6dec52272c0/218f3af31162c0199ca266130c18209c#17
comment: エージェントが組織との構成員関係において担う役割を示します。ポストの保持者が担う役割を示すためにorg:Postで用いることもできます。 @ja
range: Concept
range: Resource
domain: Resource

has member
range: Thing
domain: Thing
sub property of: member
comment: Indicates a person who is a member of the subject Organization. Inverse of `org:memberOf`, see that property for further clarification. Provided for compatibility with `foaf:member`.
label: tiene miembro @es
type: ObjectProperty
label: ha membro @it
domain: Organization
inverse of: member of
equivalent property: member
type: Property
comment: 対象組織のメンバーであるエージェント（人または他の組織）を示します。org:memberOfの逆。さらに明確な説明については、そのプロパティーを参照してください。 @ja
range: Agent
comment: Indique une personne membre de l'Organisation sujet. Inverse de `org:memberOf`, voyez la description de cette propriété pour plus de précisions. Fourni pour la compatibilité avec `foaf:member`. @fr
label: possède un membre @fr
comment: Persona que es miembro de la organización en cuestión. Es la relación inversa de `org:memberOf`, véase la descripción de esa propiedad para más detalles. Se prevé compatibilidad con foaf:member`. @es
comment: Indica una persona che è membro della data Organization. È l'inverso di `org:memberOf` ed è fornita per compatibilità con `foaf:member`. @it
range: Resource
range: http://lodlaundromat.org/.well-known/genid/samples/jena///class//4b28a6ea5a0560c5a3c2e6dec52272c0/218f3af31162c0199ca266130c18209c#11
range: http://lodlaundromat.org/.well-known/genid/samples/jena///class//4b28a6ea5a0560c5a3c2e6dec52272c0/218f3af31162c0199ca266130c18209c#14
domain: Group
domain: Resource
domain: Agent
domain: http://lodlaundromat.org/.well-known/genid/samples/jena///class//4b28a6ea5a0560c5a3c2e6dec52272c0/218f3af31162c0199ca266130c18209c#14
domain: http://lodlaundromat.org/.well-known/genid/samples/jena///class//4b28a6ea5a0560c5a3c2e6dec52272c0/218f3af31162c0199ca266130c18209c#11

Online E-commerce Account
subclass of: Resource
subclass of: Thing
type: Class
comment: An online e-commerce account.
subclass of: Online Account
term status: unstable

Group
subclass of: Resource
subclass of: Thing
subclass of: Agent
type: Class
comment: A class of Agents.
term status: stable
subclass of: http://lodlaundromat.org/.well-known/genid/samples/jena///class//4b28a6ea5a0560c5a3c2e6dec52272c0/218f3af31162c0199ca266130c18209c#14
subclass of: http://lodlaundromat.org/.well-known/genid/samples/jena///class//4b28a6ea5a0560c5a3c2e6dec52272c0/218f3af31162c0199ca266130c18209c#11

next
range: Thing
domain: Thing
type: Property
type: ObjectProperty
comment: A link to the next version of the Asset.
sub property of: next
range: Resource
domain: Resource

supported schema
range: Thing
domain: Thing
type: Property
type: ObjectProperty
comment: A schema according to which the Asset Repository can provide data about its content, e.g. ADMS
range: Asset
range: Resource
range: Dataset
domain: Resource

prev
range: Thing
domain: Thing
type: Property
type: ObjectProperty
comment: A link to the previous version of the Asset.
sub property of: prev
range: Resource
domain: Resource

company type
range: Thing
domain: Thing
type: Property
type: ObjectProperty
comment: This property records the type of organization. Familiar types are SA, PLC, LLC, GmbH etc. Each jurisdiction will have a limited set of recognized company types and these should be used in a consistent manner using a SKOS Concept Scheme. rov:orgType is a sub class of org:classification which has a range of skos:Concept.
sub property of: classification
range: Concept
range: Resource
domain: Organization
domain: Resource
domain: Agent
domain: http://lodlaundromat.org/.well-known/genid/samples/jena///class//4b28a6ea5a0560c5a3c2e6dec52272c0/218f3af31162c0199ca266130c18209c#14
domain: http://lodlaundromat.org/.well-known/genid/samples/jena///class//4b28a6ea5a0560c5a3c2e6dec52272c0/218f3af31162c0199ca266130c18209c#11

Endeavour
subclass of: Organization
subclass of: Resource
subclass of: Thing
subclass of: http://lodlaundromat.org/.well-known/genid/samples/jena///class//4b28a6ea5a0560c5a3c2e6dec52272c0/218f3af31162c0199ca266130c18209c#20
comment: プロジェクトなどの2つ以上の組織間のコラボレーション。それは、アイデンティティを有し、その特定のメンバーとは無関係に目的を定めているという点で、組織としての基準を満たしますが、正式に認識された法的実体でも、あるより大きな組織内のサブユニットでもありません。一般的には、その内部の組織よりも存続期間が短いかもしれませんが、必ずしもそうとは限りません。 @ja
comment: Une collaboration entre deux ou plusieurs Organisations, telle qu'un projet commun. Un partenariat peut être considéré comme Organisation dans le sens ou il possède une identité et un But propre indépendant de ceux de ses membres, mais ce n'est ni une entité légale ni une sous-unité d'une Organisation plus grande. Typiquement, elle peut avoir une durée de vie plus courte que les Organisations qui la composent, mais pas nécessairement. Tous les membres sont des `org:Organization`s plutôt que des individus et ces Organisations peuvent jouer des Rôles particuliers au sein du Partenariat. @fr
comment: Colaboración determinada entre dos o más organizaciones, como en el caso de un proyecto común. Cumple con los criterios de ser una organización en sí misma, en la medida en que tiene una identidad y un propósito definido independiente de sus miembros en particular, pero no es una entidad legal formalmente reconocida ni una sub-unidad dentro de una organización más grande. La duración suele ser más corta que la de las organizaciones que lo componen, pero no necesariamente. Todos sus miembros son de tipo `org:Organization` en vez de individuos, y desempeñan una actividad concreta en el marco del proyecto de cooperación. @es
type: Class
label: Partenariat @fr
comment: È una collaborazione tra due o più Organization come ad esempio un progetto. Consente di rappresentare alcune identità dell'Organization che sono fuori dallo scopo principale e non sono formalmente riconosciute. Potrebbe anche avere un ciclo di vita limitato. @it
label: Collaborazione @it
label: proyecto de cooperación empresarial @es
equivalent class: http://lodlaundromat.org/.well-known/genid/samples/jena///class//4b28a6ea5a0560c5a3c2e6dec52272c0/218f3af31162c0199ca266130c18209c#20
comment: A collaboration between two or more Organizations such as a project. It meets the criteria for being an Organization in that it has an identity and defining purpose independent of its particular members but is neither a formally recognized legal entity nor a sub-unit within some larger organization. Might typically have a shorter lifetime than the Organizations within it, but not necessarily. All members are `org:Organization`s rather than individuals and those Organizations can play particular roles within the venture. Alternative names: _Project_ _Venture_ _Endeavour_ _Consortium_ _Endeavour_
subclass of: http://lodlaundromat.org/.well-known/genid/samples/jena///class//4b28a6ea5a0560c5a3c2e6dec52272c0/218f3af31162c0199ca266130c18209c#23
subclass of: Agent
subclass of: http://lodlaundromat.org/.well-known/genid/samples/jena///class//4b28a6ea5a0560c5a3c2e6dec52272c0/218f3af31162c0199ca266130c18209c#11
subclass of: http://lodlaundromat.org/.well-known/genid/samples/jena///class//4b28a6ea5a0560c5a3c2e6dec52272c0/218f3af31162c0199ca266130c18209c#14

OrganizationalUnit
subclass of: Organization
subclass of: Resource
subclass of: Thing
comment: An Organization such as a University Support Unit which is part of some larger FormalOrganization and only has full recognition within the context of that FormalOrganization, it is not a Legal Entity in its own right. Units can be large and complex containing other Units and even FormalOrganizations. Alternative names: _OU_ _Unit_ _Department_
comment: あるより大きな組織の一部であり、その組織の中においてのみ完全に認識される部局や支援部署などの組織です。特に、その単位はそれ自体では法的実体と見なされません。 @ja
comment: Organización que forma parte de una organización formal más amplia, como el servicio de informática o centro de cálculo de una universidad, y que sólo tiene reconocimiento pleno en el contexto de dicha organización formal, pero que no es una entidad legal propiamente dicha. Estas unidades pueden ser amplias y complejas, e incluir a otras unidades o incluso a otras organizaciones formales. Denominaciones alternativas: departamento. @es
label: unidad organizativa @es
comment: Un'organizzazione come ad esempio l'unità dei sistemi informativi che è parte di una più grande FormalOrganization e che, pur essendo riconosciuta nel contesto della propria organizzazione di riferimento, non è legalmente riconosciuta come entità a sé stante. Le unità possono essere ampie e complesse e contenere al loro interno sia altre unità che addirittura FormalOrganization. @it
comment: Une organisation telle que le support informatique d'une université, qui fait partie d'une Organisation Formelle plus importante et qui ne peut être reconnue qu'en tant que membre de cette organisation supérieure, ce n'est pas une entité légale en elle-même. Les unités opérationnelles peuvent être étendues, complexes et inclure elles-mêmes d'autres branches ou Unités Opérationnelles, voire des Organisations Formelles. @fr
label: Unité opérationnelle @fr
type: Class
label: Unità Organizzativa @it
subclass of: Agent
subclass of: http://lodlaundromat.org/.well-known/genid/samples/jena///class//4b28a6ea5a0560c5a3c2e6dec52272c0/218f3af31162c0199ca266130c18209c#11
subclass of: http://lodlaundromat.org/.well-known/genid/samples/jena///class//4b28a6ea5a0560c5a3c2e6dec52272c0/218f3af31162c0199ca266130c18209c#14

Address
subclass of: Resource
type: Class
comment: An "address representation" as conceptually defined by the INSPIRE Address Representation data type. The locn:addressId property may be used to link this locn:Address to other representations.
describedby: Core Vocabularies Specification
term status: testing

translation
range: Thing
domain: Thing
type: Property
type: ObjectProperty
comment: Links Assets that are translations of each other.
range: Resource
domain: Resource

Agent
subclass of: http://lodlaundromat.org/.well-known/genid/samples/jena///class//4b28a6ea5a0560c5a3c2e6dec52272c0/218f3af31162c0199ca266130c18209c#11
subclass of: http://lodlaundromat.org/.well-known/genid/samples/jena///class//4b28a6ea5a0560c5a3c2e6dec52272c0/218f3af31162c0199ca266130c18209c#14
subclass of: Thing
subclass of: Resource
subclass of: Agent
type: Class
comment: An agent (eg. person, group, software or physical artifact).
equivalent class: Agent
term status: stable

Label Property
subclass of: Resource
subclass of: Thing
type: Class
comment: A foaf:LabelProperty is any RDF property with texual values that serve as labels.
term status: unstable

Membership
subclass of: http://lodlaundromat.org/.well-known/genid/samples/jena///class//4b28a6ea5a0560c5a3c2e6dec52272c0/218f3af31162c0199ca266130c18209c#17
subclass of: Resource
subclass of: Thing
disjoint with: Change Event
comment: Indicates the nature of an Agent's membership of an organization. Represents an n-ary relation between an Agent, an Organization and a Role. It is possible to directly indicate membership, independent of the specific Role, through use of the `org:memberOf` property.
label: Appartenenza @it
label: Engagement @fr
type: Class
comment: Pertenencia o afiliación de un agente a una organización. Es una relación n-aria entre un agente, una organización y una actividad. Es posible indicar pertenencia mediante el uso de la propiedad `org:memberOf`, independientemente de la actividad específica que se desempeñe. @es
comment: Indica la natura della relazione di appartenenza di un Agent in un'organizzazione. Rappresenta una relazione n-aria tra un'Agent, un Organization e un Role. È possibile indicare direttamente la membership, indipendentemente dallo specifico Role, attraverso l'uso della proprietà `org:memberOf` @it
comment: 組織のエージェントの構成員の本質を示します。 @ja
disjoint with: Site
comment: Indique la nature de l'engagement d'un Agent dans une Organisation. Représente une relation n-aire entre un Agent, une Organisation et un Role. Il est possible d'indiquer directement l'appartenance à une organisation, independemment d'un rôle spécifique, à travers l'usage de la propriété `org:memberOf`. @fr
label: membresía @es
disjoint with: Organization
disjoint with: Role

held by
range: Thing
domain: Thing
inverse of: holds
comment: Indicates an Agent which holds a Post.
domain: Post
comment: Indica un Agent che ricopre un Post. @it
label: ocupado por @es
type: ObjectProperty
comment: Agente que ocupa un puesto. @es
label: occupé par @fr
range: Agent
type: Property
comment: Indicate un Agent qui occupe le Poste. @fr
comment: ポストを保持するエージェントを示します。 @ja
label: ricoperto da @it
range: http://lodlaundromat.org/.well-known/genid/samples/jena///class//4b28a6ea5a0560c5a3c2e6dec52272c0/218f3af31162c0199ca266130c18209c#11
range: Resource
range: http://lodlaundromat.org/.well-known/genid/samples/jena///class//4b28a6ea5a0560c5a3c2e6dec52272c0/218f3af31162c0199ca266130c18209c#14
domain: http://lodlaundromat.org/.well-known/genid/samples/jena///class//4b28a6ea5a0560c5a3c2e6dec52272c0/218f3af31162c0199ca266130c18209c#17
domain: Resource
domain: http://lodlaundromat.org/.well-known/genid/samples/jena///class//4b28a6ea5a0560c5a3c2e6dec52272c0/218f3af31162c0199ca266130c18209c#14
domain: http://lodlaundromat.org/.well-known/genid/samples/jena///class//4b28a6ea5a0560c5a3c2e6dec52272c0/218f3af31162c0199ca266130c18209c#11

European Commission, Joint Research Centre
type: Thing

Organization
subclass of: Organization
subclass of: Agent
subclass of: Resource
subclass of: Thing
type: Class
comment: An organization.
disjoint with: Person
disjoint with: Document
term status: stable
subclass of: http://lodlaundromat.org/.well-known/genid/samples/jena///class//4b28a6ea5a0560c5a3c2e6dec52272c0/218f3af31162c0199ca266130c18209c#14
subclass of: http://lodlaundromat.org/.well-known/genid/samples/jena///class//4b28a6ea5a0560c5a3c2e6dec52272c0/218f3af31162c0199ca266130c18209c#11
equivalent class: Organization

classification
range: Thing
domain: Thing
type: ObjectProperty
comment: Indica una classificazione per questa Organization all'interno di un qualche schema di classificazione. Alcuni vocabolari potrebbero voler specializzare questa proprietà per avere un codominio corrispondente a uno specifico `skos:ConceptScheme`. Si noti che la presenza di questa proprietà è ancora in fase di discussione e potrebbe essere revisionata o rimossa. @it
type: Property
comment: ある分類表内のこの組織に対する分類を示します。 アプリケーションがorg:Organizationのサブクラスを組織的なカテゴリーを表わす手段として定義することも許容されることに注意してください。 @ja
label: classificazione @it
comment: Indique une classification pour cette Organisation dans le cadre d'un schéma de classification. Il est possible de spécialiser cette propriété en utilisant un vocabulaire spécialisé pour que le champ corresponde à un concept spécifique `skos:ConceptScheme`. Cette propriété est en discussion est pourrait être révisée ou supprimée - dans de nombreux cas, les organisations sont mieux catégorisées par une hiérarchie de sous-classe dans un vocabulaire externe. @fr
label: pertenece a la clasificación @es
range: Concept
comment: Ordenación jerárquica que se hace de una organización dentro de un esquema de clasificación. Es posible que algunos vocabularios especifiquen esta propiedad de forma que el rango se corresponda con un `skos:ConceptScheme` específico. La conveniencia de incluir esta propiedad se está debatiendo y puede que se revise o elimine (en muchos casos las organizaciones se clasifican mejor si se define una jerarquía de subclases en un vocabulario aparte) @es
comment: Indicates a classification for this Organization within some classification scheme. Extension vocabularies may wish to specialize this property to have a range corresponding to a specific `skos:ConceptScheme`. This property is under discussion and may be revised or removed - in many cases organizations are best categorized by defining a sub-class hierarchy in an extension vocabulary.
domain: Organization
range: Resource
domain: Agent
domain: Resource
domain: http://lodlaundromat.org/.well-known/genid/samples/jena///class//4b28a6ea5a0560c5a3c2e6dec52272c0/218f3af31162c0199ca266130c18209c#14
domain: http://lodlaundromat.org/.well-known/genid/samples/jena///class//4b28a6ea5a0560c5a3c2e6dec52272c0/218f3af31162c0199ca266130c18209c#11

publications
range: Thing
domain: Thing
type: Property
type: ObjectProperty
comment: A link to the publications of this person.
domain: Person
range: Document
term status: testing
range: Resource
domain: Agent
domain: Resource
domain: http://lodlaundromat.org/.well-known/genid/samples/jena///class//4b28a6ea5a0560c5a3c2e6dec52272c0/218f3af31162c0199ca266130c18209c#14
domain: SpatialThing
domain: http://lodlaundromat.org/.well-known/genid/samples/jena///class//4b28a6ea5a0560c5a3c2e6dec52272c0/218f3af31162c0199ca266130c18209c#11

image
range: Thing
domain: Thing
type: Property
type: ObjectProperty
comment: An image that can be used to represent some thing (ie. those depictions which are particularly representative of something, eg. one's photo on a homepage).
domain: Person
range: Image
sub property of: depiction
term status: testing
range: Resource
range: Document
domain: Resource
domain: Agent
domain: http://lodlaundromat.org/.well-known/genid/samples/jena///class//4b28a6ea5a0560c5a3c2e6dec52272c0/218f3af31162c0199ca266130c18209c#14
domain: SpatialThing
domain: http://lodlaundromat.org/.well-known/genid/samples/jena///class//4b28a6ea5a0560c5a3c2e6dec52272c0/218f3af31162c0199ca266130c18209c#11

last
range: Thing
domain: Thing
type: Property
type: ObjectProperty
comment: A link to the current or latest version of the Asset.
sub property of: last
range: Resource
domain: Resource

Andrea Perego
affiliation: European Commission, Joint Research Centre
type: Thing
type: Agent
type: http://lodlaundromat.org/.well-known/genid/samples/jena///class//4b28a6ea5a0560c5a3c2e6dec52272c0/218f3af31162c0199ca266130c18209c#14
made: Registered Organization Vocabulary
made: Asset Description Metadata Schema (ADMS)
type: http://lodlaundromat.org/.well-known/genid/samples/jena///class//4b28a6ea5a0560c5a3c2e6dec52272c0/218f3af31162c0199ca266130c18209c#11

work info homepage
range: Thing
domain: Thing
type: Property
type: ObjectProperty
comment: A work info homepage of some person; a page about their work for some organization.
domain: Person
range: Document
term status: testing
range: Resource
domain: Agent
domain: Resource
domain: http://lodlaundromat.org/.well-known/genid/samples/jena///class//4b28a6ea5a0560c5a3c2e6dec52272c0/218f3af31162c0199ca266130c18209c#14
domain: SpatialThing
domain: http://lodlaundromat.org/.well-known/genid/samples/jena///class//4b28a6ea5a0560c5a3c2e6dec52272c0/218f3af31162c0199ca266130c18209c#11

PersonalProfileDocument
subclass of: Resource
subclass of: Thing
type: Class
comment: A personal profile RDF document.
subclass of: Document
term status: testing

representation technique
range: Thing
domain: Thing
type: Property
type: ObjectProperty
comment: Links an adms:AssetDistribution to a skos:Concept that is its adms:RepresentationTechnique.
range: Concept
range: Resource
domain: Resource

registered Site
sub property of: has site
range: Thing
domain: Thing
comment: 組織の法律上登録されたサイトを示し、多くの法的管轄区域では、会社や慈善団体などのFormalOrganizations（正式な組織）がそのような主要サイトを持っているという要件があります。 @ja
type: ObjectProperty
label: sede legale @it
range: Site
label: tiene sede registrada en @es
comment: Indica la sede legale per l'Organization. In molte giurisdizioni è richiesto che una FormalOrganization abbia una sede di questo tipo. @it
comment: Indique l'établissement principal légalement enregistré pour l'Organisation. Dans de nombreuses juridictions existe l'obligation pour une Organisation Formelle d'avoir un tel site principal. @fr
comment: Indicates the legally registered site for the organization, in many legal jurisdictions there is a requirement that FormalOrganizations such as Companies or Charities have such a primary designed site.
comment: Oficina o sede legalmente registrada de la organización. En muchas jurisdicciones legales existe el requisito de que organizaciones formales tales como empresas u organizaciones de beneficencia tengan una sede principal de este tipo. @es
sub property of: primary Site
type: Property
domain: Formal Organization
label: siège social @fr
range: Resource
domain: Organization
domain: Resource
domain: Agent
domain: http://lodlaundromat.org/.well-known/genid/samples/jena///class//4b28a6ea5a0560c5a3c2e6dec52272c0/218f3af31162c0199ca266130c18209c#14
domain: http://lodlaundromat.org/.well-known/genid/samples/jena///class//4b28a6ea5a0560c5a3c2e6dec52272c0/218f3af31162c0199ca266130c18209c#11

Software
subclass of: Resource
member of: DCMIType
description: Examples include a C source file, MS-Windowsexe executable, or Perl script.
has version: Software-003
issued: 2000-07-11
modified: 2008-01-14
type: Class
comment: A computer program in source or compiled form.

primary topic
domain: Thing
domain: Document
type: FunctionalProperty
range: Thing
type: Property
term status: stable
type: ObjectProperty
comment: The primary topic of some page or document.
inverse of: is primary topic of
range: Resource
domain: Resource

based near
range: Thing
domain: Thing
type: Property
type: ObjectProperty
comment: A location that something is based near, for some broadly human notion of near.
domain: SpatialThing
range: SpatialThing
term status: testing
range: Resource
domain: Resource

resulted from
range: Thing
domain: Thing
type: Property
comment: Indica l'evento che ha permesso all'organizzazione di instaurarsi. È l'inverso di `org:resultingOrganization`. @it
comment: Indique un évènement dont est issue l'Organisation. Inverse de `org:resultingOrganization`. @fr
comment: Indicates an event which resulted in this organization. Inverse of `org:resultingOrganization`.
comment: この組織になった（導いた、作成された）きっかけとなった出来事を示します。 @ja
domain: Organization
label: es el resultado de @es
sub property of: wasGeneratedBy
range: Change Event
type: ObjectProperty
label: issue de @fr
label: risultato da @it
comment: Evento que tiene como resultado la creación de una organización. @es
inverse of: resulted in
range: Resource
range: Activity
domain: Agent
domain: Resource
domain: http://lodlaundromat.org/.well-known/genid/samples/jena///class//4b28a6ea5a0560c5a3c2e6dec52272c0/218f3af31162c0199ca266130c18209c#14
domain: http://lodlaundromat.org/.well-known/genid/samples/jena///class//4b28a6ea5a0560c5a3c2e6dec52272c0/218f3af31162c0199ca266130c18209c#11

Site
subclass of: Thing
subclass of: Resource
comment: 組織が位置するオフィスやその他の敷地。多くの組織が複数のサイトに散在しており、多くのサイトが多数の場所を持つでしょう。 @ja
comment: Oficina, local o cualquier otro lugar en el que se encuentra una organización. Muchas organizaciones están distribuidas en varias sedes, que a su vez están repartidas en distintas ubicaciones. En muchos casos una sede será un sitio o local físico. Sin embargo, no se excluye la posibilidad de lugares no físicos como oficinas virtuales con los correspondientes apartados de correo y servicio de atención telefónica. Se pueden añadir más subtipos mediante extensiones para incluir tipos especiales de lugares. @es
comment: Un ufficio o altra sede dovei l'organizzazione è situata. Molte organizzazione sono distribuite su più sedi e molte sedi ospitano più ubicazioni. Nella maggior parte dei casi un Site è una locazione fisica. Non si esclude la possibilità di indicare sedi non fisiche come ad esempio gli uffici virtuali. Le estensioni dell'ontologia potrebbero usare delle sottoclassi per rappresentare i tipi particolari di sede. @it
comment: An office or other premise at which the organization is located. Many organizations are spread across multiple sites and many sites will host multiple locations. In most cases a Site will be a physical location. However, we don't exclude the possibility of non-physical sites such as a virtual office with an associated post box and phone reception service. Extensions may provide subclasses to denote particular types of site.
comment: Un établissement ou tout autre lieu dans lequel une Organisation est localisé. Beaucoup d'organisations sont dispersées à travers plusieurs sites. Dans la plupart des cas un Site sera un lieu physique. Toutefois, nous n'excluons pas la possibilité de sites non-physiques comme un bureau virtuel avec une boîte postale et un service de secrétariat mutualisé. Des extensions pourraient fournir des sous-classes pour décrire des types de sites particuliers. @fr
type: Class
label: Sede @it
label: sede @es
disjoint with: Change Event
disjoint with: Role
disjoint with: Membership
disjoint with: Organization

Registered Organization
subclass of: Resource
subclass of: Thing
type: Class
comment: rov:RegisteredOrganization is the key class for the Registered Organization vocabulary and represents an organization that is legally registered. In many countries there is a single registry although in others, such as Spain and Germany, multiple registries exist. A Registered Organization is able to trade, is legally liable for its actions, accounts, tax affairs etc. Legal entity status is conferred by the act of registration cf. org:FormalOrganization that applies to any legal entity, including those created by other legal means. This makes registered organizations distinct from the broader concept of organizations, groups or, in some jurisdictions, sole traders. Many organizations exist that are not legal entities yet to the outside world they have staff, hierarchies, locations etc. Other organizations exist that are an umbrella for several legal entities (universities are often good examples of this). This vocabulary is concerned solely with registered organizations. In RDF, Registered Organization is a sub class of the Organization Ontology's org:FormalOrganization which is itself a sub class of the more general 'Agent' class found in FOAF and Dublin Core that does encompass organizations, natural persons, groups etc. - i.e. an Agent is any entity that is able to carry out actions.
subclass of: Formal Organization
subclass of: Agent
subclass of: http://lodlaundromat.org/.well-known/genid/samples/jena///class//4b28a6ea5a0560c5a3c2e6dec52272c0/218f3af31162c0199ca266130c18209c#11
subclass of: http://lodlaundromat.org/.well-known/genid/samples/jena///class//4b28a6ea5a0560c5a3c2e6dec52272c0/218f3af31162c0199ca266130c18209c#14
subclass of: Organization

account service homepage
range: Thing
domain: Thing
type: Property
type: ObjectProperty
comment: Indicates a homepage of the service provide for this online account.
domain: Online Account
range: Document
term status: testing
range: Resource
domain: Resource

page
range: Thing
type: Property
type: ObjectProperty
comment: A page or document about this thing.
domain: Thing
range: Document
inverse of: topic
term status: testing
range: Resource
domain: Resource

Role
subclass of: Resource
subclass of: Thing
label: Rôle @fr
disjoint with: Change Event
subclass of: Concept
comment: 人またはその他のエージェントが組織で担うことができる役割を表わします。この種のインスタンスは、抽象的な役割を記述します。特定の組織でその役割を担っている人の特定のインスタンスを示すためには、org:Membershipのインスタンスを使用します。 @ja
comment: Indica il ruolo che una Person o un altro Agent può assumere in un'organizzazione. Le istanze di questa classe descrivono un ruolo astratto; per esprimere il ruolo che una precisa persona ricopre in un'organizzazione si usi un'istanza di `org:Membership`. È comune organizzare i ruoli in una qualche struttura tassonomica e quindi si raccomanda SKOS per questo. Altre proprietà descrittive per il Role, come salario, possono essere aggiunte mediante l'uso di altri vocabolari. @it
type: Class
disjoint with: Site
comment: Indique le rôle qu'une Personne ou un autre Agent peut avoir dans une Organisation. Les instances de cette classe décrivent le rôle dans l'absolu; pour indiquer une personne ayant ce rôle spécifique dans une Organisation, utilisez une instance de `org:Membership`. Il est courant que les rôles soient organisés dans une sorte de taxonomie, ce qui peut être représenté avec SKOS. Les propriétés de libellés standards de SKOS devraient être utilisées pour libeller le Rôle. D'autres propriétés additionnelles pour ce rôle, comme une fourchette de Salaire peuvent être ajoutées par une extension de ce vocabulaire. @fr
disjoint with: Membership
label: actividad @es
comment: Denotes a role that a Person or other Agent can take in an organization. Instances of this class describe the abstract role; to denote a specific instance of a person playing that role in a specific organization use an instance of `org:Membership`. It is common for roles to be arranged in some taxonomic structure and we use SKOS to represent that. The normal SKOS lexical properties should be used when labelling the Role. Additional descriptive properties for the Role, such as a Salary band, may be added by extension vocabularies.
label: Ruolo @it
comment: Función que una persona o agente desempeña en el seno de una organización. Las instancias de esta clase describen la actividad en abstracto; si lo que se pretende es incluir una instancia que refleje la función o actividad que desempeña una persona en concreto en una organización específica, se indica el uso de instancias de la clase `org:Membership`. Es común que dichas actividades se representen en una estructura taxonómica mediante SKOS. Las propiedades léxicas de SKOS deberían utilizarse a la hora de denominar o etiquetar la actividad desempeñada. Para añadir propiedades descriptivas adicionales, como rango salarial, se tendrá que recurrir a vocabularios externos. @es
disjoint with: Organization

Identifier
subclass of: Resource
type: Class
comment: This class is based on the UN/CEFACT Identifier complex type defined in See Section 5.8 of Core Components Data Type Catalogue Version 3.1 (http://www.unece.org/fileadmin/DAM/cefact/codesfortrade/CCTS/CCTS-DTCatalogueVersion3p1.pdf) In RDF this is expressed using the following properties: - the content string should be provided using skos:notation, datatyped with the identifier scheme (inclduing the version number if appropriate); - use dcterms:creator to link to a class describing the agency that manages the identifier scheme or adms:schemaAgency to provide the name as a literal. Although not part of the ADMS conceptual model, it may be useful to provide further properties to the Identifier class such as dcterms:created to provide the date on which the identifier was issued.

Asset Repository
subclass of: Resource
type: Class
comment: An Asset Repository is a system or service that provides facilities for storage and maintenance of descriptions of Assets and Asset Distributions, and functionality that allows users to search and access these descriptions. An Asset Repository will typically contain descriptions of several Assets and related Asset Distributions.
subclass of: Catalog

Asset Distribution
subclass of: Resource
type: Class
comment: An Asset Distribution represents a particular physical embodiment of an Asset, which is an example of the FRBR entity manifestation (the physical embodiment of an expression of a work). An Asset Distribution is typically a downloadable computer file (but in principle it could also be a paper document) that implements the intellectual content of an Asset. A particular Asset Distribution is associated with one and only one Asset, while all Distributions of an Asset share the same intellectual content in different physical formats. Asset Distributions themselves are not versioned.
subclass of: Distribution

topic_interest
domain: Thing
type: Property
type: ObjectProperty
comment: A thing of interest to this person.
domain: Agent
range: Thing
term status: testing
range: Resource
domain: Resource
domain: http://lodlaundromat.org/.well-known/genid/samples/jena///class//4b28a6ea5a0560c5a3c2e6dec52272c0/218f3af31162c0199ca266130c18209c#14
domain: http://lodlaundromat.org/.well-known/genid/samples/jena///class//4b28a6ea5a0560c5a3c2e6dec52272c0/218f3af31162c0199ca266130c18209c#11

W3C/ERCIM
type: Thing

Post
subclass of: http://lodlaundromat.org/.well-known/genid/samples/jena///class//4b28a6ea5a0560c5a3c2e6dec52272c0/218f3af31162c0199ca266130c18209c#11
subclass of: http://lodlaundromat.org/.well-known/genid/samples/jena///class//4b28a6ea5a0560c5a3c2e6dec52272c0/218f3af31162c0199ca266130c18209c#14
subclass of: http://lodlaundromat.org/.well-known/genid/samples/jena///class//4b28a6ea5a0560c5a3c2e6dec52272c0/218f3af31162c0199ca266130c18209c#17
subclass of: Thing
subclass of: Resource
comment: Un Impiego rappresenta una posizione all'interno dell'organizzazione che esiste indipendentemente dalla persona che la ricopre. Gli impieghi possono essere utilizzati per le situazioni in cui una persona è membro di un'organizzazione o di un ufficio (ad esempio un segretario di stato). Un Impiego può essere ricoperto da più persone. @it
type: Class
comment: Puesto o posición que representa algún tipo de empleo dentro de una organización, que existe independientemente de la persona o personas que lo desempeñan. Esta clase puede utilizarse para representar situaciones en las que una persona es miembro de una organización ex oficio (por ejemplo, el Secretario de Estado escocés es parte del Gabinete del gobierno británico por virtud de ser Secretario de Estado en Escocia, y no como individuo). Un puesto puede ser desempeñado por múltiples individuos y de aquí que sea tratado como una organización en sí misma. @es
label: Impiego @it
comment: ポストは、それを埋める人（人々）とは無関係に存在する組織内のある位置を表わします。ポストは、人が職権上、組織のメンバーである状況を表わすために使用できます（例えば、スコットランド大臣は、個人としてではなく、スコットランド大臣であることにより、英国内閣の一部です）。ポストは、複数の人々によって保持されることが可能だあるため、それ自体を組織として扱うことができます。 @ja
label: puesto @es
label: Poste @fr
comment: A Post represents some position within an organization that exists independently of the person or persons filling it. Posts may be used to represent situations where a person is a member of an organization ex officio (for example the Secretary of State for Scotland is part of UK Cabinet by virtue of being Secretary of State for Scotland, not as an individual person). A post can be held by multiple people and hence can be treated as a organization in its own right.
comment: Un Poste représente une position au sein d'une Organisation qui existe indépendamment de la personne ou des personnes qui le remplissent. Les postes peuvent être utilisés pour représenter des situations où une personne est membre d'une Organisation d'office (par exemple, le Secrétaire d'Etat pour l'Ecosse fait partie du Cabinet du Royaume-Uni du fait d'être Secrétaire d'Etat pour l'Ecosse, non pas comme une personne physique). Un poste après peut être occupé par plusieurs personnes et peut donc être considéré comme une Organisation à part entière. @fr

Interactive Resource
subclass of: Resource
member of: DCMIType
description: Examples include forms on Web pages, applets, multimedia learning objects, chat services, or virtual reality environments.
has version: InteractiveResource-003
issued: 2000-07-11
modified: 2008-01-14
type: Class
comment: A resource requiring interaction from the user to be understood, executed, or experienced.

holds
range: Thing
domain: Thing
inverse of: held by
comment: Puesto ocupado por algún agente. @es
label: ricopre @it
range: Post
comment: Indica un Impiego ricoperto da un Agent. @it
label: occupe @fr
domain: Agent
label: ocupa @es
comment: あるエージェントによって保持されているポストを示します。 @ja
type: ObjectProperty
comment: Indicate un Poste occupé par un Agent. @fr
type: Property
comment: Indicates a Post held by some Agent.
range: http://lodlaundromat.org/.well-known/genid/samples/jena///class//4b28a6ea5a0560c5a3c2e6dec52272c0/218f3af31162c0199ca266130c18209c#17
range: Resource
range: http://lodlaundromat.org/.well-known/genid/samples/jena///class//4b28a6ea5a0560c5a3c2e6dec52272c0/218f3af31162c0199ca266130c18209c#14
range: http://lodlaundromat.org/.well-known/genid/samples/jena///class//4b28a6ea5a0560c5a3c2e6dec52272c0/218f3af31162c0199ca266130c18209c#11
domain: Resource
domain: http://lodlaundromat.org/.well-known/genid/samples/jena///class//4b28a6ea5a0560c5a3c2e6dec52272c0/218f3af31162c0199ca266130c18209c#14
domain: http://lodlaundromat.org/.well-known/genid/samples/jena///class//4b28a6ea5a0560c5a3c2e6dec52272c0/218f3af31162c0199ca266130c18209c#11

Collection
subclass of: Resource
member of: DCMIType
description: A collection is described as a group; its parts may also be separately described.
has version: Collection-003
issued: 2000-07-11
modified: 2008-01-14
type: Class
comment: An aggregation of resources.

account
range: Thing
domain: Thing
type: Property
type: ObjectProperty
comment: Indicates an account held by this agent.
domain: Agent
range: Online Account
term status: archaic
range: Resource
domain: Resource
domain: http://lodlaundromat.org/.well-known/genid/samples/jena///class//4b28a6ea5a0560c5a3c2e6dec52272c0/218f3af31162c0199ca266130c18209c#14
domain: http://lodlaundromat.org/.well-known/genid/samples/jena///class//4b28a6ea5a0560c5a3c2e6dec52272c0/218f3af31162c0199ca266130c18209c#11

W3C/ERCIM
type: Thing

member During
range: Thing
domain: Thing
domain: Membership
comment: Proprietà opzionale per indicare l'intervallo per il quale l'appartenenza è/è stata valida. @it
comment: Propriété optionnelle pour indiquer l'intervalle durant lequel l'engagemnet est ou était valide. @fr
type: Property
label: durée d'engagement @fr
label: membro durante @it
comment: Optional property to indicate the interval for which the membership is/was valid.
label: es miembro durante @es
type: ObjectProperty
comment: Propiedad opcional que indica el periodo durante el cual la relación de membresía o pertenencia a una organización se mantiene en vigencia. @es
comment: 構成員が有効である／であった期間を示すためのオプションのプロパティー。 @ja
range: Resource
domain: Resource
domain: http://lodlaundromat.org/.well-known/genid/samples/jena///class//4b28a6ea5a0560c5a3c2e6dec52272c0/218f3af31162c0199ca266130c18209c#17

tipjar
range: Thing
domain: Thing
type: Property
type: ObjectProperty
comment: A tipjar document for this agent, describing means for payment and reward.
domain: Agent
range: Document
sub property of: page
term status: testing
range: Resource
domain: Resource
domain: http://lodlaundromat.org/.well-known/genid/samples/jena///class//4b28a6ea5a0560c5a3c2e6dec52272c0/218f3af31162c0199ca266130c18209c#14
domain: http://lodlaundromat.org/.well-known/genid/samples/jena///class//4b28a6ea5a0560c5a3c2e6dec52272c0/218f3af31162c0199ca266130c18209c#11

site Of
range: Thing
domain: Thing
comment: Indicates an Organization which has some presence at the given site. This is the inverse of `org:hasSite`.
comment: Indica un'Organization che ha una qualche presenza nella data sede. È l'inverso di `org:hasSite`. @it
comment: Organización que tiene ubicación en un lugar. Es la relación inversa de `org:hasSite`. @es
type: Property
type: ObjectProperty
domain: Site
label: sede di @it
comment: Indique une Organisation qui a une présence sur le site en question. Inverse de `org:hasSite`. @fr
range: Organization
inverse of: has site
label: es sede de @es
label: site de @fr
comment: あるサイトである存在感を持っている組織を示します。 @ja
range: http://lodlaundromat.org/.well-known/genid/samples/jena///class//4b28a6ea5a0560c5a3c2e6dec52272c0/218f3af31162c0199ca266130c18209c#14
range: Agent
range: http://lodlaundromat.org/.well-known/genid/samples/jena///class//4b28a6ea5a0560c5a3c2e6dec52272c0/218f3af31162c0199ca266130c18209c#11
range: Resource
domain: Resource

status
range: Thing
domain: Thing
type: Property
type: ObjectProperty
comment: Links to the status of the Asset or Asset Distribution in the context of a particular workflow process. Since Status is defined using a skos:Concept, that is the defined range for this property.
range: Concept
range: Resource
domain: Resource

Makx Dekkers
type: Thing
made: Registered Organization Vocabulary
made: Asset Description Metadata Schema (ADMS)
type: Agent
type: http://lodlaundromat.org/.well-known/genid/samples/jena///class//4b28a6ea5a0560c5a3c2e6dec52272c0/218f3af31162c0199ca266130c18209c#14
type: http://lodlaundromat.org/.well-known/genid/samples/jena///class//4b28a6ea5a0560c5a3c2e6dec52272c0/218f3af31162c0199ca266130c18209c#11

past project
domain: Thing
type: Property
type: ObjectProperty
comment: A project this person has previously worked on.
domain: Person
range: Thing
term status: testing
range: Resource
domain: Agent
domain: Resource
domain: http://lodlaundromat.org/.well-known/genid/samples/jena///class//4b28a6ea5a0560c5a3c2e6dec52272c0/218f3af31162c0199ca266130c18209c#14
domain: SpatialThing
domain: http://lodlaundromat.org/.well-known/genid/samples/jena///class//4b28a6ea5a0560c5a3c2e6dec52272c0/218f3af31162c0199ca266130c18209c#11

membership
range: Thing
domain: Thing
type: InverseFunctionalProperty
comment: Indicates a membership relationship that the Agent plays. Inverse of `org:member`.
type: ObjectProperty
comment: Indica una relazione di appartenenza che coinvolge un Agent. È l'inverso di `org:member`. @it
label: appartenenza @it
comment: Relación de pertenencia o afiliación a una organización en la que el agente desempeña un cargo o función. Es la relación inversa de `org:member`. @es
label: tiene membresía @es
label: engagement @fr
type: Property
inverse of: member
range: Membership
domain: Agent
comment: Indique pour cet Agent un engagement dans une Organisation. Inverse de `org:member`. @fr
comment: エージェントが担う構成員関係を示します。 @ja
range: Resource
range: http://lodlaundromat.org/.well-known/genid/samples/jena///class//4b28a6ea5a0560c5a3c2e6dec52272c0/218f3af31162c0199ca266130c18209c#17
domain: Resource
domain: http://lodlaundromat.org/.well-known/genid/samples/jena///class//4b28a6ea5a0560c5a3c2e6dec52272c0/218f3af31162c0199ca266130c18209c#14
domain: http://lodlaundromat.org/.well-known/genid/samples/jena///class//4b28a6ea5a0560c5a3c2e6dec52272c0/218f3af31162c0199ca266130c18209c#11

member
range: Thing
domain: Thing
type: ObjectProperty
label: membre @fr
type: FunctionalProperty
range: Agent
inverse of: membership
comment: Indicates the Person (or other Agent including Organization) involved in the Membership relationship. Inverse of `org:hasMembership`
label: membro @it
label: es condición de miembro sobre agente @es
comment: Persona (u otro agente, incluyendo una organización) que participa en la relación de membresía. Es la relación inversa de `org:hasMembership`. @es
domain: Membership
comment: Indica la Person (o un altro Agent) coinvolto in una relazione di Membership. È l'inverso di `org:hasMembership`. @it
comment: 構成員関係に含まれている人（または、組織を含んでいる他のエージェント）を示します。 @ja
type: Property
comment: Indique une personne (ou tout autre Agent, y compris une Organisation) impliqué dans la relation d'Engagement. Inverse de `org:hasMembership` @fr
range: http://lodlaundromat.org/.well-known/genid/samples/jena///class//4b28a6ea5a0560c5a3c2e6dec52272c0/218f3af31162c0199ca266130c18209c#11
range: Resource
range: http://lodlaundromat.org/.well-known/genid/samples/jena///class//4b28a6ea5a0560c5a3c2e6dec52272c0/218f3af31162c0199ca266130c18209c#14
domain: Resource
domain: http://lodlaundromat.org/.well-known/genid/samples/jena///class//4b28a6ea5a0560c5a3c2e6dec52272c0/218f3af31162c0199ca266130c18209c#17

age
type: Property
type: FunctionalProperty
type: DatatypeProperty
comment: The age in years of some agent.
domain: Agent
range: Literal
term status: unstable
range: Resource
domain: Thing
domain: Resource
domain: http://lodlaundromat.org/.well-known/genid/samples/jena///class//4b28a6ea5a0560c5a3c2e6dec52272c0/218f3af31162c0199ca266130c18209c#14
domain: http://lodlaundromat.org/.well-known/genid/samples/jena///class//4b28a6ea5a0560c5a3c2e6dec52272c0/218f3af31162c0199ca266130c18209c#11

Antonio Maccioni
type: Thing
type: Agent
type: http://lodlaundromat.org/.well-known/genid/samples/jena///class//4b28a6ea5a0560c5a3c2e6dec52272c0/218f3af31162c0199ca266130c18209c#11
type: http://lodlaundromat.org/.well-known/genid/samples/jena///class//4b28a6ea5a0560c5a3c2e6dec52272c0/218f3af31162c0199ca266130c18209c#14

legal name
type: Property
type: DatatypeProperty
comment: The legal name of the business. A business might have more than one legal name, particularly in countries with more than one official language. In such cases the language of the string should be identified.
range: Literal
range: Resource

Surname
type: Property
type: DatatypeProperty
comment: The surname of some person.
domain: Person
range: Literal
term status: archaic
range: Resource
domain: Thing
domain: Agent
domain: Resource
domain: http://lodlaundromat.org/.well-known/genid/samples/jena///class//4b28a6ea5a0560c5a3c2e6dec52272c0/218f3af31162c0199ca266130c18209c#14
domain: SpatialThing
domain: http://lodlaundromat.org/.well-known/genid/samples/jena///class//4b28a6ea5a0560c5a3c2e6dec52272c0/218f3af31162c0199ca266130c18209c#11

locator designator
type: Property
comment: A number or a sequence of characters that uniquely identifies the locator within the relevant scope(s). The full identification of the locator could include one or more locator designators.
term status: testing

geekcode
type: Property
type: DatatypeProperty
comment: A textual geekcode for this person, see http://www.geekcode.com/geek.html
domain: Person
range: Literal
term status: archaic
range: Resource
domain: Thing
domain: Agent
domain: Resource
domain: http://lodlaundromat.org/.well-known/genid/samples/jena///class//4b28a6ea5a0560c5a3c2e6dec52272c0/218f3af31162c0199ca266130c18209c#14
domain: SpatialThing
domain: http://lodlaundromat.org/.well-known/genid/samples/jena///class//4b28a6ea5a0560c5a3c2e6dec52272c0/218f3af31162c0199ca266130c18209c#11

address area
type: Property
comment: The name or names of a geographic area or locality that groups a number of addressable objects for addressing purposes, without being an administrative unit. This would typically be part of a city, a neighbourhood or village. The domain of locn:addressArea is locn:Address.
domain: Address
range: Literal
term status: testing
range: Resource
domain: Resource

Registered Organization vocabulary UML Class Diagram
type: Image
type: Thing
depicts: Registered Organization Vocabulary
type: Document

ISA Programme Location Core Vocabulary
license: ISA Open Metadata Licence v1.1
modified: 2015-03-23
type: Vocabulary
mediator: Locations and Addresses Community Group
relies on: terms
relies on: rdf-schema#
attribution URL: http://ec.europa.eu/
describedby: Core Vocabularies Specification
editor: Andrea Perego
property number: 16
attribution name: European Commission
preferred namespace prefix: locn
version info: First version in w3.org/ns space
issued: 2013-11-25
maker: EU ISA Programme Core Vocabularies Working Group (Location Task Force)
changes: 2015-03-23: Updates in the namespace document and in the RDF/XML and Turtle schemas: - Fixed copyright notice. - Added class and property diagram. - Updated GeoSPARQL (a) namespace URIs and (b) datatype names in the examples of property locn:geometry, based on version 1.0 of the GeoSPARQL specification, and added a note in the examples. - prefix ogc (http://www.opengis.net/rdf#) replaced with gsp (http://www.opengis.net/ont/geosparql#) and sf (http://www.opengis.net/ont/sf#) - ogc:WKTLiteral → gsp:wktLiteral - ogc:GMLLiteral → gsp:gmlLiteral - Added namespace declarations for all namespace prefixes used in LOCN namespace document, even though they are not used in class/property definitions. - Corrected the endonym of the Greek capital written in the Greek script in the definition of class locn:geographicName (Aθnνa → Αθήνα). - Fixed links and typos, minor revisions made to the textual descriptions. 2013-12-21: (PhilA) Update in RDF/XML and Turtle schemas: - Updated voaf namespace. - Corrected links to different distributions of the schema. - Removed xml:base and used http://www/w3/org/ns/locn as the schema URI cf. original which used the namespace URI (with the final # character). 2013-11-25: Changes since final draft version released by the EU ISA Programme Core Vocabularies Working Group (Location Task Force) - Revised usage note of class locn:Geometry. The text describing its recommended usage has been moved to usage note of property locn:geometry. - Dropped domain/range restriction for locn:geographicName. - Dropped domain/range restriction for locn:locatorDesignator. Free text definition updated accordingly. - Dropped domain/range restriction for locn:locatorName. Free text definition updated accordingly. - Corrected free text definition of property locn:geometry (its domain is "any resource", and not a "location"). - Revised usage note of property locn:geometry to include text about recommended usage, formerly included in the usage note of class locn:Geometry.…
class number: 3
editor: Phil Archer
has format: Turtle version of the ISA Programme Location Core Vocabulary
has format: RDF/XML version of the ISA Programme Location Core Vocabulary
abstract: The ISA Programme Location Core Vocabulary provides a minimum set of classes and properties for describing any place in terms of its name, address or geometry. The vocabulary is specifically designed to aid the publication of data that is interoperable with EU INSPIRE Directive. It is closely integrated with the Business and Person Core Vocabularies of the EU ISA Programme, now available in W3C space as, respectively, the Registered Organization vocabulary and ISA Person Core Vocabulary.
conforms to: Process and Methodology for Developing Core Vocabularies
type: Ontology
rights: Copyright © European Union, 2012-2015.
preferred namespace uri: http://www.w3.org/ns/locn#
editor: Michael Lutz
has format: HTML version of the ISA Programme Location Core Vocabulary
comment: This is a new version of the final draft published by the European Commission in May 2012, revised according to the results of the ISA Core Location Pilot (see Section Change History for the list of changes). It is currently under the control of the Locations and Addresses Community Group, but is not under active development or review. Comments and queries should be sent to that group via public-locadd@w3.org. Terms defined here may be deprecated by that or future groups but will not disappear or their definition change.
type: Thing
creator: EU ISA Programme Core Vocabularies Working Group (Location Task Force)

post code
type: Property
comment: The post code (a.k.a postal code, zip code etc.). Post codes are common elements in many countries' postal address systems. The domain of locn:postCode is locn:Address.
domain: Address
range: Literal
term status: testing
range: Resource
domain: Resource

MSN chat ID
sub property of: nickname
type: InverseFunctionalProperty
comment: An MSN chat ID
domain: Agent
type: DatatypeProperty
term status: testing
type: Property
range: Literal
type: ObjectProperty
range: Resource
domain: Thing
domain: Resource
domain: http://lodlaundromat.org/.well-known/genid/samples/jena///class//4b28a6ea5a0560c5a3c2e6dec52272c0/218f3af31162c0199ca266130c18209c#14
domain: http://lodlaundromat.org/.well-known/genid/samples/jena///class//4b28a6ea5a0560c5a3c2e6dec52272c0/218f3af31162c0199ca266130c18209c#11

Yahoo chat ID
domain: Agent
term status: testing
range: Literal
comment: A Yahoo chat ID
type: DatatypeProperty
sub property of: nickname
type: Property
type: InverseFunctionalProperty
type: ObjectProperty
range: Resource
domain: Thing
domain: Resource
domain: http://lodlaundromat.org/.well-known/genid/samples/jena///class//4b28a6ea5a0560c5a3c2e6dec52272c0/218f3af31162c0199ca266130c18209c#14
domain: http://lodlaundromat.org/.well-known/genid/samples/jena///class//4b28a6ea5a0560c5a3c2e6dec52272c0/218f3af31162c0199ca266130c18209c#11

scheme agency
type: Property
type: DatatypeProperty
comment: The name of the agency responsible for issuing the identifier
domain: Identifier
range: Literal
range: Resource
domain: Resource

Guadalupe Aguado de Cea
type: Thing
type: Agent
type: http://lodlaundromat.org/.well-known/genid/samples/jena///class//4b28a6ea5a0560c5a3c2e6dec52272c0/218f3af31162c0199ca266130c18209c#11
type: http://lodlaundromat.org/.well-known/genid/samples/jena///class//4b28a6ea5a0560c5a3c2e6dec52272c0/218f3af31162c0199ca266130c18209c#14

Given name
type: Property
type: DatatypeProperty
comment: The given name of some person.
term status: testing

Asset Description Metadata Schema (ADMS) UML Class Diagram
type: Image
type: Thing
depicts: Asset Description Metadata Schema (ADMS)
type: Document

funded by
type: Property
type: ObjectProperty
comment: An organization funding a project or person.
domain: Thing
range: Thing
term status: archaic
range: Resource
domain: Resource

account name
type: Property
type: DatatypeProperty
comment: Indicates the name (identifier) associated with this online account.
domain: Online Account
range: Literal
term status: testing
range: Resource
domain: Thing
domain: Resource

identifier
comment: Donne un identifiant, comme par exemple le numéro d'enregistrement d'une entreprise, qui peut être utilisé comme identifiant unique pour l'Organisation. De nombreux schémas nationaux et internationaux sont disponibles. Cette ontologie reste neutre par rapport au schéma utilisé. Le schéma particulier utilisé devrait être indiqué par le `datatype` de la valeur de l'identifiant. Utiliser les datatypes pour distinguer les schémas de notation est cohérent avec les bonnes pratiques pour `skos:notation` dont cette propriété est une spécialisation. @fr
comment: 組織を一意に識別するために使用できる会社登録番号などの識別子を与えます。 @ja
comment: Indica un identificatore univoco per l'organizzazione, come ad esempio la partita IVA di un'azienda. Molti schemi di identificazione a livello nazionale e internazionale sono disponibili allo scopo. L'ontologia ORG è neutrale rispetto allo schema da utilizzare. Lo schema di identificazione dovrebbe essere indicato dal datatype del valore dell'identificatore. L'uso del datatype per distinguere lo schema di identificazione è coerente con le best practice per `skos:notation`, di cui questa proprietà è una specializzazione. @it
label: identifiant @fr
comment: Gives an identifier, such as a company registration number, that can be used to used to uniquely identify the organization. Many different national and international identier schemes are available. The org ontology is neutral to which schemes are used. The particular identifier scheme should be indicated by the datatype of the identifier value. Using datatypes to distinguish the notation scheme used is consistent with recommended best practice for `skos:notation` of which this property is a specialization.
label: tiene identificador @es
comment: Código o identificador, como por ejemplo el CIF de una empresa, que permite identificar de forma inequívoca a una organización. Existen muchos códigos de identificación tanto nacionales como internacionales. Esta ontología no obliga al uso de ningún esquema en concreto. Los códigos de identificación utilizados en cada caso se deberían indicar mediante el uso de la propiedad “datatype” del valor del identificador. El uso de la propiedad “datatype” para especificar el esquema de notación utilizado está en consonancia con las buenas prácticas recomendadas para el uso de la propiedad `skos:notation`, de la que esta propiedad es una especialización. @es
type: DatatypeProperty
label: identificatore @it
type: Property
sub property of: notation
domain: Organization
domain: Thing
domain: Agent
domain: Resource
domain: http://lodlaundromat.org/.well-known/genid/samples/jena///class//4b28a6ea5a0560c5a3c2e6dec52272c0/218f3af31162c0199ca266130c18209c#14
domain: http://lodlaundromat.org/.well-known/genid/samples/jena///class//4b28a6ea5a0560c5a3c2e6dec52272c0/218f3af31162c0199ca266130c18209c#11

Core organization ontology
modified: 2012-10-06
comment: Vocabulary for describing organizational structures, specializable to a broad variety of types of organization.
created: 2010-05-28
modified: 2014-01-25
contributor: Dave Reynolds
title: Ontología de organizaciones @es
contributor: Olga Ximena Giraldo
contributor: Guadalupe Aguado de Cea
comment: Vocabolario per descrivere strutture organizzative, le quali possono essere specializzate in una vasta varietà di tipi di organizzazione @it
type: Ontology
modified: 2012-09-30
modified: 2013-12-16
modified: 2014-01-02
modified: 2014-04-12
title: Ontologia delle organizzazioni @it
modified: 2013-02-15
contributor: Antonio Maccioni
modified: 2014-02-05
modified: 2010-10-08
contributor: Dominique Guardiola
contributor: Elena Montiel Ponsoda
version info: 0.8
contributor: Shuji Kamitsuna
license: http://www.opendatacommons.org/licenses/pddl/1.0/
contributor: Giorgia Lodi
comment: Vocabulario para describir organizaciones, adaptable a una amplia variedad de ellas. @es
modified: 2010-06-09
title: Ontologie des organisations @fr
contributor: María Poveda Villalón

location
type: Property
comment: The location property links any resource to the Location Class. Asserting the location relationship implies only that the domain has some connection to a Location in time or space. It does not imply that the resource is necessarily at that location at the time when the assertion is made.
range: Location
term status: testing
range: Resource

address
type: Property
comment: The locn:address property relationship associates any resource with the locn:Address class
range: Address
term status: testing
range: Resource

Dave Reynolds
type: Thing
type: Agent
type: http://lodlaundromat.org/.well-known/genid/samples/jena///class//4b28a6ea5a0560c5a3c2e6dec52272c0/218f3af31162c0199ca266130c18209c#11
type: http://lodlaundromat.org/.well-known/genid/samples/jena///class//4b28a6ea5a0560c5a3c2e6dec52272c0/218f3af31162c0199ca266130c18209c#14

status
type: Property
type: DatatypeProperty
comment: A string expressing what the user is happy for the general public (normally) to know about their current activity.
domain: Agent
range: Literal
term status: unstable
range: Resource
domain: Thing
domain: Resource
domain: http://lodlaundromat.org/.well-known/genid/samples/jena///class//4b28a6ea5a0560c5a3c2e6dec52272c0/218f3af31162c0199ca266130c18209c#14
domain: http://lodlaundromat.org/.well-known/genid/samples/jena///class//4b28a6ea5a0560c5a3c2e6dec52272c0/218f3af31162c0199ca266130c18209c#11

DNA checksum
type: Property
type: DatatypeProperty
comment: A checksum for the DNA of some thing. Joke.
range: Literal
term status: archaic
range: Resource

full address
type: Property
comment: The complete address written as a string, with or without formatting. The domain of locn:fullAddress is locn:Address.
domain: Address
range: Literal
term status: testing
range: Resource
domain: Resource

EU ISA Programme Core Vocabularies Working Group (Location Task Force)
type: Thing
made: ISA Programme Location Core Vocabulary
type: Agent
type: http://lodlaundromat.org/.well-known/genid/samples/jena///class//4b28a6ea5a0560c5a3c2e6dec52272c0/218f3af31162c0199ca266130c18209c#11
type: http://lodlaundromat.org/.well-known/genid/samples/jena///class//4b28a6ea5a0560c5a3c2e6dec52272c0/218f3af31162c0199ca266130c18209c#14

Class and property diagram of the LOCN vocabulary
type: Image
type: Thing
depicts: ISA Programme Location Core Vocabulary
type: Document

María Poveda Villalón
type: Thing
type: Agent
type: http://lodlaundromat.org/.well-known/genid/samples/jena///class//4b28a6ea5a0560c5a3c2e6dec52272c0/218f3af31162c0199ca266130c18209c#11
type: http://lodlaundromat.org/.well-known/genid/samples/jena///class//4b28a6ea5a0560c5a3c2e6dec52272c0/218f3af31162c0199ca266130c18209c#14

sha1sum (hex)
type: Property
type: DatatypeProperty
comment: A sha1sum hash, in hex.
domain: Document
term status: unstable
domain: Thing
domain: Resource

Government Linked Data WG, based on output from the ADMS Working Group
type: Thing
made: Registered Organization Vocabulary
type: Agent
type: http://lodlaundromat.org/.well-known/genid/samples/jena///class//4b28a6ea5a0560c5a3c2e6dec52272c0/218f3af31162c0199ca266130c18209c#11
type: http://lodlaundromat.org/.well-known/genid/samples/jena///class//4b28a6ea5a0560c5a3c2e6dec52272c0/218f3af31162c0199ca266130c18209c#14

myersBriggs
type: Property
type: DatatypeProperty
comment: A Myers Briggs (MBTI) personality classification.
domain: Person
range: Literal
term status: testing
range: Resource
domain: Thing
domain: Agent
domain: Resource
domain: http://lodlaundromat.org/.well-known/genid/samples/jena///class//4b28a6ea5a0560c5a3c2e6dec52272c0/218f3af31162c0199ca266130c18209c#14
domain: SpatialThing
domain: http://lodlaundromat.org/.well-known/genid/samples/jena///class//4b28a6ea5a0560c5a3c2e6dec52272c0/218f3af31162c0199ca266130c18209c#11

logo
type: Property
type: ObjectProperty
type: InverseFunctionalProperty
comment: A logo representing some thing.
domain: Thing
range: Thing
term status: testing
range: Resource
domain: Resource

version notes
type: Property
type: DatatypeProperty
comment: A description of changes between this version and the previous version of the Asset.
range: Literal
range: Resource

RDF/XML version of the ISA Programme Location Core Vocabulary
format: RDF XML
media type: com.hp.hpl.jena.datatypes.BaseDatatype$TypedValue@df144fe1

PO box
type: Property
comment: The Post Office Box number. The domain of locn:poBox is locn:Address.
domain: Address
range: Literal
term status: testing
range: Resource
domain: Resource

purpose
label: but @fr
label: tiene objetivo @es
comment: Indique le but de cette Organisation. Il peut exister plusieurs buts à différents niveaux d'abstraction mais la nature d'une organisation est d'avoir une raison d'exister et cette propriété doit servir à documenter cette raison d'être. Une Organisation peut avoir plusieurs Buts. Il est recommandé que le but soit libellé à l'aide d'un vocabulaire contrôlé ou autre code établi, idéalement avec un concept `skos:Concept`. Toutefois, le champ de cette propriété est laissé ouvert et pourrait accepter d'autres schémas de description. Il est préférable que les spécialisations ou les profils d'applications de ce vocabulaire contraignent le champ de cette propriété. @fr
comment: Indica l'obiettivo di questa Organization. In generale, si possono esprimere gli obiettivi di un'organizzazione secondo diversi livelli di astrazione, ma la natura stessa dell'organizzazione ha una ragione d'essere ed è proprio questa che deve essere catturata con tale proprietà. Inoltre, un'Organization può avere obiettivi multipli. È raccomandabile che l'obiettivo faccia parte di una code list, e che sia preferibilmente un `skos:Concept`. Ad ogni modo, il codominio della proprietà è lasciato aperto per consentire altri tipi di di descrizione. Conseguentemente, eventuali specializzazioni o profili applicativi possono utilizzare quel vocabolario come codominio della proprietà. @it
domain: Organization
comment: この組織の目的を示します。異なる抽象レベルの多くの目的がありえますが、組織の本質は存在理由を持つことであり、このプロパティーはその理由をドキュメント化する手段です。組織は、複数の目的を持っている可能性があります。 @ja
label: obiettivo @it
comment: Indicates the purpose of this Organization. There can be many purposes at different levels of abstraction but the nature of an organization is to have a reason for existence and this property is a means to document that reason. An Organization may have multiple purposes. It is recommended that the purpose be denoted by a controlled term or code list, ideally a `skos:Concept`. However, the range is left open to allow for other types of descriptive schemes. It is expected that specializations or application profiles of this vocabulary will constrain the range of the purpose. Alternative names: _remit_ _responsibility_ (esp. if applied to OrganizationalUnits such as Government Departments).
type: Property
comment: Finalidad u objetivo de la organización. La organización puede tener muchos objetivos a diferentes niveles de abstracción, pero en la naturaleza de las organizaciones está el tener una razón para existir, y la finalidad de esta propiedad es documentar dicha razón. La organización podrá tener más de un objetivo. Se recomienda el uso de vocabularios controlados o listas de códigos para indicar el objetivo, preferentemente mediante el uso de un `skos:Concept`. Sin embargo, el rango no está predeterminado, de forma que otros tipos de esquemas descriptivos tiene cabida. Se espera que ciertas especializaciones de este vocabulario o ciertos perfiles de aplicaciones restrinjan el rango del objetivo. Denominaciones alternativas: área_ _jurisdicción_ _ responsabilidad _ (especialmente cuando se aplica a unidades tales como ministerios o divisiones administrativas de los gobiernos) @es
domain: Thing
domain: Agent
domain: Resource
domain: http://lodlaundromat.org/.well-known/genid/samples/jena///class//4b28a6ea5a0560c5a3c2e6dec52272c0/218f3af31162c0199ca266130c18209c#14
domain: http://lodlaundromat.org/.well-known/genid/samples/jena///class//4b28a6ea5a0560c5a3c2e6dec52272c0/218f3af31162c0199ca266130c18209c#11

ICQ chat ID
sub property of: nickname
term status: testing
domain: Agent
range: Literal
comment: An ICQ chat ID
type: InverseFunctionalProperty
type: Property
type: DatatypeProperty
type: ObjectProperty
range: Resource
domain: Thing
domain: Resource
domain: http://lodlaundromat.org/.well-known/genid/samples/jena///class//4b28a6ea5a0560c5a3c2e6dec52272c0/218f3af31162c0199ca266130c18209c#14
domain: http://lodlaundromat.org/.well-known/genid/samples/jena///class//4b28a6ea5a0560c5a3c2e6dec52272c0/218f3af31162c0199ca266130c18209c#11

name
type: Property
type: DatatypeProperty
comment: A name for some thing.
domain: Thing
range: Literal
sub property of: label
term status: testing
range: Resource
domain: Resource

family_name
type: Property
type: DatatypeProperty
comment: The family name of some person.
domain: Person
range: Literal
term status: archaic
range: Resource
domain: Thing
domain: Agent
domain: Resource
domain: http://lodlaundromat.org/.well-known/genid/samples/jena///class//4b28a6ea5a0560c5a3c2e6dec52272c0/218f3af31162c0199ca266130c18209c#14
domain: SpatialThing
domain: http://lodlaundromat.org/.well-known/genid/samples/jena///class//4b28a6ea5a0560c5a3c2e6dec52272c0/218f3af31162c0199ca266130c18209c#11

Giorgia Lodi
type: Thing
type: Agent
type: http://lodlaundromat.org/.well-known/genid/samples/jena///class//4b28a6ea5a0560c5a3c2e6dec52272c0/218f3af31162c0199ca266130c18209c#11
type: http://lodlaundromat.org/.well-known/genid/samples/jena///class//4b28a6ea5a0560c5a3c2e6dec52272c0/218f3af31162c0199ca266130c18209c#14

locator name
type: Property
comment: Proper noun(s) applied to the real world entity identified by the locator. The locator name could be the name of the property or complex, of the building or part of the building, or it could be the name of a room inside a building.
term status: testing

lastName
type: Property
type: DatatypeProperty
comment: The last name of a person.
domain: Person
range: Literal
term status: testing
range: Resource
domain: Thing
domain: Agent
domain: Resource
domain: http://lodlaundromat.org/.well-known/genid/samples/jena///class//4b28a6ea5a0560c5a3c2e6dec52272c0/218f3af31162c0199ca266130c18209c#14
domain: SpatialThing
domain: http://lodlaundromat.org/.well-known/genid/samples/jena///class//4b28a6ea5a0560c5a3c2e6dec52272c0/218f3af31162c0199ca266130c18209c#11

role (property)
comment: Questa è una meta-proprietà usata per annotare un'istanza di `org:Role` con una sotto-proprietà di `org:memberOf` e può essere usata per indicare direttamente il ruolo per facilitare un'interrogazione sui dati. @it
label: rôle (propriété) @fr
comment: Ceci est une méta-propriété utilisée pour annoter une instance de `org:Role` ayant une sous-propriété `org:memberOf` qui peut être utilisée pour indiquer directement le rôle et pouvoir faire des requêtes plus facilement. La sémantique visée est un Engagement impliquant l'existence d'une relation de propriété directe à travers d'une règle d'inférence de la forme: `{ [] org:member ?p; org:organization ?o; org:role [org:roleProperty ?r] } -> {?p ?r ?o}`. @fr
comment: これは、クエリが容易になるように役割を直接的に示すために使用できるorg:memberOfのサブプロパティーでorg:Roleインスタンスを注釈するために用いられるメタレベルのプロパティーです。 @ja
range: Property
comment: This is a metalevel property which is used to annotate an `org:Role` instance with a sub-property of `org:memberOf` that can be used to directly indicate the role for easy of query. The intended semantics is a Membership relation involving the Role implies the existence of a direct property relationship through an inference rule of the form: `{ [] org:member ?p; org:organization ?o; org:role [org:roleProperty ?r] } -> {?p ?r ?o}`.
type: Property
label: desempeña la actividad de (propiedad) @es
type: AnnotationProperty
label: ruolo (proprietà) @it
comment: Meta-propiedad que se utiliza para anotar una instancia de `org:Role` con una sub-propiedad de `org:memberOf`, que puede ser utilizada para indicar directamente la actividad a fin de facilitar las consultas a los datos. The intended semantics is that a Membership relation involving the Role implies the existence of a direct property relationship through an inference rule of the form: { [] org:member ?a; org:organization ?o; org:role [org:roleProperty ?r] } -> {?a ?r ?o} @es
domain: Role
range: Resource
domain: Thing
domain: Resource
domain: Concept

Phil Archer
affiliation: W3C/ERCIM
type: Thing

gender
type: Property
type: FunctionalProperty
type: DatatypeProperty
comment: The gender of this Agent (typically but not necessarily 'male' or 'female').
domain: Agent
range: Literal
term status: testing
range: Resource
domain: Thing
domain: Resource
domain: http://lodlaundromat.org/.well-known/genid/samples/jena///class//4b28a6ea5a0560c5a3c2e6dec52272c0/218f3af31162c0199ca266130c18209c#14
domain: http://lodlaundromat.org/.well-known/genid/samples/jena///class//4b28a6ea5a0560c5a3c2e6dec52272c0/218f3af31162c0199ca266130c18209c#11

Elena Montiel Ponsoda
type: Thing
type: Agent
type: http://lodlaundromat.org/.well-known/genid/samples/jena///class//4b28a6ea5a0560c5a3c2e6dec52272c0/218f3af31162c0199ca266130c18209c#11
type: http://lodlaundromat.org/.well-known/genid/samples/jena///class//4b28a6ea5a0560c5a3c2e6dec52272c0/218f3af31162c0199ca266130c18209c#14

theme
type: Property
type: ObjectProperty
comment: A theme.
domain: Thing
range: Thing
term status: archaic
range: Resource
domain: Resource

jabber ID
type: Property
type: DatatypeProperty
type: InverseFunctionalProperty
comment: A jabber ID for something.
domain: Agent
range: Literal
term status: testing
type: ObjectProperty
range: Resource
domain: Thing
domain: Resource
domain: http://lodlaundromat.org/.well-known/genid/samples/jena///class//4b28a6ea5a0560c5a3c2e6dec52272c0/218f3af31162c0199ca266130c18209c#14
domain: http://lodlaundromat.org/.well-known/genid/samples/jena///class//4b28a6ea5a0560c5a3c2e6dec52272c0/218f3af31162c0199ca266130c18209c#11

AIM chat ID
type: Property
type: DatatypeProperty
domain: Agent
comment: An AIM chat ID
type: InverseFunctionalProperty
term status: testing
range: Literal
sub property of: nickname
type: ObjectProperty
range: Resource
domain: Thing
domain: Resource
domain: http://lodlaundromat.org/.well-known/genid/samples/jena///class//4b28a6ea5a0560c5a3c2e6dec52272c0/218f3af31162c0199ca266130c18209c#14
domain: http://lodlaundromat.org/.well-known/genid/samples/jena///class//4b28a6ea5a0560c5a3c2e6dec52272c0/218f3af31162c0199ca266130c18209c#11

Turtle version of the ISA Programme Location Core Vocabulary
format: Turtle
media type: com.hp.hpl.jena.datatypes.BaseDatatype$TypedValue@47e6bb7e

admin unit level 1
type: Property
comment: The uppermost administrative unit for the address, almost always a country. The domain of locn:adminUnitL1 is locn:Address and the range is a literal, conceptually defined by the INSPIRE Geographical Name data type.
usage note: Best practice is to use the ISO 3166-1 code but if this is inappropriate for the context, country names should be provided in a consistent manner to reduce ambiguity. For example, either write 'United Kingdom' or 'UK' consistently throughout the data set and avoid mixing the two.
domain: Address
term status: testing
domain: Resource

Dominique Guardiola
type: Thing
type: Agent
type: http://lodlaundromat.org/.well-known/genid/samples/jena///class//4b28a6ea5a0560c5a3c2e6dec52272c0/218f3af31162c0199ca266130c18209c#11
type: http://lodlaundromat.org/.well-known/genid/samples/jena///class//4b28a6ea5a0560c5a3c2e6dec52272c0/218f3af31162c0199ca266130c18209c#14

Asset Description Metadata Schema (ADMS)
preferred namespace prefix: adms
comment: This file specifies the set of RDF classes and properties used in ADMS
preferred namespace uri: http://www.w3.org/ns/adms#
creator: Makx Dekkers
type: Ontology
creator: Phil Archer
describedby: Asset Description Metadata Schema (ADMS)
modified: 2015-07-22
creator: Andrea Perego
modified: 2013-05-24
modified: 2013-12-21
maker: Government Linked Data WG, based on output from the ADMS Working Group
type: Vocabulary
specializes: dcat
abstract: ADMS is a profile of DCAT, used to describe semantic assets (or just 'Assets'), defined as highly reusable metadata (e.g. xml schemata, generic data models) and reference data (e.g. code lists, taxonomies, dictionaries, vocabularies) that are used for eGovernment system development.
version info: 21 December 2013 - with correction to URI of the schema cf. using the namespace
maker: Andrea Perego
maker: Phil Archer
maker: Makx Dekkers
type: Thing
creator: Government Linked Data WG, based on output from the ADMS Working Group

geographic name
type: Property
comment: A geographic name is a proper noun applied to a spatial object. Taking the example used in the relevant INSPIRE data specification (page 18), the following are all valid geographic names for the Greek capital: - Αθήνα (the Greek endonym written in the Greek script) - Athína (the standard Romanisation of the endonym) - Athens (the English language exonym) For INSPIRE-conformant data, provide the metadata for the geographic name using a skos:Concept as a datatype.
describedby: Core Vocabularies Specification
term status: testing

plan
type: Property
type: DatatypeProperty
comment: Aplan comment, in the tradition of finger and '.plan' files.
domain: Person
range: Literal
term status: testing
range: Resource
domain: Thing
domain: Agent
domain: Resource
domain: http://lodlaundromat.org/.well-known/genid/samples/jena///class//4b28a6ea5a0560c5a3c2e6dec52272c0/218f3af31162c0199ca266130c18209c#14
domain: SpatialThing
domain: http://lodlaundromat.org/.well-known/genid/samples/jena///class//4b28a6ea5a0560c5a3c2e6dec52272c0/218f3af31162c0199ca266130c18209c#11

Locations and Addresses Community Group
type: Thing
type: Agent
type: http://lodlaundromat.org/.well-known/genid/samples/jena///class//4b28a6ea5a0560c5a3c2e6dec52272c0/218f3af31162c0199ca266130c18209c#11
type: http://lodlaundromat.org/.well-known/genid/samples/jena///class//4b28a6ea5a0560c5a3c2e6dec52272c0/218f3af31162c0199ca266130c18209c#14

Registered Organization Vocabulary
creator: Andrea Perego
specializes: org
version info: Second version in w3.org/ns
creator: Makx Dekkers
comment: This file specifies the set of RDF classes and properties used in the Registered Organization Vocabulary
maker: Government Linked Data WG, based on output from the ADMS Working Group
preferred namespace prefix: rov
modified: 2013-05-24
type: Ontology
preferred namespace uri: http://www.w3.org/ns/regorg#
abstract: The Registered Organization Vocabulary is a profile of the Organization Ontology for describing organizations that have gained legal entity status through a formal registration process, typically in a national or regional register.
creator: Phil Archer
description: This is the RDF encoding of the Legal Entity vocabulary, originally developed under the European Commission's ISA Programme.
describedby: Registered Organization Vocabulary
maker: Phil Archer
maker: Makx Dekkers
maker: Andrea Perego
type: Thing
creator: Government Linked Data WG, based on output from the ADMS Working Group

membershipClass
type: Property
type: AnnotationProperty
comment: Indicates the class of individuals that are a member of a Group
term status: unstable

title
type: Property
type: DatatypeProperty
comment: Title (Mr, Mrs, Ms, Dr. etc)
term status: testing

post name
type: Property
comment: The key postal division of the address, usually the city. (INSPIRE's definition is "One or more names created and maintained for postal purposes to identify a subdivision of addresses and postal delivery points."). The domain of locn:postName is locn:Address.
domain: Address
range: Literal
term status: testing
range: Resource
domain: Resource

birthday
type: Property
type: FunctionalProperty
type: DatatypeProperty
comment: The birthday of this Agent, represented in mm-dd string form, eg. '12-31'.
domain: Agent
range: Literal
term status: unstable
range: Resource
domain: Thing
domain: Resource
domain: http://lodlaundromat.org/.well-known/genid/samples/jena///class//4b28a6ea5a0560c5a3c2e6dec52272c0/218f3af31162c0199ca266130c18209c#14
domain: http://lodlaundromat.org/.well-known/genid/samples/jena///class//4b28a6ea5a0560c5a3c2e6dec52272c0/218f3af31162c0199ca266130c18209c#11

sha1sum of a personal mailbox URI name
type: Property
type: InverseFunctionalProperty
type: DatatypeProperty
comment: The sha1sum of the URI of an Internet mailbox associated with exactly one owner, the first owner of the mailbox.
domain: Agent
range: Literal
term status: testing
type: ObjectProperty
range: Resource
domain: Thing
domain: Resource
domain: http://lodlaundromat.org/.well-known/genid/samples/jena///class//4b28a6ea5a0560c5a3c2e6dec52272c0/218f3af31162c0199ca266130c18209c#14
domain: http://lodlaundromat.org/.well-known/genid/samples/jena///class//4b28a6ea5a0560c5a3c2e6dec52272c0/218f3af31162c0199ca266130c18209c#11

DCMI Type Vocabulary
modified: 2012-06-14
publisher: DCMI

Michael Lutz
affiliation: European Commission - Joint Research Centre (JRC)
type: Thing

nickname
type: Property
type: DatatypeProperty
comment: A short informal nickname characterising an agent (includes login identifiers, IRC and other chat nicknames).
term status: testing

address ID
type: Property
comment: The concept of adding a globally unique identifier for each instance of an address is a crucial part of the INSPIRE data spec. The domain of locn:addressId is locn:Address.
domain: Address
range: Literal
term status: unstable
range: Resource
domain: Resource

Shuji Kamitsuna
type: Thing

HTML version of the ISA Programme Location Core Vocabulary
media type: com.hp.hpl.jena.datatypes.BaseDatatype$TypedValue@150ca46d

Skype ID
type: Property
type: DatatypeProperty
comment: A Skype ID
domain: Agent
range: Literal
sub property of: nickname
term status: testing
range: Resource
domain: Thing
domain: Resource
domain: http://lodlaundromat.org/.well-known/genid/samples/jena///class//4b28a6ea5a0560c5a3c2e6dec52272c0/218f3af31162c0199ca266130c18209c#14
domain: http://lodlaundromat.org/.well-known/genid/samples/jena///class//4b28a6ea5a0560c5a3c2e6dec52272c0/218f3af31162c0199ca266130c18209c#11

location
comment: Indique la description de l'endroit ou est basé une personne de l'Organisation, par exemple pour des besoins de messagerie interne (Bureau 42). @fr
label: está ubicada en @es
comment: 例えば、内部配送目的のメール・ストップ（Mail Stop）などの、組織内の人の位置記述を提供します。 @ja
type: Property
comment: Gives a location description for a person within the organization, for example a _Mail Stop_ for internal posting purposes.
domain: Person
range: string
label: está ubicado en @es
comment: Indica la descrizione del luogo presso cui è possibile reperire una persona dell'organizzazione. @it
comment: Lugar o ubicación exacta de una persona en una organización con el objetivo de facilitar, por ejemplo, la entrega de correo. @es
label: luogo @it
label: localisation @fr
type: DatatypeProperty
range: Resource
domain: Thing
domain: Agent
domain: Resource
domain: http://lodlaundromat.org/.well-known/genid/samples/jena///class//4b28a6ea5a0560c5a3c2e6dec52272c0/218f3af31162c0199ca266130c18209c#14
domain: SpatialThing
domain: http://lodlaundromat.org/.well-known/genid/samples/jena///class//4b28a6ea5a0560c5a3c2e6dec52272c0/218f3af31162c0199ca266130c18209c#11

ISA Open Metadata Licence v1.1
attribution name: European Commission
attribution URL: http://ec.europa.eu/

head
type: Role
label: directora ejecutiva @es
label: responsabile @it
preferred label: responsable @fr
comment: Un rôle correspondant à la propriété `org:headOf` @fr
comment: Un ruolo corrispondente alla proprietà `org:headOf`. @it
label: director ejecutivo @es
comment: A role corresponding to the `org:headOf` property
comment: Actividad correspondiente a la propiedad `org:headOf`. @es
role (property): head of
type: Concept
type: Thing

thoroughfare
type: Property
comment: An address component that represents the name of a passage or way through from one location to another. A thoroughfare is not necessarily a road, it might be a waterway or some other feature. The domain of locn:thoroughfare is locn:Address.
domain: Address
range: Literal
term status: testing
range: Resource
domain: Resource

Friend of a Friend (FOAF) vocabulary
type: Ontology
description: The Friend of a Friend (FOAF) RDF vocabulary, described using W3C RDF Schema and the Web Ontology Language.

Government Linked Data WG, based on output from the ADMS Working Group
type: Thing
made: Asset Description Metadata Schema (ADMS)
type: Agent
type: http://lodlaundromat.org/.well-known/genid/samples/jena///class//4b28a6ea5a0560c5a3c2e6dec52272c0/218f3af31162c0199ca266130c18209c#11
type: http://lodlaundromat.org/.well-known/genid/samples/jena///class//4b28a6ea5a0560c5a3c2e6dec52272c0/218f3af31162c0199ca266130c18209c#14

Olga Ximena Giraldo
type: Thing
type: Agent
type: http://lodlaundromat.org/.well-known/genid/samples/jena///class//4b28a6ea5a0560c5a3c2e6dec52272c0/218f3af31162c0199ca266130c18209c#11
type: http://lodlaundromat.org/.well-known/genid/samples/jena///class//4b28a6ea5a0560c5a3c2e6dec52272c0/218f3af31162c0199ca266130c18209c#14

firstName
type: Property
type: DatatypeProperty
comment: The first name of a person.
domain: Person
range: Literal
term status: testing
range: Resource
domain: Thing
domain: Agent
domain: Resource
domain: http://lodlaundromat.org/.well-known/genid/samples/jena///class//4b28a6ea5a0560c5a3c2e6dec52272c0/218f3af31162c0199ca266130c18209c#14
domain: SpatialThing
domain: http://lodlaundromat.org/.well-known/genid/samples/jena///class//4b28a6ea5a0560c5a3c2e6dec52272c0/218f3af31162c0199ca266130c18209c#11

Given name
type: Property
type: DatatypeProperty
comment: The given name of some person.
term status: archaic

geometry
usage note: Depending on how a geometry is encoded, the range of this property may be one of the following: - a literal (e.g., WKT - string literal -, GML, KML - XML literal) - a geometry class, as those defined in the OGC's GeoSPARQL specification, in the W3C's Basic Geo (WGS84 lat/long) vocabulary, and at schema.org; - geocoded URIs, as geo or GeoHash URIs, treated as URI references. For interoperability reasons, it is recommended using one of the following: - Any geometry: - WKT, GML, and RDF+WKT/GML, as per the GeoSPARQL specification. - KML (Keyhole Markup Language) - note that KML supports the following geometries only: point, line string, linear ring, and polygon. - RDF as per the schema.org vocabulary (see classes schema:GeoCoordinates and schema:GeoShape). - Points: one of the above, or: - RDF as per the W3C Basic Geo (WGS84 lat/long) vocabulary. - GeoHash URIs. - geo URIs.
describedby: Core Vocabularies Specification
range: Geometry
type: Property
example: The following are examples of equivalent statements using different geometry encodings. In the examples, prefix gsp is used for namespace URI http://www.opengis.net/ont/geosparql#, whereas prefix sf is used for namespace URI http://www.opengis.net/ont/sf#. - WKT (GeoSPARQL) :Resource locn:geometry "<http://www.opengis.net/def/crs/OGC/1.3/CRS84> Point(-0.001475 51.477811)"^^gsp:wktLiteral - GML :Resource locn:geometry "<gml:Point srsName='http://www.opengis.net/def/crs/OGC/1.3/CRS84'> <gml:coordinates>-0.001475, 51.477811</gml:coordinates></gml:Point>"^^gsp:gmlLiteral - RDF+WKT (GeoSPARQL) :Resource locn:geometry [ a sf:Point; gsp:asWKT "<http://www.opengis.net/def/crs/OGC/1.3/CRS84> Point(-0.001475 51.477811)"^^gsp:wktLiteral ] - RDF+GML (GeoSPARQL) :Resource locn:geometry [ a sf:Point; gsp:asGML "<gml:Point srsName='http://www.opengis.net/def/crs/OGC/1.3/CRS84'> <gml:coordinates>-0.001475, 51.477811</gml:coordinates></gml:Point>"^^gsp:gmlLiteral ] - RDF (WGS84 lat/long) :Resource locn:geometry [ a geo:Point; geo:lat "51.477811"; geo:long "-0.001475" ] - RDF (schema.org) :Resource locn:geometry [ a schema:GeoCoordinates; schema:latitude "51.477811"; schema:longitude "-0.001475" ] - geo URI :Resource locn:geometry <geo:51.477811,-0.001475;u=0;crs=wgs84> - GeoHash URI :Resource locn:geometry <http://geohash.org/gcpuzgnzvxkp>
comment: Associates any resource with the corresponding geometry.
term status: testing
range: Resource

familyName
type: Property
type: DatatypeProperty
comment: The family name of some person.
domain: Person
range: Literal
term status: testing
range: Resource
domain: Thing
domain: Agent
domain: Resource
domain: http://lodlaundromat.org/.well-known/genid/samples/jena///class//4b28a6ea5a0560c5a3c2e6dec52272c0/218f3af31162c0199ca266130c18209c#14
domain: SpatialThing
domain: http://lodlaundromat.org/.well-known/genid/samples/jena///class//4b28a6ea5a0560c5a3c2e6dec52272c0/218f3af31162c0199ca266130c18209c#11

admin unit level 2
type: Property
comment: The region of the address, usually a county, state or other such area that typically encompasses several localities. The domain of locn:adminUnitL2 is locn:Address and the range is a literal, conceptually defined by the INSPIRE Geographical Name data type.
domain: Address
term status: testing
domain: Resource

Andrea Perego
affiliation: European Commission - Joint Research Centre (JRC)
type: Thing