bibtex ontology
type: Ontology
creator: Nick Knouf <nknouf@mit.edu>
description: Transformation of bibTeX into an OWL ontology
date: 2003-12-29
subject: fMRI, ontology, fMRI analysis
title: bibtex.owl: an ontology for bibTeX entries
comment: Possible ontology to describe bibTeX entries.
version info: 0.2

Nicholas Knouf
type: AnnotationProperty

Entry
type: Class
comment: Base class for all entries

Article
type: Class
subclass of: Entry
comment: An article from a journal or magazine.
subclass of: http://lodlaundromat.org/.well-known/genid/samples/pellet///predicate//46e04988a830ebbb36146dcc45a054ba/47af41abce9250360c3273909ead10b6#1
subclass of: http://lodlaundromat.org/.well-known/genid/samples/pellet///predicate//46e04988a830ebbb36146dcc45a054ba/47af41abce9250360c3273909ead10b6#2
subclass of: http://lodlaundromat.org/.well-known/genid/samples/pellet///predicate//46e04988a830ebbb36146dcc45a054ba/47af41abce9250360c3273909ead10b6#3
subclass of: http://lodlaundromat.org/.well-known/genid/samples/pellet///predicate//46e04988a830ebbb36146dcc45a054ba/47af41abce9250360c3273909ead10b6#4

http://lodlaundromat.org/.well-known/genid/samples/pellet///predicate//46e04988a830ebbb36146dcc45a054ba/47af41abce9250360c3273909ead10b6#1
type: Restriction
on property: has author
min cardinality: 1

http://lodlaundromat.org/.well-known/genid/samples/pellet///predicate//46e04988a830ebbb36146dcc45a054ba/47af41abce9250360c3273909ead10b6#2
type: Restriction
on property: has title
min cardinality: 1

http://lodlaundromat.org/.well-known/genid/samples/pellet///predicate//46e04988a830ebbb36146dcc45a054ba/47af41abce9250360c3273909ead10b6#3
type: Restriction
on property: has journal
min cardinality: 1

http://lodlaundromat.org/.well-known/genid/samples/pellet///predicate//46e04988a830ebbb36146dcc45a054ba/47af41abce9250360c3273909ead10b6#4
type: Restriction
on property: has year
min cardinality: 1

Book
type: Class
subclass of: Entry
comment: A book with an explicit publisher.
subclass of: http://lodlaundromat.org/.well-known/genid/samples/pellet///predicate//46e04988a830ebbb36146dcc45a054ba/47af41abce9250360c3273909ead10b6#5
subclass of: http://lodlaundromat.org/.well-known/genid/samples/pellet///predicate//46e04988a830ebbb36146dcc45a054ba/47af41abce9250360c3273909ead10b6#6
subclass of: http://lodlaundromat.org/.well-known/genid/samples/pellet///predicate//46e04988a830ebbb36146dcc45a054ba/47af41abce9250360c3273909ead10b6#7
subclass of: http://lodlaundromat.org/.well-known/genid/samples/pellet///predicate//46e04988a830ebbb36146dcc45a054ba/47af41abce9250360c3273909ead10b6#8

http://lodlaundromat.org/.well-known/genid/samples/pellet///predicate//46e04988a830ebbb36146dcc45a054ba/47af41abce9250360c3273909ead10b6#5
type: Restriction
on property: human creator
min cardinality: 1
description: One thing to figure out is whether or not this tells us what we want; that is, does this imply that we must have at least one property of humanCreator, which could be either hasAuthor or hasEditor?

http://lodlaundromat.org/.well-known/genid/samples/pellet///predicate//46e04988a830ebbb36146dcc45a054ba/47af41abce9250360c3273909ead10b6#6
type: Restriction
on property: has title
min cardinality: 1

http://lodlaundromat.org/.well-known/genid/samples/pellet///predicate//46e04988a830ebbb36146dcc45a054ba/47af41abce9250360c3273909ead10b6#7
type: Restriction
on property: has publisher
min cardinality: 1

http://lodlaundromat.org/.well-known/genid/samples/pellet///predicate//46e04988a830ebbb36146dcc45a054ba/47af41abce9250360c3273909ead10b6#8
type: Restriction
on property: has year
min cardinality: 1

Booklet
type: Class
subclass of: Entry
comment: A work that is printed and bound, but without a named publisher or sponsoring institution.
subclass of: http://lodlaundromat.org/.well-known/genid/samples/pellet///predicate//46e04988a830ebbb36146dcc45a054ba/47af41abce9250360c3273909ead10b6#9

http://lodlaundromat.org/.well-known/genid/samples/pellet///predicate//46e04988a830ebbb36146dcc45a054ba/47af41abce9250360c3273909ead10b6#9
type: Restriction
on property: has title
min cardinality: 1

Conference
type: Class
subclass of: Entry
equivalent class: Inproceedings
comment: The same as INPROCEEDINGS, included for Scribe compatibility.

Inbook
type: Class
subclass of: Entry
comment: A part of a book, which may be a chapter (or section or whatever) and/or a range of pages.
subclass of: http://lodlaundromat.org/.well-known/genid/samples/pellet///predicate//46e04988a830ebbb36146dcc45a054ba/47af41abce9250360c3273909ead10b6#10
subclass of: http://lodlaundromat.org/.well-known/genid/samples/pellet///predicate//46e04988a830ebbb36146dcc45a054ba/47af41abce9250360c3273909ead10b6#11
subclass of: http://lodlaundromat.org/.well-known/genid/samples/pellet///predicate//46e04988a830ebbb36146dcc45a054ba/47af41abce9250360c3273909ead10b6#12
subclass of: http://lodlaundromat.org/.well-known/genid/samples/pellet///predicate//46e04988a830ebbb36146dcc45a054ba/47af41abce9250360c3273909ead10b6#13
subclass of: http://lodlaundromat.org/.well-known/genid/samples/pellet///predicate//46e04988a830ebbb36146dcc45a054ba/47af41abce9250360c3273909ead10b6#14

http://lodlaundromat.org/.well-known/genid/samples/pellet///predicate//46e04988a830ebbb36146dcc45a054ba/47af41abce9250360c3273909ead10b6#10
type: Restriction
on property: human creator
min cardinality: 1
description: One thing to figure out is whether or not this tells us what we want; that is, does this imply that we must have at least one property of humanCreator, which could be either hasAuthor or hasEditor?

http://lodlaundromat.org/.well-known/genid/samples/pellet///predicate//46e04988a830ebbb36146dcc45a054ba/47af41abce9250360c3273909ead10b6#11
type: Restriction
on property: page and/or chapter data
min cardinality: 1

http://lodlaundromat.org/.well-known/genid/samples/pellet///predicate//46e04988a830ebbb36146dcc45a054ba/47af41abce9250360c3273909ead10b6#12
type: Restriction
on property: has title
min cardinality: 1

http://lodlaundromat.org/.well-known/genid/samples/pellet///predicate//46e04988a830ebbb36146dcc45a054ba/47af41abce9250360c3273909ead10b6#13
type: Restriction
on property: has publisher
min cardinality: 1

http://lodlaundromat.org/.well-known/genid/samples/pellet///predicate//46e04988a830ebbb36146dcc45a054ba/47af41abce9250360c3273909ead10b6#14
type: Restriction
on property: has year
min cardinality: 1

Incollection
type: Class
subclass of: Entry
comment: A part of a book having its own title.
subclass of: http://lodlaundromat.org/.well-known/genid/samples/pellet///predicate//46e04988a830ebbb36146dcc45a054ba/47af41abce9250360c3273909ead10b6#15
subclass of: http://lodlaundromat.org/.well-known/genid/samples/pellet///predicate//46e04988a830ebbb36146dcc45a054ba/47af41abce9250360c3273909ead10b6#16
subclass of: http://lodlaundromat.org/.well-known/genid/samples/pellet///predicate//46e04988a830ebbb36146dcc45a054ba/47af41abce9250360c3273909ead10b6#17
subclass of: http://lodlaundromat.org/.well-known/genid/samples/pellet///predicate//46e04988a830ebbb36146dcc45a054ba/47af41abce9250360c3273909ead10b6#18
subclass of: http://lodlaundromat.org/.well-known/genid/samples/pellet///predicate//46e04988a830ebbb36146dcc45a054ba/47af41abce9250360c3273909ead10b6#19

http://lodlaundromat.org/.well-known/genid/samples/pellet///predicate//46e04988a830ebbb36146dcc45a054ba/47af41abce9250360c3273909ead10b6#15
type: Restriction
on property: has author
min cardinality: 1

http://lodlaundromat.org/.well-known/genid/samples/pellet///predicate//46e04988a830ebbb36146dcc45a054ba/47af41abce9250360c3273909ead10b6#16
type: Restriction
on property: has title
min cardinality: 1

http://lodlaundromat.org/.well-known/genid/samples/pellet///predicate//46e04988a830ebbb36146dcc45a054ba/47af41abce9250360c3273909ead10b6#17
type: Restriction
on property: has booktitle
min cardinality: 1

http://lodlaundromat.org/.well-known/genid/samples/pellet///predicate//46e04988a830ebbb36146dcc45a054ba/47af41abce9250360c3273909ead10b6#18
type: Restriction
on property: has publisher
min cardinality: 1

http://lodlaundromat.org/.well-known/genid/samples/pellet///predicate//46e04988a830ebbb36146dcc45a054ba/47af41abce9250360c3273909ead10b6#19
type: Restriction
on property: has year
min cardinality: 1

Inproceedings
type: Class
subclass of: Entry
comment: An article in a conference proceedings.
subclass of: http://lodlaundromat.org/.well-known/genid/samples/pellet///predicate//46e04988a830ebbb36146dcc45a054ba/47af41abce9250360c3273909ead10b6#20
subclass of: http://lodlaundromat.org/.well-known/genid/samples/pellet///predicate//46e04988a830ebbb36146dcc45a054ba/47af41abce9250360c3273909ead10b6#21
subclass of: http://lodlaundromat.org/.well-known/genid/samples/pellet///predicate//46e04988a830ebbb36146dcc45a054ba/47af41abce9250360c3273909ead10b6#22
subclass of: http://lodlaundromat.org/.well-known/genid/samples/pellet///predicate//46e04988a830ebbb36146dcc45a054ba/47af41abce9250360c3273909ead10b6#23

http://lodlaundromat.org/.well-known/genid/samples/pellet///predicate//46e04988a830ebbb36146dcc45a054ba/47af41abce9250360c3273909ead10b6#20
type: Restriction
on property: has author
min cardinality: 1

http://lodlaundromat.org/.well-known/genid/samples/pellet///predicate//46e04988a830ebbb36146dcc45a054ba/47af41abce9250360c3273909ead10b6#21
type: Restriction
on property: has title
min cardinality: 1

http://lodlaundromat.org/.well-known/genid/samples/pellet///predicate//46e04988a830ebbb36146dcc45a054ba/47af41abce9250360c3273909ead10b6#22
type: Restriction
on property: has booktitle
min cardinality: 1

http://lodlaundromat.org/.well-known/genid/samples/pellet///predicate//46e04988a830ebbb36146dcc45a054ba/47af41abce9250360c3273909ead10b6#23
type: Restriction
on property: has year
min cardinality: 1

Manual
type: Class
subclass of: Entry
comment: Technical documentation.
subclass of: http://lodlaundromat.org/.well-known/genid/samples/pellet///predicate//46e04988a830ebbb36146dcc45a054ba/47af41abce9250360c3273909ead10b6#24

http://lodlaundromat.org/.well-known/genid/samples/pellet///predicate//46e04988a830ebbb36146dcc45a054ba/47af41abce9250360c3273909ead10b6#24
type: Restriction
on property: has title
min cardinality: 1

Mastersthesis
type: Class
subclass of: Entry
comment: A Master's thesis.
subclass of: http://lodlaundromat.org/.well-known/genid/samples/pellet///predicate//46e04988a830ebbb36146dcc45a054ba/47af41abce9250360c3273909ead10b6#25
subclass of: http://lodlaundromat.org/.well-known/genid/samples/pellet///predicate//46e04988a830ebbb36146dcc45a054ba/47af41abce9250360c3273909ead10b6#26
subclass of: http://lodlaundromat.org/.well-known/genid/samples/pellet///predicate//46e04988a830ebbb36146dcc45a054ba/47af41abce9250360c3273909ead10b6#27
subclass of: http://lodlaundromat.org/.well-known/genid/samples/pellet///predicate//46e04988a830ebbb36146dcc45a054ba/47af41abce9250360c3273909ead10b6#28

http://lodlaundromat.org/.well-known/genid/samples/pellet///predicate//46e04988a830ebbb36146dcc45a054ba/47af41abce9250360c3273909ead10b6#25
type: Restriction
on property: has author
min cardinality: 1

http://lodlaundromat.org/.well-known/genid/samples/pellet///predicate//46e04988a830ebbb36146dcc45a054ba/47af41abce9250360c3273909ead10b6#26
type: Restriction
on property: has title
min cardinality: 1

http://lodlaundromat.org/.well-known/genid/samples/pellet///predicate//46e04988a830ebbb36146dcc45a054ba/47af41abce9250360c3273909ead10b6#27
type: Restriction
on property: has school
min cardinality: 1

http://lodlaundromat.org/.well-known/genid/samples/pellet///predicate//46e04988a830ebbb36146dcc45a054ba/47af41abce9250360c3273909ead10b6#28
type: Restriction
on property: has year
min cardinality: 1

Misc
type: Class
subclass of: Entry
comment: Use this type when nothing else fits.

Phdthesis
type: Class
subclass of: Entry
comment: A PhD thesis.
subclass of: http://lodlaundromat.org/.well-known/genid/samples/pellet///predicate//46e04988a830ebbb36146dcc45a054ba/47af41abce9250360c3273909ead10b6#29
subclass of: http://lodlaundromat.org/.well-known/genid/samples/pellet///predicate//46e04988a830ebbb36146dcc45a054ba/47af41abce9250360c3273909ead10b6#30
subclass of: http://lodlaundromat.org/.well-known/genid/samples/pellet///predicate//46e04988a830ebbb36146dcc45a054ba/47af41abce9250360c3273909ead10b6#31
subclass of: http://lodlaundromat.org/.well-known/genid/samples/pellet///predicate//46e04988a830ebbb36146dcc45a054ba/47af41abce9250360c3273909ead10b6#32

http://lodlaundromat.org/.well-known/genid/samples/pellet///predicate//46e04988a830ebbb36146dcc45a054ba/47af41abce9250360c3273909ead10b6#29
type: Restriction
on property: has author
min cardinality: 1

http://lodlaundromat.org/.well-known/genid/samples/pellet///predicate//46e04988a830ebbb36146dcc45a054ba/47af41abce9250360c3273909ead10b6#30
type: Restriction
on property: has title
min cardinality: 1

http://lodlaundromat.org/.well-known/genid/samples/pellet///predicate//46e04988a830ebbb36146dcc45a054ba/47af41abce9250360c3273909ead10b6#31
type: Restriction
on property: has school
min cardinality: 1

http://lodlaundromat.org/.well-known/genid/samples/pellet///predicate//46e04988a830ebbb36146dcc45a054ba/47af41abce9250360c3273909ead10b6#32
type: Restriction
on property: has year
min cardinality: 1

Proceedings
type: Class
subclass of: Entry
comment: The proceedings of a conference.
subclass of: http://lodlaundromat.org/.well-known/genid/samples/pellet///predicate//46e04988a830ebbb36146dcc45a054ba/47af41abce9250360c3273909ead10b6#33
subclass of: http://lodlaundromat.org/.well-known/genid/samples/pellet///predicate//46e04988a830ebbb36146dcc45a054ba/47af41abce9250360c3273909ead10b6#34

http://lodlaundromat.org/.well-known/genid/samples/pellet///predicate//46e04988a830ebbb36146dcc45a054ba/47af41abce9250360c3273909ead10b6#33
type: Restriction
on property: has title
min cardinality: 1

http://lodlaundromat.org/.well-known/genid/samples/pellet///predicate//46e04988a830ebbb36146dcc45a054ba/47af41abce9250360c3273909ead10b6#34
type: Restriction
on property: has year
min cardinality: 1

Techreport
type: Class
subclass of: Entry
comment: A report published by a school or other institution, usually numbered within a series.
subclass of: http://lodlaundromat.org/.well-known/genid/samples/pellet///predicate//46e04988a830ebbb36146dcc45a054ba/47af41abce9250360c3273909ead10b6#35
subclass of: http://lodlaundromat.org/.well-known/genid/samples/pellet///predicate//46e04988a830ebbb36146dcc45a054ba/47af41abce9250360c3273909ead10b6#36
subclass of: http://lodlaundromat.org/.well-known/genid/samples/pellet///predicate//46e04988a830ebbb36146dcc45a054ba/47af41abce9250360c3273909ead10b6#37
subclass of: http://lodlaundromat.org/.well-known/genid/samples/pellet///predicate//46e04988a830ebbb36146dcc45a054ba/47af41abce9250360c3273909ead10b6#38

http://lodlaundromat.org/.well-known/genid/samples/pellet///predicate//46e04988a830ebbb36146dcc45a054ba/47af41abce9250360c3273909ead10b6#35
type: Restriction
on property: has author
min cardinality: 1

http://lodlaundromat.org/.well-known/genid/samples/pellet///predicate//46e04988a830ebbb36146dcc45a054ba/47af41abce9250360c3273909ead10b6#36
type: Restriction
on property: has title
min cardinality: 1

http://lodlaundromat.org/.well-known/genid/samples/pellet///predicate//46e04988a830ebbb36146dcc45a054ba/47af41abce9250360c3273909ead10b6#37
type: Restriction
on property: has institution
min cardinality: 1

http://lodlaundromat.org/.well-known/genid/samples/pellet///predicate//46e04988a830ebbb36146dcc45a054ba/47af41abce9250360c3273909ead10b6#38
type: Restriction
on property: has year
min cardinality: 1

Unpublished
type: Class
subclass of: Entry
comment: A document having an author and title, but not formally published.
subclass of: http://lodlaundromat.org/.well-known/genid/samples/pellet///predicate//46e04988a830ebbb36146dcc45a054ba/47af41abce9250360c3273909ead10b6#39
subclass of: http://lodlaundromat.org/.well-known/genid/samples/pellet///predicate//46e04988a830ebbb36146dcc45a054ba/47af41abce9250360c3273909ead10b6#40
subclass of: http://lodlaundromat.org/.well-known/genid/samples/pellet///predicate//46e04988a830ebbb36146dcc45a054ba/47af41abce9250360c3273909ead10b6#41

http://lodlaundromat.org/.well-known/genid/samples/pellet///predicate//46e04988a830ebbb36146dcc45a054ba/47af41abce9250360c3273909ead10b6#39
type: Restriction
on property: has author
min cardinality: 1

http://lodlaundromat.org/.well-known/genid/samples/pellet///predicate//46e04988a830ebbb36146dcc45a054ba/47af41abce9250360c3273909ead10b6#40
type: Restriction
on property: has title
min cardinality: 1

http://lodlaundromat.org/.well-known/genid/samples/pellet///predicate//46e04988a830ebbb36146dcc45a054ba/47af41abce9250360c3273909ead10b6#41
type: Restriction
on property: has note
min cardinality: 1

has key
type: DatatypeProperty
domain: Entry
range: string
comment: The key for a particular bibTeX entry. Note that the rdf:ID for each Entry instance could be the bibTeX key as well, possibly making this property redundant.

has address
type: DatatypeProperty
domain: Entry
range: string
comment: Usually the address of the publisher or other type of institution. For major publishing houses, van Leunen recommends omitting the information entirely. For small publishers, on the other hand, you can help the reader by giving the complete address.

has annotation
type: DatatypeProperty
domain: Entry
range: string
comment: An annotation. It is not used by the standard bibliography styles, but may be used by others that produce an annotated bibliography.

has author
type: DatatypeProperty
domain: Entry
range: string
sub property of: human creator
comment: The name(s) of the author(s), in the format described in the LaTeX book.
description: This is tricky due to the fact that order is not (generally) preserved in RDF documents. The problem arises when you want to have an author list where the order is _extremely_ important. How shall we do that? Perhaps we want to define "hasPrimaryAuthor", "hasSecondaryAuthor", "hasTertiaryAuthor", and "hasRemainingAuthors", or something of that sort. This will be have to given more thought.

has booktitle
type: DatatypeProperty
domain: Entry
range: string
comment: Title of a book, part of which is being cited. See the LaTeX book for how to type titles. For book entries, use the title field instead.

has chapter
type: DatatypeProperty
domain: Entry
range: nonNegativeInteger
sub property of: page and/or chapter data
comment: A chapter (or section or whatever) number.

has crossref
type: DatatypeProperty
domain: Entry
range: string
comment: The database key of the entry being cross referenced.

has edition
type: DatatypeProperty
domain: Entry
range: string
comment: The edition of a book--for example, "Second". This should be an ordinal, and should have the first letter capitalized, as shown here; the standard styles convert to lower case when necessary.

has editor
type: DatatypeProperty
domain: Entry
range: string
sub property of: human creator
comment: Name(s) of editor(s), typed as indicated in the LaTeX book. If there is also an author field, then the editor field gives the editor of the book or collection in which the reference appears.
description: Again, the same issues that arose with the "hasAuthor" property apply here.

how published
type: DatatypeProperty
domain: Entry
range: string
comment: How something strange has been published. The first word should be capitalized.

has institution
type: DatatypeProperty
domain: Entry
range: string
comment: The sponsoring institution of a technical report.
description: This could be an object property that refers to an external set of institution instances.

has journal
type: DatatypeProperty
domain: Entry
range: string
comment: A journal name. Abbreviations are provided for many journals; see the Local Guide
description: This could optionally be an object property, whereby the range would refer to an external set of journal instances, thus providing standardized abbreviations for different bibliographic styles.

has month
type: DatatypeProperty
domain: Entry
range: string
comment: The month in which the work was published or, for an unpublished work, in which it was written. You should use the standard three-letter abbreviation, as described in Appendix B.1.3 of the LaTeX book.

has note
type: DatatypeProperty
domain: Entry
range: string
comment: Any additional information that can help the reader. The first word should be capitalized.

has number
type: DatatypeProperty
domain: Entry
range: string
comment: The number of a journal, magazine, technical report, or of a work in a series. An issue of a journal or magazine is usually identified by its volume and number; the organization that issues a technical report usually gives it a number; and sometimes books are given numbers in a named series.

has organization
type: DatatypeProperty
domain: Entry
range: string
comment: The organization that sponsors a conference or that publishes a manual.

has pages
type: DatatypeProperty
domain: Entry
range: string
sub property of: page and/or chapter data
comment: One or more page numbers or range of numbers, such as 42-111 or 7,41,73-97 or 43+ (the `+' in this last example indicates pages following that don't form a simple range). To make it easier to maintain Scribe-compatible databases, the standard styles convert a single dash (as in 7-33) to the double dash used in TeX to denote number ranges (as in 7-33).

has publisher
type: DatatypeProperty
domain: Entry
range: string
comment: The publisher's name.
description: This is a case where an ObjectProperty might be a better choice, where the range is some set of publisher names defined in another ontology. That would allow all of the metadata for the publisher to be incorporated as needed.

has school
type: DatatypeProperty
domain: Entry
range: string
comment: The name of the school where a thesis was written.
description: As with "hasPublisher", this could be an ObjectProperty that refers to an external set of school instances.

has series
type: DatatypeProperty
domain: Entry
range: string
comment: The name of a series or set of books. When citing an entire book, the the title field gives its title and an optional series field gives the name of a series or multi-volume set in which the book is published.

has title
type: DatatypeProperty
domain: Entry
range: string
comment: The work's title, typed as explained in the LaTeX book.

has type
type: DatatypeProperty
domain: Entry
range: string
comment: The type of a technical report--for example, "Research Note".

has volume
type: DatatypeProperty
domain: Entry
range: nonNegativeInteger
comment: The volume of a journal or multivolume book.

has year
type: DatatypeProperty
domain: Entry
range: nonNegativeInteger
comment: The year of publication or, for an unpublished work, the year it was written. Generally it should consist of four numerals, such as 1984, although the standard styles can handle any year whose last four nonpunctuation characters are numerals, such as '(about 1984)'.

has affiliation
type: DatatypeProperty
domain: Entry
range: string
comment: The authors affiliation.

has abstract
type: DatatypeProperty
domain: Entry
range: string
comment: An abstract of the work.

has contents
type: DatatypeProperty
domain: Entry
range: string
comment: A Table of Contents.

has copyright
type: DatatypeProperty
domain: Entry
range: string
comment: Copyright information.

has ISBN
type: DatatypeProperty
domain: Entry
range: string
comment: The International Standard Book Number.

has ISSN
type: DatatypeProperty
domain: Entry
range: string
comment: The International Standard Serial Number. Used to identify a journal.

has keywords
type: DatatypeProperty
domain: Entry
range: string
comment: Key words used for searching or possibly for annotation.

has language
type: DatatypeProperty
domain: Entry
range: string
comment: The language the document is in.

has location
type: DatatypeProperty
domain: Entry
range: string
comment: A location associated with the entry, such as the city in which a conference took place.

has LCCN
type: DatatypeProperty
domain: Entry
range: string
comment: The Library of Congress Call Number.

has mrnumber
type: DatatypeProperty
domain: Entry
range: string
comment: The Mathematical Reviews number.

has price
type: DatatypeProperty
domain: Entry
range: string
comment: The price of the document.

has size
type: DatatypeProperty
domain: Entry
range: string
comment: The physical dimensions of a work.

has URL
type: DatatypeProperty
domain: Entry
range: string
comment: The WWW Universal Resource Locator that points to the item being referenced. This often is used for technical reports to point to the ftp or web site where the postscript source of the report is located.

human creator
type: DatatypeProperty
domain: Entry
range: string
comment: A generic human creator category, necessary in order to contain both author and editor.

page and/or chapter data
type: DatatypeProperty
domain: Entry
comment: A generic property to hold page and/or chapter data.