Sixth
comment: The sixth foaf:Agent in an AgentSequence .
publisher: DERI International
type: ObjectProperty
format: application/rdf+xml
type: http://www.w3.org/2002/07/owl#ObjectProperty
coverage: world
date: 2004-10-20
rights: http://www.deri.org/privacy.html
domain: AgentSequence
range: Agent
creator: DERI International

Organization
rights: http://www.deri.org/privacy.html
comment: This class represents an organization with a formal legal status. We introduce this class as a subclass of foaf:Organization and foaf:Group , because we consider an organization as a kind of group.
date: 2004-10-20
type: http://www.w3.org/2002/07/owl#Class
coverage: world
subclass of: Group
creator: DERI International
type: Class
publisher: DERI International
format: application/rdf+xml
subclass of: Organization

Made
description: "Something that was made by this agent." In the context of the SWPortal ontology, this could e.g. be an Tool .
type: http://www.w3.org/2002/07/owl#ObjectProperty
domain: Agent
type: ObjectProperty
coverage: world
contributor: http://rdfweb.org/mailman/listinfo/rdfweb-dev
range: http://lodlaundromat.org/.well-known/genid/samples/pellet///predicate//46e04988a830ebbb36146dcc45a054ba/240cd8d701a3c44280314a4f06cca6bb#3
creator: Dan Brickley
format: application/rdf+xml
contributor: http://www.w3.org/RDF/Interest/
publisher: Libby Miller
creator: Libby Miller
publisher: Dan Brickley

hasZipcode
coverage: world
date: 2004-10-20
rights: http://www.deri.org/privacy.html
comment: The zipcode of some PostalAddress (if applicable). This is simply a string with no prescribed syntax.
publisher: DERI International
domain: Postal Address
range: string
type: http://www.w3.org/2002/07/owl#DatatypeProperty
format: application/rdf+xml
type: DatatypeProperty
creator: DERI International

Group
description: "A class of Agents. The foaf:Group classs represents a collection of individual agents (and may itself play the role of a foaf:Agent , i.e. something that can perform actions)."
subclass of: Agent
type: Class
type: http://www.w3.org/2000/01/rdf-schema#Class
publisher: Libby Miller
publisher: Dan Brickley
coverage: world
creator: Libby Miller
creator: Dan Brickley
contributor: http://www.w3.org/RDF/Interest/
contributor: http://rdfweb.org/mailman/listinfo/rdfweb-dev
format: application/rdf+xml

Eigth
creator: DERI International
type: ObjectProperty
coverage: world
publisher: DERI International
comment: The eigth foaf:Agent in an AgentSequence .
rights: http://www.deri.org/privacy.html
domain: AgentSequence
format: application/rdf+xml
range: Agent
date: 2004-10-20
type: http://www.w3.org/2002/07/owl#ObjectProperty

Knows
type: http://www.w3.org/2002/07/owl#ObjectProperty
contributor: http://www.w3.org/RDF/Interest/
type: ObjectProperty
domain: Person
comment: "A person known by this person (indicating some level of reciprocated interaction between the parties)."
coverage: world
creator: Dan Brickley
creator: Libby Miller
range: Person
publisher: Dan Brickley
format: application/rdf+xml
contributor: http://rdfweb.org/mailman/listinfo/rdfweb-dev
publisher: Libby Miller

Workshop
type: Class
date: 2004-10-20
comment: This class represents all kinds of workshops
creator: DERI International
rights: http://www.deri.org/privacy.html
format: application/rdf+xml
publisher: DERI International
subclass of: Event
type: http://www.w3.org/2002/07/owl#Class
coverage: world

Volume
description: An individual volume of some Journal .
type: Class
type: http://www.w3.org/2000/01/rdf-schema#Class
publisher: DERI International
creator: DERI International
format: application/rdf+xml
subclass of: Dated Publication
date: 2004-10-20
coverage: world
rights: http://www.deri.org/privacy.html

Contains Papers
format: application/rdf+xml
type: http://www.w3.org/2002/07/owl#ObjectProperty
domain: Proceedings
type: ObjectProperty
creator: DERI International
publisher: DERI International
coverage: world
description: The papers or similar which a proceedings contains.
rights: http://www.deri.org/privacy.html
inverse of: Contained in Proceedings
range: Inproceedings
date: 2004-10-20

Edition
range: nonNegativeInteger
format: application/rdf+xml
rights: http://www.deri.org/privacy.html
date: 2004-10-20
description: The edition of a book---for example, ``Second''. This should be an ordinal, and should have the first letter capitalized, as shown here; the standard styles convert to lower case when necessary.
type: FunctionalProperty
type: http://www.w3.org/2002/07/owl#DatatypeProperty
coverage: world
domain: Book
creator: DERI International
type: DatatypeProperty
publisher: DERI International

First
type: ObjectProperty
description: The first foaf:Agent in an AgentSequence .
domain: AgentSequence
publisher: DERI International
rights: http://www.deri.org/privacy.html
range: Agent
format: application/rdf+xml
coverage: world
type: http://www.w3.org/2002/07/owl#ObjectProperty
date: 2004-10-20
creator: DERI International

AgentSequence
description: This is an adhoc solution for creating and ordered group of Agents, e.g. an authorlist.
publisher: DERI International
type: http://www.w3.org/2000/01/rdf-schema#Class
format: application/rdf+xml
date: 2004-10-20
coverage: world
type: Class
creator: DERI International
rights: http://www.deri.org/privacy.html

Agent
contributor: http://rdfweb.org/mailman/listinfo/rdfweb-dev
description: "An agent (e.g. person, group, software or physical artifact)." NOTE: We adopted this concept partially from the FOAF ontology. However, in our ontology the agent concept does not comprise the subclasses software and physical artifact. We decided to introduce this main concept in order to make the range of e.g. the attribute authors of a publication more general.
format: application/rdf+xml
creator: Libby Miller
creator: Dan Brickley
type: Class
contributor: http://www.w3.org/RDF/Interest/
publisher: Dan Brickley
type: http://www.w3.org/2000/01/rdf-schema#Class
publisher: Libby Miller
coverage: world

Endtime
domain: http://lodlaundromat.org/.well-known/genid/samples/pellet///predicate//46e04988a830ebbb36146dcc45a054ba/240cd8d701a3c44280314a4f06cca6bb#15
type: FunctionalProperty
range: time
type: ObjectProperty
format: application/rdf+xml
type: http://www.w3.org/2002/07/owl#FunctionalProperty
creator: DERI International
publisher: DERI International
rights: http://www.deri.org/privacy.html
comment: The time when some event ends.
coverage: world
date: 2004-10-20

TechnicalStaff
rights: http://www.deri.org/privacy.html
publisher: DERI International
creator: DERI International
type: http://www.w3.org/2002/07/owl#Class
type: Class
comment: This class represents all kinds of administrative staff that is employed for technical issues. Examples are system administrators, hardware specialists, etc.
date: 2004-10-20
coverage: world
subclass of: Administrative Staff
format: application/rdf+xml

Lecturer
format: application/rdf+xml
publisher: DERI International
date: 2004-10-20
type: ObjectProperty
type: http://www.w3.org/2002/07/owl#ObjectProperty
description: The agent who is giving the lecture.
domain: Lecture
creator: DERI International
rights: http://www.deri.org/privacy.html
coverage: world
range: Agent

Sub-City
type: Class
description: This class defines geopraphical bodies that can be contained in cities.
date: 2004-10-20
coverage: world
rights: http://www.deri.org/privacy.html
subclass of: Sub-Region
publisher: DERI International
creator: DERI International
type: http://www.w3.org/2000/01/rdf-schema#Class
format: application/rdf+xml

Country
rights: http://www.deri.org/privacy.html
date: 2004-10-20
type: Class
subclass of: Sub-Continent
comment: This class defines geopraphical bodies that are countries.
coverage: world
publisher: DERI International
format: application/rdf+xml
creator: DERI International
type: http://www.w3.org/2000/01/rdf-schema#Class

Street
type: DatatypeProperty
publisher: DERI International
comment: The street address part of an PostalAddress . Can have multiple lines.
creator: DERI International
domain: Postal Address
date: 2004-10-20
range: string
type: http://www.w3.org/2002/07/owl#DatatypeProperty
format: application/rdf+xml
type: FunctionalProperty
rights: http://www.deri.org/privacy.html
coverage: world

Seventh
description: The seventh foaf:Agent in an AgentSequence .
creator: DERI International
type: ObjectProperty
coverage: world
publisher: DERI International
rights: http://www.deri.org/privacy.html
domain: AgentSequence
format: application/rdf+xml
range: Agent
date: 2004-10-20
type: http://www.w3.org/2002/07/owl#ObjectProperty

Master Thesis
date: 2004-10-20
type: http://www.w3.org/2002/07/owl#Class
rights: http://www.deri.org/privacy.html
creator: DERI International
comment: A thesis written to receive a Master degree.
coverage: world
subclass of: Thesis
format: application/rdf+xml
type: Class
publisher: DERI International

Person
coverage: world
subclass of: Agent
comment: "A person. The foaf:Person class represents people. Something is a foaf:Person if it is a person. We don't nitpick about whether they're alive, dead, real or imaginary."
publisher: Dan Brickley
format: application/rdf+xml
type: Class
creator: Dan Brickley
contributor: http://rdfweb.org/mailman/listinfo/rdfweb-dev
type: http://www.w3.org/2000/01/rdf-schema#Class
publisher: Libby Miller
creator: Libby Miller
contributor: http://www.w3.org/RDF/Interest/

Contains Articles
date: 2004-10-20
description: The articles or papers which a journal containes.
range: Article
rights: http://www.deri.org/privacy.html
coverage: world
creator: DERI International
type: ObjectProperty
domain: Volume
inverse of: Contained in Journal
type: http://www.w3.org/2002/07/owl#ObjectProperty
format: application/rdf+xml
publisher: DERI International
type: InverseFunctionalProperty

Volume
range: nonNegativeInteger
creator: DERI International
type: FunctionalProperty
rights: http://www.deri.org/privacy.html
type: DatatypeProperty
comment: The volume of a journal or a multi-volume book.
format: application/rdf+xml
publisher: DERI International
type: http://www.w3.org/2002/07/owl#DatatypeProperty
coverage: world
date: 2004-10-20
domain: http://lodlaundromat.org/.well-known/genid/samples/pellet///predicate//46e04988a830ebbb36146dcc45a054ba/240cd8d701a3c44280314a4f06cca6bb#25

Goal
type: DatatypeProperty
domain: Group
type: FunctionalProperty
publisher: DERI International
format: application/rdf+xml
date: 2004-10-20
comment: The goal a group aims at. NOTE: foaf:theme provides a similar functionality.
coverage: world
creator: DERI International
type: http://www.w3.org/2002/07/owl#DatatypeProperty
range: string
rights: http://www.deri.org/privacy.html

Items
coverage: world
range: string
type: http://www.w3.org/2002/07/owl#FunctionalProperty
type: FunctionalProperty
format: application/rdf+xml
publisher: RSS-DEV Working Group
comment: "Points to a list of rss:item elements that are members of the subject channel." NOTE: the range is actually rdf:Seq
domain: RSS1.0 News Channel
creator: RSS-DEV Working Group
type: DatatypeProperty

Publishing Company
subclass of: Company
type: http://www.w3.org/2000/01/rdf-schema#Class
type: Class
description: This class models companies that publish documents.
date: 2004-10-20
publisher: DERI International
creator: DERI International
format: application/rdf+xml
coverage: world
rights: http://www.deri.org/privacy.html

Title
equivalent property: Title
domain: RSS1.0 News Item
type: DatatypeProperty
publisher: RSS-DEV Working Group
coverage: world
format: application/rdf+xml
range: string
creator: RSS-DEV Working Group
type: FunctionalProperty
type: http://www.w3.org/2002/07/owl#DatatypeProperty

Research Staff
date: 2004-10-20
subclass of: Researcher
publisher: DERI International
type: http://www.w3.org/2002/07/owl#Class
comment: This class represents all kinds of researchers who are not students.
coverage: world
creator: DERI International
rights: http://www.deri.org/privacy.html
format: application/rdf+xml
type: Class

Tutor
type: http://www.w3.org/2002/07/owl#ObjectProperty
format: application/rdf+xml
range: Agent
description: The tutors of a tutorial.
domain: Tutorial
publisher: DERI International
inverse of: Gives Tutorials
date: 2004-10-20
type: ObjectProperty
coverage: world
rights: http://www.deri.org/privacy.html
creator: DERI International

Publication Container
subclass of: Publication
comment: This class comprises all kinds of publications which contain other publications, such as journal, proceedings, series, etc. An instance of PublicationContainer has an editor.
date: 2004-10-20
creator: DERI International
type: http://www.w3.org/2000/01/rdf-schema#Class
type: Class
publisher: DERI International
format: application/rdf+xml
coverage: world
rights: http://www.deri.org/privacy.html

Deliverable
creator: DERI International
date: 2004-10-20
comment: A document which is produced as part of a project. Deliverables are not formally published. NOTE: This concept was not derived from any of the BibTex types, but considered useful anyway.
publisher: DERI International
rights: http://www.deri.org/privacy.html
subclass of: Unpublished
type: Class
format: application/rdf+xml
type: http://www.w3.org/2000/01/rdf-schema#Class
coverage: world

From Organization
description: The organization that sponsors a conference or that publishes a manual or techreport.
format: application/rdf+xml
type: ObjectProperty
range: Organization
rights: http://www.deri.org/privacy.html
coverage: world
type: http://www.w3.org/2002/07/owl#ObjectProperty
domain: http://lodlaundromat.org/.well-known/genid/samples/pellet///predicate//46e04988a830ebbb36146dcc45a054ba/240cd8d701a3c44280314a4f06cca6bb#32
publisher: DERI International
type: FunctionalProperty
creator: DERI International
date: 2004-10-20

Unpublished
format: application/rdf+xml
creator: DERI International
date: 2004-10-20
coverage: world
type: http://www.w3.org/2002/07/owl#Class
subclass of: Dated Publication
description: A document which does have an author and title, but hasn't been formally published.
type: Class
publisher: DERI International
rights: http://www.deri.org/privacy.html

Workpackages
type: http://www.w3.org/2002/07/owl#ObjectProperty
publisher: DERI International
description: The work packages of a project.
inverse of: Belongs to Project
format: application/rdf+xml
range: Work Package
domain: Project
date: 2004-10-20
type: ObjectProperty
creator: DERI International
rights: http://www.deri.org/privacy.html
coverage: world

Research Areas
type: http://www.w3.org/2002/07/owl#ObjectProperty
description: The areas of research some research institute is involved in.
format: application/rdf+xml
type: ObjectProperty
range: Topic
creator: DERI International
rights: http://www.deri.org/privacy.html
domain: http://lodlaundromat.org/.well-known/genid/samples/pellet///predicate//46e04988a830ebbb36146dcc45a054ba/240cd8d701a3c44280314a4f06cca6bb#35
publisher: DERI International
coverage: world
date: 2004-10-20

Interests
type: ObjectProperty
type: SymmetricProperty
comment: The fields of interest of a person.

Location
creator: DERI International
comment: This class is the superclass for all classes defining geographical locations. The approach for this subontology is to have a hierarchy of location classes, such that instances of the classes further down in the hierarchy can be contained in instances of the classes higher up in the hierarchy. On each level, there exist two sister classes: class L defines a certain type of location, while class SubL defines locations which can be contained in instances of L. SubL then defines a property inL, to express which instance of L an instance of SubL is contained in. E.g. for a class Continent, there exists a class SubContinent. All children of SubContinent (either direct or transitive) define locations that can be contained in a continent, such as countries, regions, cities, etc. By virtue of inheritance, all these location classes then have a property inContinent, to express that they are contained in some continent. In a simpler, flat structure, inContinent would have to be defined explicitly for all kinds of locations that can be contained in a continent. The intepretation of the inL predicates should be as follows: if, for a particular instance K, inL has a value, this value is valid. If inL has no value, the value of inL in the next location K is contained in valid, and so forth. E.g. an instance "Hawaii" has the value "Oceania" defined for inContinent and "USA" for inCountry . "Delaware" has no value for inContinent. "USA" has the value "North America" for inContinent . The interpretation would be that "Hawaii" is located in "Oceania", while "Delaware" is located in "North America". We are aware of the fact that this approach is idealized and can therefore conflict with reality in some situations. E.g., the exact borders of continents are not always defined (there are contradicting opinions on where exactly Europe begins or ends). Countries could be contained in more than one continent (Turkey belongs to both Europe and Asia). However, we think that these situations ar…
type: http://www.w3.org/2000/01/rdf-schema#Class
publisher: DERI International
format: application/rdf+xml
coverage: world
date: 2004-10-20
rights: http://www.deri.org/privacy.html
type: Class

Sub-Continent
description: This class defines geopraphical bodies that can be contained in continents.
coverage: world
type: http://www.w3.org/2000/01/rdf-schema#Class
type: Class
date: 2004-10-20
format: application/rdf+xml
rights: http://www.deri.org/privacy.html
creator: DERI International
subclass of: Location
publisher: DERI International

City
creator: DERI International
date: 2004-10-20
comment: This class defines geopraphical bodies that are cities.
rights: http://www.deri.org/privacy.html
subclass of: Sub-Region
coverage: world
type: http://www.w3.org/2000/01/rdf-schema#Class
publisher: DERI International
format: application/rdf+xml
type: Class

Tutorials
format: application/rdf+xml
coverage: world
comment: The tutorials that are offered during the course of an event.
type: http://www.w3.org/2002/07/owl#ObjectProperty
creator: DERI International
domain: http://lodlaundromat.org/.well-known/genid/samples/pellet///predicate//46e04988a830ebbb36146dcc45a054ba/240cd8d701a3c44280314a4f06cca6bb#42
date: 2004-10-20
type: ObjectProperty
range: Tutorial
publisher: DERI International
rights: http://www.deri.org/privacy.html

In Region
publisher: DERI International
creator: DERI International
comment: The Region in which some SubRegion is contained.
coverage: world
type: FunctionalProperty
date: 2004-10-20
format: application/rdf+xml
type: http://www.w3.org/2002/07/owl#FunctionalProperty
rights: http://www.deri.org/privacy.html
domain: Sub-Region
range: Region
type: ObjectProperty

Journal
format: application/rdf+xml
comment: A scientific journal or magazine. The instances of this class are not individual issues or voulumes of a journal, but the journal as such.
creator: DERI International
subclass of: Publication Container
type: Class
coverage: world
type: http://www.w3.org/2000/01/rdf-schema#Class
publisher: DERI International
rights: http://www.deri.org/privacy.html
date: 2004-10-20

Research Institute
type: http://www.w3.org/2002/07/owl#Class
comment: This class represents research institutes. These organizations have special research areas.
date: 2004-10-20
creator: DERI International
publisher: DERI International
coverage: world
type: Class
subclass of: Organization
format: application/rdf+xml
rights: http://www.deri.org/privacy.html

Edited by
date: 2004-10-20
type: ObjectProperty
range: AgentSequence
coverage: world
rights: http://www.deri.org/privacy.html
domain: Publication Container
type: http://www.w3.org/2002/07/owl#ObjectProperty
format: application/rdf+xml
publisher: DERI International
type: FunctionalProperty
creator: DERI International

interval
publisher: DERI International
format: application/rdf+xml
coverage: world
type: Class
creator: Jos de Bruin
creator: Holger Lausen
comment: "An interval represents a duration between 2 points in time." For the excat definition of this class, please refere to http://www.wsmo.org/2004/d3/d3.3/v0.1/ .
creator: DERI International
publisher: Jos de Bruin
rights: http://www.deri.org/privacy.html
type: http://www.w3.org/2000/01/rdf-schema#Class
publisher: Holger Lausen

Work Package
format: application/rdf+xml
creator: DERI International
coverage: world
comment: A work package is a subdivision of a project. It stands in a part-of relationship to foaf:Project .
publisher: DERI International
type: http://www.w3.org/2000/01/rdf-schema#Class
subclass of: Temporary Group
rights: http://www.deri.org/privacy.html
type: Class
date: 2004-10-20

Student
creator: DERI International
rights: http://www.deri.org/privacy.html
comment: This class represents all kinds of researchers who are students.
subclass of: Researcher
publisher: DERI International
type: http://www.w3.org/2002/07/owl#Class
type: Class
format: application/rdf+xml
coverage: world
date: 2004-10-20

Address
date: 2004-10-20
publisher: DERI International
domain: Agent
range: Postal Address
format: application/rdf+xml
type: http://www.w3.org/2002/07/owl#ObjectProperty
creator: DERI International
type: ObjectProperty
rights: http://www.deri.org/privacy.html
comment: This property relates an agent to its address.
coverage: world

Presentations
type: ObjectProperty
coverage: world
domain: http://lodlaundromat.org/.well-known/genid/samples/pellet///predicate//46e04988a830ebbb36146dcc45a054ba/240cd8d701a3c44280314a4f06cca6bb#9
creator: DERI International
comment: The presentations that are offered during the course of an event.
publisher: DERI International
format: application/rdf+xml
range: Presentation
rights: http://www.deri.org/privacy.html
date: 2004-10-20
type: http://www.w3.org/2002/07/owl#ObjectProperty

Contains Chapters
format: application/rdf+xml
publisher: DERI International
rights: http://www.deri.org/privacy.html
inverse of: Contained in Book
domain: Book
coverage: world
date: 2004-10-20
description: The chapters or similar which a book contains.
creator: DERI International
type: InverseFunctionalProperty
type: ObjectProperty
range: Inbook
type: http://www.w3.org/2002/07/owl#InverseFunctionalProperty

SWPortal Ontology - Semantic Web Portal Ontology
imports: http://purl.org/dc/elements/1.1/
format: application/rdf+xml
rights: http://www.deri.org/privacy.html
type: Ontology
date: 2004-10-20
creator: DERI International
description: The aim of the Semantic Web Portal Ontology is to serve as the conceptual backbone for community portals driven by Semantic Web technologies.
type: http://www.w3.org/2002/07/owl#Ontology
coverage: world
publisher: DERI International

Deliverables
date: 2004-10-20
creator: DERI International
inverse of: For Project
domain: http://lodlaundromat.org/.well-known/genid/samples/pellet///predicate//46e04988a830ebbb36146dcc45a054ba/240cd8d701a3c44280314a4f06cca6bb#7
format: application/rdf+xml
type: ObjectProperty
publisher: DERI International
type: http://www.w3.org/2002/07/owl#ObjectProperty
description: The deliverables for this project. The inverse is forProject .
range: Deliverable
rights: http://www.deri.org/privacy.html
coverage: world

In Country
date: 2004-10-20
publisher: DERI International
range: Country
description: The Country in which some SubCountry is contained.
creator: DERI International
format: application/rdf+xml
domain: Sub-Country
type: FunctionalProperty
coverage: world
type: ObjectProperty
rights: http://www.deri.org/privacy.html
type: http://www.w3.org/2002/07/owl#FunctionalProperty

Publications
type: http://www.w3.org/2002/07/owl#ObjectProperty
domain: Agent
creator: Libby Miller
comment: "A link to the publications of this person." This property relates an agent to its publications. NOTE: foaf defines the range as foaf:Person - we decided to change this to the more general foaf:Agent , since other types of Agents (e.g. a company) can also have publications (with no specific human authors).
creator: Dan Brickley
type: ObjectProperty
range: Document
contributor: http://www.w3.org/RDF/Interest/
publisher: Dan Brickley
format: application/rdf+xml
contributor: http://rdfweb.org/mailman/listinfo/rdfweb-dev
coverage: world
inverse of: Authors
publisher: Libby Miller

Pages
range: nonNegativeInteger
coverage: world
type: DatatypeProperty
creator: DERI International
comment: One or more page numbers or range of numbers, such as 42--111 or 7,41,73--97 or 43+ (the `+' in this last example indicates pages following that don't form a simple range). To make it easier to maintain Scribe-compatible databases, the standard styles convert a single dash (as in 7-33) to the double dash used in TeX to denote number ranges (as in 7--33).
rights: http://www.deri.org/privacy.html
date: 2004-10-20
type: FunctionalProperty
domain: http://lodlaundromat.org/.well-known/genid/samples/pellet///predicate//46e04988a830ebbb36146dcc45a054ba/240cd8d701a3c44280314a4f06cca6bb#45
publisher: DERI International
type: http://www.w3.org/2002/07/owl#DatatypeProperty
format: application/rdf+xml

ClericalStaff
type: Class
rights: http://www.deri.org/privacy.html
date: 2004-10-20
description: This class represents all kinds of administrative staff that is related to clerical support. Examples are secretaries, accountants, etc.
subclass of: Administrative Staff
publisher: DERI International
coverage: world
type: http://www.w3.org/2002/07/owl#Class
format: application/rdf+xml
creator: DERI International

Title
type: FunctionalProperty
format: application/rdf+xml
equivalent property: Title
publisher: DERI International
type: http://www.w3.org/2002/07/owl#FunctionalProperty
date: 2004-10-20
domain: Publication
creator: DERI International
rights: http://www.deri.org/privacy.html
comment: The title of the publication (book, article,..) or publication container (series, journal).
coverage: world
range: string
type: DatatypeProperty

Organizes
publisher: DERI International
description: This property relates an agent to the events it organizes. The inverse property is organizedBy .
inverse of: Organized by
domain: Agent
rights: http://www.deri.org/privacy.html
type: http://www.w3.org/2002/07/owl#ObjectProperty
coverage: world
type: ObjectProperty
range: Event
creator: DERI International
date: 2004-10-20
format: application/rdf+xml

Surname
publisher: Libby Miller
contributor: http://www.w3.org/RDF/Interest/
description: "The surname of a person." NOTE: the naming substructure of foaf is currently quite unstable.
domain: Person
format: application/rdf+xml
range: string
publisher: Dan Brickley
creator: Libby Miller
type: http://www.w3.org/2002/07/owl#DatatypeProperty
coverage: world
type: DatatypeProperty
creator: Dan Brickley
type: FunctionalProperty
contributor: http://rdfweb.org/mailman/listinfo/rdfweb-dev

Starting Date
range: date
publisher: DERI International
comment: The starting date some event.
type: http://www.w3.org/2002/07/owl#ObjectProperty
rights: http://www.deri.org/privacy.html
format: application/rdf+xml
date: 2004-10-20
coverage: world
domain: http://lodlaundromat.org/.well-known/genid/samples/pellet///predicate//46e04988a830ebbb36146dcc45a054ba/240cd8d701a3c44280314a4f06cca6bb#47
creator: DERI International
type: ObjectProperty

RSS1.0 News Channel
coverage: world
creator: RSS-DEV Working Group
comment: "An RSS information channel."
type: http://www.w3.org/2000/01/rdf-schema#Class
subclass of: Publication Container
type: Class
format: application/rdf+xml
publisher: RSS-DEV Working Group

Enddate
comment: The ending date some event.
format: application/rdf+xml
coverage: world
type: ObjectProperty
type: http://www.w3.org/2002/07/owl#ObjectProperty
rights: http://www.deri.org/privacy.html
range: date
creator: DERI International
date: 2004-10-20
domain: http://lodlaundromat.org/.well-known/genid/samples/pellet///predicate//46e04988a830ebbb36146dcc45a054ba/240cd8d701a3c44280314a4f06cca6bb#4
publisher: DERI International

Presenter
range: Agent
date: 2004-10-20
domain: Presentation
rights: http://www.deri.org/privacy.html
format: application/rdf+xml
coverage: world
comment: The presenter of a presentation.
creator: DERI International
publisher: DERI International
type: ObjectProperty
type: http://www.w3.org/2002/07/owl#ObjectProperty
inverse of: Gives Presentations

Ninth
date: 2004-10-20
description: The ninth foaf:Agent in an AgentSequence .
publisher: DERI International
domain: AgentSequence
range: Agent
rights: http://www.deri.org/privacy.html
format: application/rdf+xml
type: http://www.w3.org/2002/07/owl#ObjectProperty
type: ObjectProperty
coverage: world
creator: DERI International

Software Company
type: http://www.w3.org/2002/07/owl#Class
type: Class
comment: This class models companies that develop software and sell it.
coverage: world
creator: DERI International
subclass of: Company
rights: http://www.deri.org/privacy.html
publisher: DERI International
date: 2004-10-20
format: application/rdf+xml

Leader
type: http://www.w3.org/2002/07/owl#FunctionalProperty
format: application/rdf+xml
comment: This property defines the leader of an organization, i.e. its director, chairman, etc.
publisher: DERI International
date: 2004-10-20
domain: Group
type: FunctionalProperty
creator: DERI International
range: Person
rights: http://www.deri.org/privacy.html
type: ObjectProperty
coverage: world

Contained in Journal
publisher: DERI International
creator: DERI International
date: 2004-10-20
comment: The journal or magazine which contains this article.
type: FunctionalProperty
domain: Article
format: application/rdf+xml
rights: http://www.deri.org/privacy.html
type: http://www.w3.org/2002/07/owl#ObjectProperty
type: ObjectProperty
coverage: world
range: Journal
inverse of: Contains Articles

Products
type: ObjectProperty
comment: This property defines the products of a company.
creator: DERI International
publisher: DERI International
domain: Company
format: application/rdf+xml
type: http://www.w3.org/2002/07/owl#ObjectProperty
rights: http://www.deri.org/privacy.html
date: 2004-10-20
range: Thing
coverage: world

Publication Date
format: application/rdf+xml
description: The date of publication of some publication or software. Bibtex defines year and month. These are here combined to publicationDate.
type: FunctionalProperty
type: http://www.w3.org/2002/07/owl#DatatypeProperty
type: DatatypeProperty
date: 2004-10-20
coverage: world
domain: http://lodlaundromat.org/.well-known/genid/samples/pellet///predicate//46e04988a830ebbb36146dcc45a054ba/240cd8d701a3c44280314a4f06cca6bb#23
creator: DERI International
rights: http://www.deri.org/privacy.html
range: date
publisher: DERI International

In Series
date: 2004-10-20
comment: The instance of Series in which this document was published.
rights: http://www.deri.org/privacy.html
type: http://www.w3.org/2002/07/owl#FunctionalProperty
range: Series
creator: DERI International
domain: http://lodlaundromat.org/.well-known/genid/samples/pellet///predicate//46e04988a830ebbb36146dcc45a054ba/240cd8d701a3c44280314a4f06cca6bb#19
publisher: DERI International
coverage: world
type: FunctionalProperty
type: ObjectProperty
format: application/rdf+xml

For Project
comment: The project for which this deliverable is produced. The inverse is deliverables .
creator: DERI International
coverage: world
domain: Deliverable
type: ObjectProperty
publisher: DERI International
date: 2004-10-20
range: Project
rights: http://www.deri.org/privacy.html
format: application/rdf+xml
type: http://www.w3.org/2002/07/owl#ObjectProperty
inverse of: Deliverables

POBox
description: The PO-Box of some PostalAddress .
domain: Postal Address
rights: http://www.deri.org/privacy.html
coverage: world
format: application/rdf+xml
date: 2004-10-20
type: DatatypeProperty
range: string
creator: DERI International
type: http://www.w3.org/2002/07/owl#DatatypeProperty
type: FunctionalProperty
publisher: DERI International

Project
creator: Dan Brickley
type: Class
subclass of: Temporary Group
contributor: http://www.w3.org/RDF/Interest/
coverage: world
comment: "A project (a collective endeavour of some kind)." Within the context of the SWPortal Ontology we specify foaf:Project as such: A project is an endeavour of a group which has a specific aim. As a project can also be individualized and can publish documents and the like, we model it as a subclass of foaf:Agent. It has members and inherits all properties of foaf:Agent and foaf:Group . Also, projects are usually funded.
publisher: Dan Brickley
contributor: http://rdfweb.org/mailman/listinfo/rdfweb-dev
publisher: Libby Miller
type: http://www.w3.org/2000/01/rdf-schema#Class
format: application/rdf+xml
creator: Libby Miller

Techreport
format: application/rdf+xml
creator: DERI International
publisher: DERI International
comment: A report published by a school or other organization, usually numbered within a series ( Series ). This concept has been merged from BibTex's techreport and manual types, since both are described very similiar.
subclass of: Dated Publication
type: Class
date: 2004-10-20
rights: http://www.deri.org/privacy.html
coverage: world
type: http://www.w3.org/2002/07/owl#Class

Thesis
format: application/rdf+xml
date: 2004-10-20
creator: DERI International
type: http://www.w3.org/2000/01/rdf-schema#Class
comment: Any kind of thesis produced to receive some sort of university degree.
type: Class
rights: http://www.deri.org/privacy.html
coverage: world
publisher: DERI International
subclass of: Dated Publication

Misc
coverage: world
type: Class
publisher: DERI International
format: application/rdf+xml
description: Some sort of publication which doesn't fit into any of the other concepts.
rights: http://www.deri.org/privacy.html
subclass of: Dated Publication
date: 2004-10-20
type: http://www.w3.org/2002/07/owl#Class
creator: DERI International

PhD Thesis
creator: DERI International
comment: A thesis written to receive a PhD degree.
coverage: world
subclass of: Thesis
publisher: DERI International
type: Class
rights: http://www.deri.org/privacy.html
format: application/rdf+xml
date: 2004-10-20
type: http://www.w3.org/2002/07/owl#Class

Sub-Region
comment: This class defines geopraphical bodies that can be contained in regions.
format: application/rdf+xml
coverage: world
publisher: DERI International
type: Class
rights: http://www.deri.org/privacy.html
date: 2004-10-20
type: http://www.w3.org/2000/01/rdf-schema#Class
creator: DERI International
subclass of: Sub-Country

Note
type: FunctionalProperty
rights: http://www.deri.org/privacy.html
equivalent property: Description
format: application/rdf+xml
date: 2004-10-20
type: http://www.w3.org/2002/07/owl#FunctionalProperty
publisher: DERI International
domain: Publication
creator: DERI International
coverage: world
type: DatatypeProperty
range: string

In City
type: FunctionalProperty
date: 2004-10-20
format: application/rdf+xml
range: City
description: The City in which some SubCity is contained.
rights: http://www.deri.org/privacy.html
type: ObjectProperty
creator: DERI International
type: http://www.w3.org/2002/07/owl#FunctionalProperty
domain: Sub-City
publisher: DERI International
coverage: world

News Item
date: 2004-10-20
subclass of: Document
creator: DERI International
description: This class is the super-class for any kind of news item.
publisher: DERI International
type: Class
type: http://www.w3.org/2002/07/owl#Class
rights: http://www.deri.org/privacy.html
format: application/rdf+xml
coverage: world

Tenth
description: The tenth foaf:Agent in an AgentSequence .
date: 2004-10-20
type: http://www.w3.org/2002/07/owl#ObjectProperty
type: ObjectProperty
range: Agent
creator: DERI International
domain: AgentSequence
publisher: DERI International
format: application/rdf+xml
coverage: world
rights: http://www.deri.org/privacy.html

Fifth
publisher: DERI International
type: ObjectProperty
format: application/rdf+xml
type: http://www.w3.org/2002/07/owl#ObjectProperty
description: The fifth foaf:Agent in an AgentSequence .
coverage: world
date: 2004-10-20
rights: http://www.deri.org/privacy.html
domain: AgentSequence
range: Agent
creator: DERI International

Contained in Proceedings
type: ObjectProperty
format: application/rdf+xml
publisher: DERI International
description: The proceedings some paper or similar is contained in.
type: http://www.w3.org/2002/07/owl#ObjectProperty
inverse of: Contains Papers
creator: DERI International
date: 2004-10-20
range: Proceedings
domain: Inproceedings
coverage: world
rights: http://www.deri.org/privacy.html

Starting Time
type: FunctionalProperty
domain: http://lodlaundromat.org/.well-known/genid/samples/pellet///predicate//46e04988a830ebbb36146dcc45a054ba/240cd8d701a3c44280314a4f06cca6bb#50
description: The time when some event starts.
type: ObjectProperty
date: 2004-10-20
type: http://www.w3.org/2002/07/owl#FunctionalProperty
creator: DERI International
range: time
coverage: world
publisher: DERI International
format: application/rdf+xml
rights: http://www.deri.org/privacy.html

Organized by
range: Agent
type: http://www.w3.org/2002/07/owl#ObjectProperty
type: ObjectProperty
rights: http://www.deri.org/privacy.html
comment: The organizers of an event. At least one agent has to organize an event. The inverse property is organizes .
coverage: world
creator: DERI International
domain: Event
date: 2004-10-20
inverse of: Organizes
publisher: DERI International
format: application/rdf+xml

Tool
date: 2004-10-20
rights: http://www.deri.org/privacy.html
coverage: world
format: application/rdf+xml
type: http://www.w3.org/2002/07/owl#Class
type: Class
description: This class represents any kind of software tool. At the moment, this class is clearly underspecified.
creator: DERI International
publisher: DERI International

Management Staff
publisher: DERI International
type: Class
date: 2004-10-20
format: application/rdf+xml
type: http://www.w3.org/2002/07/owl#Class
rights: http://www.deri.org/privacy.html
comment: This class represents the management staff.
subclass of: Person
creator: DERI International
coverage: world

In Continent
rights: http://www.deri.org/privacy.html
format: application/rdf+xml
domain: Sub-Continent
creator: DERI International
coverage: world
comment: The Continent in which some SubContinent is contained.
range: Continent
type: ObjectProperty
type: http://www.w3.org/2002/07/owl#ObjectProperty
date: 2004-10-20
publisher: DERI International
type: FunctionalProperty

At School
date: 2004-10-20
description: The school where a thesis was written.
range: University
domain: Thesis
publisher: DERI International
type: http://www.w3.org/2002/07/owl#FunctionalProperty
rights: http://www.deri.org/privacy.html
coverage: world
type: FunctionalProperty
format: application/rdf+xml
type: ObjectProperty
creator: DERI International

Conference
rights: http://www.deri.org/privacy.html
subclass of: Event
coverage: world
type: Class
publisher: DERI International
date: 2004-10-20
type: http://www.w3.org/2002/07/owl#Class
format: application/rdf+xml
comment: This class represents all kinds of conferences in the academic domain.
creator: DERI International

Gives Presentations
description: This property relates an agent to the presentations it gives. The inverse property is presenter .
type: ObjectProperty
date: 2004-10-20
format: application/rdf+xml
domain: Agent
type: http://www.w3.org/2002/07/owl#ObjectProperty
publisher: DERI International
rights: http://www.deri.org/privacy.html
range: Presentation
coverage: world
creator: DERI International
inverse of: Presenter

Researcher
publisher: DERI International
date: 2004-10-20
coverage: world
subclass of: Person
type: Class
description: This class represents all kinds of persons who are researchers. Each has a research area.
creator: DERI International
rights: http://www.deri.org/privacy.html
type: http://www.w3.org/2002/07/owl#Class
format: application/rdf+xml

Presentation
date: 2004-10-20
rights: http://www.deri.org/privacy.html
format: application/rdf+xml
coverage: world
subclass of: Event
description: This class represents all kinds of presentations.
publisher: DERI International
type: Class
creator: DERI International
type: http://www.w3.org/2000/01/rdf-schema#Class

Driven by
rights: http://www.deri.org/privacy.html
creator: DERI International
publisher: DERI International
domain: Project
inverse of: Current Project
type: ObjectProperty
description: The foaf:Agent this project is driven by. This is inverse to foaf:currentProject . NOTE: How do we deal with the relation between drivenBy and foaf:pastProject ?
format: application/rdf+xml
type: http://www.w3.org/2002/07/owl#ObjectProperty
coverage: world
range: Agent
date: 2004-10-20

Belongs to Project
domain: Work Package
rights: http://www.deri.org/privacy.html
type: ObjectProperty
format: application/rdf+xml
coverage: world
date: 2004-10-20
type: http://www.w3.org/2002/07/owl#ObjectProperty
description: Defines what project a workpackage belongs to.
publisher: DERI International
inverse of: Workpackages
range: Project
creator: DERI International

Proceedings
type: http://www.w3.org/2000/01/rdf-schema#Class
description: The proceedings of a conference.
publisher: DERI International
date: 2004-10-20
subclass of: Publication Container
format: application/rdf+xml
subclass of: Dated Publication
creator: DERI International
coverage: world
type: Class
rights: http://www.deri.org/privacy.html

Second
type: ObjectProperty
domain: AgentSequence
publisher: DERI International
rights: http://www.deri.org/privacy.html
description: The second foaf:Agent in an AgentSequence .
range: Agent
format: application/rdf+xml
coverage: world
type: http://www.w3.org/2002/07/owl#ObjectProperty
date: 2004-10-20
creator: DERI International

Document
contributor: http://rdfweb.org/mailman/listinfo/rdfweb-dev
type: http://www.w3.org/2000/01/rdf-schema#Class
description: Similar to the Agent concept, we have again decided to include a concept from the popular FOAF ontology. The FOAF Vocabulary Specification currently defines Document in a very loose way: "The foaf:Document class represents those things which are, broadly conceived, 'documents'... We do not (currently) distinguish between physical and electronic documents, or between copies of a work and the abstraction those copies embody." The intended use of this concept within the SWPortal ontology is to subsume everything that contains some sort of information and has been produced by some foaf:Agent An instance of Document can either refer to an electronic or physical thing, as long as it is adressable by means of a URI. Examples are a book written, or a picture taken by a person, but also a log file generated by a machine.
coverage: world
contributor: http://www.w3.org/RDF/Interest/
type: Class
subclass of: Publication
publisher: Libby Miller
creator: Dan Brickley
creator: Libby Miller
publisher: Dan Brickley
format: application/rdf+xml

Fourth
creator: DERI International
rights: http://www.deri.org/privacy.html
domain: AgentSequence
type: http://www.w3.org/2002/07/owl#ObjectProperty
description: The fourth foaf:Agent in an AgentSequence .
range: Agent
coverage: world
publisher: DERI International
date: 2004-10-20
type: ObjectProperty
format: application/rdf+xml

Topic
description: All research topics inherit from this concept. This should serve as a plugin point for the research topic ontology.
type: http://www.w3.org/2000/01/rdf-schema#Class
format: application/rdf+xml
creator: DERI International
date: 2004-10-20
rights: http://www.deri.org/privacy.html
coverage: world
publisher: DERI International
type: Class

How Published
rights: http://www.deri.org/privacy.html
publisher: DERI International
type: http://www.w3.org/2002/07/owl#FunctionalProperty
domain: http://lodlaundromat.org/.well-known/genid/samples/pellet///predicate//46e04988a830ebbb36146dcc45a054ba/240cd8d701a3c44280314a4f06cca6bb#1
description: How something strange has been published.
date: 2004-10-20
type: DatatypeProperty
type: FunctionalProperty
creator: DERI International
format: application/rdf+xml
range: string
coverage: world

Temporary Group
type: http://www.w3.org/2000/01/rdf-schema#Class
description: As foaf:Project , Initiative and WorkingGroup differ from Cluster in having a specific duration, we comprise these there temporal groups in this class which represents all kinds of temporary groups.
rights: http://www.deri.org/privacy.html
date: 2004-10-20
coverage: world
subclass of: Group
publisher: DERI International
creator: DERI International
format: application/rdf+xml
type: Class

Booklet
rights: http://www.deri.org/privacy.html
subclass of: Dated Publication
creator: DERI International
type: Class
publisher: DERI International
type: http://www.w3.org/2002/07/owl#Class
description: A work that is printed and bound, but without a named publisher or sponsoring institution.
coverage: world
date: 2004-10-20
format: application/rdf+xml

Third
creator: DERI International
rights: http://www.deri.org/privacy.html
domain: AgentSequence
type: http://www.w3.org/2002/07/owl#ObjectProperty
range: Agent
coverage: world
publisher: DERI International
date: 2004-10-20
description: The third foaf:Agent in an AgentSequence .
type: ObjectProperty
format: application/rdf+xml

Administrative Staff
format: application/rdf+xml
creator: DERI International
date: 2004-10-20
rights: http://www.deri.org/privacy.html
description: This class represents administrative staff.
publisher: DERI International
subclass of: Person
type: Class
type: http://www.w3.org/2000/01/rdf-schema#Class
coverage: world

Postal Address
format: application/rdf+xml
creator: DERI International
date: 2004-10-20
type: Class
subclass of: Sub-City
comment: Instances of this class represent exact postal addresses. Note that either postbox of streetAddress should be given.
rights: http://www.deri.org/privacy.html
coverage: world
publisher: DERI International
type: http://www.w3.org/2000/01/rdf-schema#Class

Authors
creator: DERI International
coverage: world
date: 2004-10-20
description: The author or authors of a document. For multiple authors, use either an instance of foaf:Group , or multiple values.
type: http://www.w3.org/2002/07/owl#ObjectProperty
rights: http://www.deri.org/privacy.html
publisher: DERI International
inverse of: Publications
range: AgentSequence
format: application/rdf+xml
type: ObjectProperty
domain: Document

Version
rights: http://www.deri.org/privacy.html
type: DatatypeProperty
description: The version number of a document or tool.
domain: http://lodlaundromat.org/.well-known/genid/samples/pellet///predicate//46e04988a830ebbb36146dcc45a054ba/240cd8d701a3c44280314a4f06cca6bb#61
publisher: DERI International
date: 2004-10-20
range: float
coverage: world
creator: DERI International
type: FunctionalProperty
format: application/rdf+xml
type: http://www.w3.org/2002/07/owl#FunctionalProperty

Tutorial
type: http://www.w3.org/2000/01/rdf-schema#Class
date: 2004-10-20
description: This class represents all kinds of tutorials.
creator: DERI International
subclass of: Event
format: application/rdf+xml
coverage: world
rights: http://www.deri.org/privacy.html
publisher: DERI International
type: Class

Sub-Country
publisher: DERI International
creator: DERI International
subclass of: Sub-Continent
type: Class
format: application/rdf+xml
coverage: world
description: This class defines geopraphical bodies that can be contained in countries.
rights: http://www.deri.org/privacy.html
date: 2004-10-20
type: http://www.w3.org/2000/01/rdf-schema#Class

Book
comment: A book with an explicit publisher. NOTES: - Either authors or editedBy must be given - Either volume or number may be given.
rights: http://www.deri.org/privacy.html
creator: DERI International
format: application/rdf+xml
publisher: DERI International
date: 2004-10-20
type: http://www.w3.org/2000/01/rdf-schema#Class
subclass of: Publication Container
coverage: world
type: Class
subclass of: Dated Publication

First Name
contributor: http://www.w3.org/RDF/Interest/
description: "The first name of a person." NOTE: the naming substructure of foaf is currently quite unstable.
type: http://www.w3.org/2002/07/owl#DatatypeProperty
publisher: Dan Brickley
publisher: Libby Miller
creator: Dan Brickley
creator: Libby Miller
type: DatatypeProperty
domain: Person
range: string
format: application/rdf+xml
type: FunctionalProperty
coverage: world
contributor: http://rdfweb.org/mailman/listinfo/rdfweb-dev

Series
type: Class
description: A series or set of books.
subclass of: Publication Container
publisher: DERI International
date: 2004-10-20
creator: DERI International
coverage: world
format: application/rdf+xml
type: http://www.w3.org/2000/01/rdf-schema#Class
rights: http://www.deri.org/privacy.html

date
format: application/rdf+xml
description: "Concept date and its representation according to the Gregorian Calendar." For the excat definition of this class, please refere to http://www.wsmo.org/2004/d3/d3.3/v0.1/ .
publisher: Holger Lausen
publisher: DERI International
rights: http://www.deri.org/privacy.html
type: Class
creator: DERI International
creator: Jos de Bruin
type: http://www.w3.org/2000/01/rdf-schema#Class
publisher: Jos de Bruin
creator: Holger Lausen
coverage: world

Member
type: http://www.w3.org/2002/07/owl#ObjectProperty
domain: Group
creator: Libby Miller
comment: "Indicates a member of a Group." This property relates a set of agents to a group. These are the members of that group.
publisher: Dan Brickley
type: ObjectProperty
contributor: http://rdfweb.org/mailman/listinfo/rdfweb-dev
contributor: http://www.w3.org/RDF/Interest/
format: application/rdf+xml
publisher: Libby Miller
coverage: world
creator: Dan Brickley
range: Agent

Lecture
subclass of: Event
coverage: world
creator: DERI International
date: 2004-10-20
rights: http://www.deri.org/privacy.html
format: application/rdf+xml
publisher: DERI International
description: This class represents lectures with an educational purpose, e.g within a university.
type: Class
type: http://www.w3.org/2000/01/rdf-schema#Class

Past Project
creator: Libby Miller
format: application/rdf+xml
range: Project
publisher: Dan Brickley
publisher: Libby Miller
comment: "A project this person has previously worked on." NOTE: foaf defines the range as foaf:Person - we decided to change this to the more general foaf:Agent , since other types of Agents (e.g. a company) can also have projects.
type: ObjectProperty
coverage: world
type: SymmetricProperty
creator: Dan Brickley
type: http://www.w3.org/2002/07/owl#ObjectProperty
contributor: http://www.w3.org/RDF/Interest/
domain: Agent
contributor: http://rdfweb.org/mailman/listinfo/rdfweb-dev

ofJournal
date: 2004-10-20
creator: DERI International
inverse of: hasVolumes
rights: http://www.deri.org/privacy.html
description: The Journal this volume belongs to.
publisher: DERI International
type: http://www.w3.org/2002/07/owl#ObjectProperty
domain: Volume
coverage: world
type: ObjectProperty
format: application/rdf+xml
range: Journal

Company
type: http://www.w3.org/2000/01/rdf-schema#Class
subclass of: Organization
coverage: world
format: application/rdf+xml
type: Class
date: 2004-10-20
comment: This class represents all kinds of companies. Currently only publishers and software developers are modelled.
rights: http://www.deri.org/privacy.html
creator: DERI International
publisher: DERI International

Tasks
rights: http://www.deri.org/privacy.html
domain: Administrative Staff
publisher: DERI International
range: Topic
coverage: world
creator: DERI International
description: The tasks of a member of the administrative staff.
type: ObjectProperty
format: application/rdf+xml
date: 2004-10-20
type: http://www.w3.org/2002/07/owl#ObjectProperty

Publication
coverage: world
type: Class
creator: DERI International
publisher: DERI International
rights: http://www.deri.org/privacy.html
type: http://www.w3.org/2000/01/rdf-schema#Class
description: Publications are both individual documents and collections of documents such as series, journals, etc.
format: application/rdf+xml
date: 2004-10-20

Theme
range: Thing
comment: "A theme. The foaf:theme property is rarely used and under-specified. The intention was to use it to characterise interest / themes associated with projects and groups. Further work is need to meet these goals." NOTE: This property is only listed for comparison with goal.
creator: Dan Brickley
contributor: http://rdfweb.org/mailman/listinfo/rdfweb-dev
creator: Libby Miller
coverage: world
contributor: http://www.w3.org/RDF/Interest/
domain: Group
type: ObjectProperty
publisher: Dan Brickley
publisher: Libby Miller
format: application/rdf+xml
type: http://www.w3.org/2002/07/owl#ObjectProperty

Cluster
type: Class
format: application/rdf+xml
publisher: DERI International
date: 2004-10-20
description: A Cluster is a kind of group which focuses on a research area and typically is part of a research institute or university.
coverage: world
creator: DERI International
type: http://www.w3.org/2002/07/owl#Class
subclass of: Group
rights: http://www.deri.org/privacy.html

Current Project
type: ObjectProperty
inverse of: Driven by
domain: Agent
creator: Dan Brickley
publisher: Libby Miller
range: Project
type: http://www.w3.org/2002/07/owl#ObjectProperty
contributor: http://www.w3.org/RDF/Interest/
comment: "A current project this person works on." NOTE: FOAF defines the range as foaf:Person - we decided to change this to the more general foaf:Agent , since other types of Agents (e.g. a company) can also have projects. We have also defined an inverse for this property (see drivenBy ).
contributor: http://rdfweb.org/mailman/listinfo/rdfweb-dev
coverage: world
publisher: Dan Brickley
creator: Libby Miller
format: application/rdf+xml

Fax
domain: Agent
range: Literal
description: The faxnumber of some foaf:Agent .
creator: DERI International
rights: http://www.deri.org/privacy.html
type: ObjectProperty
date: 2004-10-20
coverage: world
publisher: DERI International
format: application/rdf+xml
type: http://www.w3.org/2002/07/owl#ObjectProperty

Contained in Book
type: FunctionalProperty
date: 2004-10-20
coverage: world
comment: The Book in which an Inbook is contained.
rights: http://www.deri.org/privacy.html
domain: Inbook
format: application/rdf+xml
publisher: DERI International
type: ObjectProperty
inverse of: Contains Chapters
range: Book
creator: DERI International
type: http://www.w3.org/2002/07/owl#FunctionalProperty

Number
range: nonNegativeInteger
domain: http://lodlaundromat.org/.well-known/genid/samples/pellet///predicate//46e04988a830ebbb36146dcc45a054ba/240cd8d701a3c44280314a4f06cca6bb#11
type: http://www.w3.org/2002/07/owl#DatatypeProperty
coverage: world
creator: DERI International
type: FunctionalProperty
publisher: DERI International
type: DatatypeProperty
format: application/rdf+xml
rights: http://www.deri.org/privacy.html
comment: The number of a journal, magazine, techreport, or of a work in a series. An issue of a journal or magazine is usually identified by its volume and number; the organization that issues a technical report usually gives it a number; and sometimes books are given numbers in a numbered series. Deliverables for a project may also be given numbers.
date: 2004-10-20

Gives Tutorials
domain: Agent
creator: DERI International
description: This property relates an agent to the tutorials it gives. The inverse property is tutoredBy .
type: ObjectProperty
date: 2004-10-20
format: application/rdf+xml
coverage: world
rights: http://www.deri.org/privacy.html
inverse of: Tutor
range: Tutorial
type: http://www.w3.org/2002/07/owl#ObjectProperty
publisher: DERI International

Region
type: http://www.w3.org/2000/01/rdf-schema#Class
publisher: DERI International
coverage: world
format: application/rdf+xml
comment: This class defines geopraphical bodies that are regions, with the intended meaning "sub-division of a country".
creator: DERI International
type: Class
subclass of: Sub-Country
date: 2004-10-20
rights: http://www.deri.org/privacy.html

time
publisher: DERI International
format: application/rdf+xml
comment: A specific point in time during any arbitrary day. For the excat definition of this class, please refere to http://www.wsmo.org/2004/d3/d3.3/v0.1/ .
type: http://www.w3.org/2000/01/rdf-schema#Class
creator: DERI International
publisher: Holger Lausen
publisher: Jos de Bruin
type: Class
rights: http://www.deri.org/privacy.html
coverage: world
creator: Jos de Bruin
creator: Holger Lausen

Article
creator: DERI International
format: application/rdf+xml
type: Class
coverage: world
date: 2004-10-20
subclass of: Document
description: An article from a journal or magazine.
rights: http://www.deri.org/privacy.html
type: http://www.w3.org/2000/01/rdf-schema#Class
publisher: DERI International

RSS1.0 News Item
publisher: RSS-DEV Working Group
format: application/rdf+xml
coverage: world
creator: RSS-DEV Working Group
subclass of: News Item
type: Class
type: http://www.w3.org/2000/01/rdf-schema#Class

Chapter
comment: The chapter (or section or whatever) number which this Inbook represents.
type: DatatypeProperty
publisher: DERI International
type: FunctionalProperty
type: http://www.w3.org/2002/07/owl#DatatypeProperty
date: 2004-10-20
rights: http://www.deri.org/privacy.html
coverage: world
range: int
domain: Inbook
format: application/rdf+xml
creator: DERI International

Inbook
type: http://www.w3.org/2000/01/rdf-schema#Class
coverage: world
comment: A part of a Book, which may be a chapter (or section or whatever) and/or a range of pages. Because the BibTex types inCollection and inBook are very similiar, we decided to keep the ontology as simple as possible and merge them both into Inbook .
date: 2004-10-20
subclass of: Document
creator: DERI International
format: application/rdf+xml
publisher: DERI International
type: Class
rights: http://www.deri.org/privacy.html

Event
format: application/rdf+xml
creator: DERI International
description: This class represents events relevant for the area of teaching, research, business, i.e. conferences, presentations, tutorials, workshops and lectures.
date: 2004-10-20
coverage: world
type: Class
type: http://www.w3.org/2000/01/rdf-schema#Class
rights: http://www.deri.org/privacy.html
publisher: DERI International

Organization
coverage: world
format: application/rdf+xml
contributor: http://rdfweb.org/mailman/listinfo/rdfweb-dev
creator: Dan Brickley
subclass of: Agent
contributor: http://www.w3.org/RDF/Interest/
publisher: Dan Brickley
creator: Libby Miller
description: "The foaf:Organization class represents a kind of foaf:Agent corresponding to social institutions such as companies, societies, etc." As we consider an organization to be a group as well, we introduced a subclass Organization as a subclass of both foaf:Organization and foaf:Group . We added foaf:Organization to facilitate FOAF based agents to query our ontology.
publisher: Libby Miller
type: Class
type: http://www.w3.org/2000/01/rdf-schema#Class

Dated Publication
format: application/rdf+xml
rights: http://www.deri.org/privacy.html
coverage: world
subclass of: Document
creator: DERI International
comment: The instances of this class comprise all publications which have a specific publication date. If a publication P is contained within an PublicationContainer , and this container has a publication date, than P is not an IndividualPublication . Example: an Inbook publication is not an IndividualPublication , because its publication date can be inferred from the Book which contains it.
publisher: DERI International
date: 2004-10-20
type: http://www.w3.org/2002/07/owl#Class
type: Class

Description
format: application/rdf+xml
type: http://www.w3.org/2002/07/owl#DatatypeProperty
equivalent property: Note
range: string
type: DatatypeProperty
coverage: world
creator: RSS-DEV Working Group
publisher: RSS-DEV Working Group
domain: RSS1.0 News Item
type: FunctionalProperty

Topic
format: application/rdf+xml
type: ObjectProperty
creator: Dan Brickley
publisher: Libby Miller
publisher: Dan Brickley
type: http://www.w3.org/2002/07/owl#ObjectProperty
range: Thing
coverage: world
comment: "A topic of some page or document. The foaf:topic property relates a document to a thing that the document is about. As such it is an inverse to the foaf:page property, which relates a thing to a document about that thing."
creator: Libby Miller
contributor: http://www.w3.org/RDF/Interest/
contributor: http://rdfweb.org/mailman/listinfo/rdfweb-dev
domain: Document

Email
creator: Dan Brickley
domain: Agent
publisher: Libby Miller
type: http://www.w3.org/2002/07/owl#ObjectProperty
publisher: Dan Brickley
description: "A personal mailbox, i.e. an internet mailbox associated with exactly one owner, the first owner of this mailbox. This is a 'static inverse functional property', in that there is (across time and change) at most one individual that ever has any particular value for foaf:mbox ." Because we switched over to OWL Lite– ,we don’t have functional properties anymore. However, we recommend to the users of this ontology to apply this property like it is described in the FOAF specification.
type: InverseFunctionalProperty
contributor: http://www.w3.org/RDF/Interest/
creator: Libby Miller
coverage: world
type: ObjectProperty
range: Literal
contributor: http://rdfweb.org/mailman/listinfo/rdfweb-dev
format: application/rdf+xml

Initiative
description: An initiative is a group which has specific aims. It differs from foaf:Project in that it normally doesn’t have any funding. Often, its duration is longer.
publisher: DERI International
rights: http://www.deri.org/privacy.html
type: http://www.w3.org/2002/07/owl#Class
creator: DERI International
type: Class
coverage: world
date: 2004-10-20
subclass of: Temporary Group
format: application/rdf+xml

Publisher
rights: http://www.deri.org/privacy.html
comment: The instance of Publisher which published this document.
publisher: DERI International
creator: DERI International
type: FunctionalProperty
type: http://www.w3.org/2002/07/owl#FunctionalProperty
coverage: world
type: ObjectProperty
format: application/rdf+xml
range: Publishing Company
date: 2004-10-20
domain: http://lodlaundromat.org/.well-known/genid/samples/pellet///predicate//46e04988a830ebbb36146dcc45a054ba/240cd8d701a3c44280314a4f06cca6bb#38

Location
description: The Location of an Event .
creator: DERI International
type: FunctionalProperty
type: ObjectProperty
coverage: world
domain: Event
type: http://www.w3.org/2002/07/owl#FunctionalProperty
format: application/rdf+xml
range: Location
publisher: DERI International
rights: http://www.deri.org/privacy.html
date: 2004-10-20

Link
type: FunctionalProperty
type: DatatypeProperty
format: application/rdf+xml
domain: Publication
range: string
creator: RSS-DEV Working Group
description: If this publication can be accessed in electronic form, the corresponding URL can be using the rss:link property. NOTE: this definition is a slightly extended version of the definition in the RSS 1.0 specification.
publisher: RSS-DEV Working Group
type: http://www.w3.org/2002/07/owl#FunctionalProperty
coverage: world

Duration
range: interval
rights: http://www.deri.org/privacy.html
comment: The duration of a temporary group.
creator: DERI International
domain: Temporary Group
type: http://www.w3.org/2002/07/owl#ObjectProperty
date: 2004-10-20
format: application/rdf+xml
publisher: DERI International
type: ObjectProperty
coverage: world

Working Group
date: 2004-10-20
type: Class
publisher: DERI International
rights: http://www.deri.org/privacy.html
comment: A working group is similar to Initiative . We might unify two classes into one in the future.
format: application/rdf+xml
type: http://www.w3.org/2002/07/owl#Class
coverage: world
subclass of: Temporary Group
creator: DERI International

hasVolumes
format: application/rdf+xml
domain: Journal
type: http://www.w3.org/2002/07/owl#ObjectProperty
comment: The Volume s of this journal.
date: 2004-10-20
rights: http://www.deri.org/privacy.html
coverage: world
type: ObjectProperty
inverse of: ofJournal
publisher: DERI International
creator: DERI International
range: Volume

Complete Name
contributor: http://www.w3.org/RDF/Interest/
creator: Libby Miller
description: "The name of some thing."
type: DatatypeProperty
type: FunctionalProperty
domain: http://lodlaundromat.org/.well-known/genid/samples/pellet///predicate//46e04988a830ebbb36146dcc45a054ba/240cd8d701a3c44280314a4f06cca6bb#63
coverage: world
publisher: Libby Miller
publisher: Dan Brickley
contributor: http://rdfweb.org/mailman/listinfo/rdfweb-dev
range: string
type: http://www.w3.org/2002/07/owl#FunctionalProperty
format: application/rdf+xml
creator: Dan Brickley

University
type: Class
publisher: DERI International
date: 2004-10-20
subclass of: Organization
description: This class represents universities. We decided to introduce two different classes to distinguish between universities and independent research institutes. The main difference is actually the different kinds of independence. In contrast to a university, a research institute is independent from the rigorous bureaucracy of the mainly state-run universities. On the other hand, a university is independent from the economy and the financial support of companies. Thus, the kind of research an independent research institute practises is generally more application-oriented.
format: application/rdf+xml
coverage: world
rights: http://www.deri.org/privacy.html
creator: DERI International
type: http://www.w3.org/2000/01/rdf-schema#Class

Telephone
publisher: Libby Miller
contributor: http://rdfweb.org/mailman/listinfo/rdfweb-dev
type: ObjectProperty
range: Literal
creator: Dan Brickley
domain: Agent
contributor: http://www.w3.org/RDF/Interest/
type: http://www.w3.org/2002/07/owl#ObjectProperty
creator: Libby Miller
publisher: Dan Brickley
comment: "The foaf:phone of something is a phone, typically identified using the tel: URI scheme." The tel: URI scheme is defined in http://www.ietf.org/rfc/rfc2806.txt.
format: application/rdf+xml
coverage: world

Continent
type: Class
format: application/rdf+xml
creator: DERI International
coverage: world
description: This class defines geopraphical bodies that are continents.
type: http://www.w3.org/2000/01/rdf-schema#Class
date: 2004-10-20
subclass of: Location
rights: http://www.deri.org/privacy.html
publisher: DERI International

Inproceedings
subclass of: Document
comment: An article in a conference proceedings (i.e. Proceedings).
date: 2004-10-20
coverage: world
format: application/rdf+xml
type: http://www.w3.org/2000/01/rdf-schema#Class
type: Class
rights: http://www.deri.org/privacy.html
publisher: DERI International
creator: DERI International