Vrsta nastave
type: Class
label: Type of class @en

Izvanredni studij
type: Class
label: Irregular Study @en
subclass of: Studij

Profil
type: Class
label: Profile @en
subclass of: Grupiranje znanja

Nastavni program za element ustroja nastave
type: Class
comment: Razlaže nastavni program po elementima ustroja nastave (semestrima, trimestrima i sl.).
label: Programme for Term @en
subclass of: Grupiranje znanja

Redovni studij
type: Class
label: Regular Study @en
subclass of: Studij

Studij
type: Class
label: Study @en
subclass of: Grupiranje znanja

Razina studija
type: Class
comment: Razina studija, npr. preddiplomski, diplomski, postdiplomski
label: Study Level @en
subclass of: Grupiranje znanja

Stručni studij
type: Class
label: Technical Study @en
subclass of: Studij

Sveučilišni studij
type: Class
label: University Study @en
subclass of: Studij

ects
type: DatatypeProperty
comment: Broj ECTS bodova koje nosi predmet.
domain: Predmet
range: Literal

isInAverage
type: DatatypeProperty
comment: Označava ulazi li polaganje predmeta u prosjek.
domain: Predmet
range: Literal

studyTerm
type: ObjectProperty
comment: Element ustroja nastave koji se koristi u izvedbi grupiranja znanja
domain: Grupiranje znanja
range: Element ustroja nastave

teachedInProgrammeTerm
type: ObjectProperty
comment: Element ustroja nastave programa u kojemu se predaje instanca predmeta.
domain: Izvedba predmeta
range: Nastavni program za element ustroja nastave

termNo
type: DatatypeProperty
comment: Redni broj elementa ustroja nastave za koji se definira nastavni program.
domain: Nastavni program za element ustroja nastave
range: int

SemanticISVU Ontology (SISVU)
contributor: Dario Vuljanić
contributor: Martina Perše
creator: Gordan Ivanović
creator: Luka Nimac
date: 2009-12-17
rights: Copyright © 2009 Faculty of Electrical Engineering and Computing, University of Zagreb
issued: 2008-05-14
preferred namespace prefix: sisvu
preferred namespace uri: http://kent.zpr.fer.hr:8080/educationalProgram/vocab#
type: Ontology
type: Thing
comment: An ontology for describing courses at an educational institution. The approach here is heavily weighted toward universities.
comment: The Academic Institution Internal Structure Ontology (AIISO) provides classes and properties to describe the internal organizational structure of an academic institution. AIISO is designed to work in partnership with Participation (http://purl.org/vocab/participation/schema), FOAF (http://xmlns.com/foaf/0.1/) and aiiso-roles (http://purl.org/vocab/aiiso-roles/schema) to describe the roles that people play within an institution. @en

Fakultet
issued: 2008-05-14
type: Class
type: Thing
comment: A Faculty is a group of people recognised by an organization as forming a cohesive group referred to by the organization as a faculty.
label: Faculty @en
subclass of: Organizacija

Institucija
issued: 2008-05-14
type: Class
type: Thing
comment: An Institution is the upper most level of an academic institution.
label: Institution @en
subclass of: Organizacija

Grupiranje znanja
issued: 2008-05-14
type: Class
type: Thing
comment: A KnowledgeGrouping represents a collection of resources, learning objectives, timetables, and other materials. The more specific subclasses of Subject, Programme, Course and Module are preferred.
label: KnowledgeGrouping @en
disjoint with: Organizacija

Modul
issued: 2008-05-14
type: Class
type: Thing
comment: A Module is a KnowledgeGrouping that represents a cohesive collection of educational material referred to by the owning organization as a module.
label: Module @en
subclass of: Grupiranje znanja

Nastavni program
issued: 2008-05-14
type: Class
type: Thing
comment: A Programme is a KnowledgeGrouping that represents a cohesive collection of educational material referred to by the owning organization as a programme.
comment: Nastavni program za akademsku godinu.
label: Programme @en
subclass of: Grupiranje znanja

description
issued: 2008-05-14
type: Thing

knowledgeGrouping
issued: 2008-05-14
type: ObjectProperty
type: Thing
comment: A KnowledgeGrouping may be contained by another KnowledgeGrouping or an organizationalUnit using knowledgeGrouping.
domain: http://lodlaundromat.org/.well-known/genid/452805fade864bce6d7f82235c8de034#1
range: Grupiranje znanja
sub property of: replaces
term status: Deprecated

name
issued: 2008-05-14
type: Thing
term status: Deprecated

organization
issued: 2008-09-25
type: ObjectProperty
type: Thing
comment: A foaf Organization may contain other subsidiary Organizations using organization.
domain: Organizacija
range: Organizacija
inverse of: part of

organizationalUnit
issued: 2008-05-14
type: ObjectProperty
type: Thing
domain: Organizacija
range: Organizacija
term status: Deprecated

part of
issued: 2008-09-25
type: ObjectProperty
type: Thing
comment: A foaf Organization may refer to its parent Organizations using part_of.
domain: Organizacija
range: Organizacija

responsibilityOf
issued: 2008-05-20
type: Thing

responsibleFor
issued: 2008-09-25
type: Thing

teaches
issued: 2008-09-25
type: ObjectProperty
type: Thing
comment: An organization may specify the Knowledge Groupings that it teaches using this property.
domain: Organizacija
range: Grupiranje znanja

Predmet
type: Class
comment: An administrative designation for a course, e.g. English 101. The same course can have many different manifestations, usually denoted by section numbers and semesters.
label: Course @en
subclass of: Grupiranje znanja

Izvedba predmeta
type: Class
comment: An instance of a Course. I.e., a group of teacher(s) and students during a particular term.
label: Course Instance @en

Vrsta nastave
type: Class
comment: Types for Course Instance, e.g. "Lecture", "Discussion", "Lab", etc.. expressed as a resource
label: CourseInstanceType @en

Odjel
type: Class
comment: Any administrative subdivision within and EducationalInstitution. Most commonly, this covers departments like English, HIstory, Physics, etc. It also covers entities such as an Honors Council, Information Technology Group, Library System, etc.
comment: Odjel, odsjek i sl.
label: Division @en
subclass of: Organizacija

Element ustroja nastave
type: Class
comment: A term during which classes meet, like a semester, trimester, quarter, etc.
label: Term @en

course instance type
type: ObjectProperty
comment: The CourseInstanceType of this CourseManifestation.
domain: Izvedba predmeta
range: Vrsta nastave

has child CourseManifestation
type: ObjectProperty
comment: A CourseInstance that derives from this CourseInstance, as a Lab or a Recitation associated with a Lecture. The students in a childCourseInstance is a subset of the students in a parent CourseInstance.
domain: Izvedba predmeta
range: Izvedba predmeta

has manifestation
type: ObjectProperty
comment: A manifestation of the abstract, administrative course title.
domain: Predmet
range: Izvedba predmeta
inverse of: instance of

has parent CourseInstance
type: ObjectProperty
comment: The 'parent' CourseInstance, as a Lecture is often the parent of a Lab.
domain: Izvedba predmeta
range: Izvedba predmeta

in department
type: ObjectProperty
comment: The department the person belongs to.
domain: Osoba
range: Odjel

instance of
type: ObjectProperty
comment: The abstract, administrative Course that this is an instance of.
domain: Izvedba predmeta
range: Predmet

owner department
type: ObjectProperty
comment: The Department which 'owns' the Course. I.e., it has administrative control over the Course.
domain: Predmet
range: Odjel

owns course
type: ObjectProperty
comment: A Course the Department has administrative control over.
domain: Organizacija
range: Predmet
inverse of: ownerOrganization

studies
type: ObjectProperty
comment: A topic or a work that is studied in the CourseManifestation
domain: Izvedba predmeta

studiesAgent
type: ObjectProperty
comment: A foaf:Agent studied by the CourseInstance.
sub property of: studies

studies object
type: ObjectProperty
comment: An object that is studied in the CourseManifestation, e.g., a galaxy, a molecule, a protein. Generally speaking, a science course will use univ:studiesObject while a humanities course will use univ:studiesWork.
sub property of: studies

studies place
type: ObjectProperty
comment: A place studied in the course.
sub property of: studies

studies topic
type: ObjectProperty
comment: A topic studied in the course, e.g. "feminism", "Battle of the Bulge", "Quantum Chromodynamics".. Ideally, the object is something in DBpedia.
range: Concept
sub property of: studies

studies work
type: ObjectProperty
comment: A particular work studied in the CourseManifestation, e.g. Chaucer's "Canterbury Tales", the Codex Amiatinus, Faulkner's "Absolom! Absolom!", Madonna's "Like A Virgin", the Eiffel Tower, etc.
sub property of: studies

taught by
type: ObjectProperty
comment: A teacher for the course.
domain: Izvedba predmeta
range: Osoba
inverse of: teaches

teaches
type: ObjectProperty
comment: A CourseManifestation that the person teaches. No differentiation is made about currently teaching, taught in the past, or will teach in the future. This property is intended to cover all those case.
domain: Osoba
range: Izvedba predmeta

term
type: ObjectProperty
comment: The term during which the CourseManifestation exists.
domain: Izvedba predmeta
range: Element ustroja nastave

Organizacija
type: Class
label: Organization @en

Osoba
type: Class
comment: Bilo kakva persona :)
label: Person @en