Kommune
subclass of: Resource
subclass of: Thing
type: Class
comment: En kommune er et område som utgjør en andreordens politisk og administrativ enhet.

Grunneiendom
subclass of: Resource
subclass of: Thing
type: Class
comment: Grunneiendom er en geografisk del av landet som har et eget eierforhold.

Kommunesenter
subclass of: Resource
subclass of: Thing
type: Class
comment: Et kommunesenter er et sted som tjener som administrativt senter for en kommune.
subclass of: Sted

Fylke
subclass of: Resource
subclass of: Thing
type: Class
comment: Et fylke er et område som utgjør en førsteordens politisk og administrativ enhet.

Sted
subclass of: Resource
subclass of: Thing
type: Class
comment: Et sted er et avgrenset område.

Kjetil Kjernsmo
type: Person

Festenummer
type: Property
type: DatatypeProperty
comment: Festenummeret er et nummer på et leid grunneiendom i matrikkelen.
domain: Grunneiendom
range: Literal
domain: Thing
domain: Resource
range: Resource

Eier
type: Property
comment: Indikerer et eierforhold mellom en agent og en grunneiendom.
domain: Agent
range: Grunneiendom
domain: Resource
range: Resource
range: Thing

Seksjonsnummer
type: Property
type: DatatypeProperty
comment: Et seksjonsnummer er et nummer i matrikkelen som benyttes der en eiendom består av flere selvstendige eierenheter som skal selges og pantsettes hver for seg.
domain: Grunneiendom
range: Literal
domain: Thing
domain: Resource
range: Resource

Kommunenummer
type: Property
type: DatatypeProperty
comment: Kommunenummer er et firesifret nummer (eks.: 0101) som er unikt for hver kommune i Norge.
domain: Kommune
range: Literal
domain: Thing
domain: Resource
range: Resource

Eid av
type: Property
comment: Indikerer at en grunneiendom er eid av en agent.

Bruksnummer
type: Property
type: DatatypeProperty
comment: Et bruksnummer er en del av en enhet i det norske eiendomsregisteret, matrikkelen.
domain: Grunneiendom
range: Literal
domain: Thing
domain: Resource
range: Resource

Senter
type: Property
comment: For å linke en kommune med stedet som er kommunens senter.
domain: Kommune
range: Kommunesenter
domain: Thing
domain: Resource
range: Sted
range: Resource
range: Thing

Universitetet i Oslo
type: Agent
member: Kjetil Kjernsmo

Fylkenummer
type: Property
type: DatatypeProperty
comment: Fylkenummer er et tosifret nummer (eks.: 01) som er unikt for hvert fylke i Norge.
domain: Fylke
range: Literal
domain: Resource
domain: Thing
range: Resource

Landinndelingen i Norge
part of: vocab.lenka.no
preferred namespace uri: http://vocab.lenka.no/geo-deling#
preferred namespace prefix: geo-deling
creator: Kjetil Kjernsmo
created: 2011-03-18
type: Ontology
description: Dette er et vokabular for administrativ inndeling av Norge, matrikkelen, steder og andre geografiske ting.
status: UnderDevelopment
license: http://creativecommons.org/licenses/by/3.0/
publisher: Universitetet i Oslo
modified: 2012-10-11

Gårdsnummer
type: Property
type: DatatypeProperty
comment: Gårdsnummer er nummeret på en gårdsenhet i matrikkelen og er unikt innenfor hver kommune.
domain: Grunneiendom
range: Literal
domain: Thing
domain: Resource
range: Resource