TextReuse
subclass of: Thing
subclass of: http://lodlaundromat.org/.well-known/genid/samples/jena///class//3f3130c59a5815df016231a7f07aa664/ed050a191dba52f09073dad2355d4a3a#1
subclass of: Resource
type: Class
subclass of: Observation
comment: A WrittenWork (or portion thereof) that quotes, translates, summarizes, or otherwise re-uses another WrittenWork.
subclass of: Activity

maker
sub property of: creator
range: Thing
equivalent property: creator
comment: An agent that made this thing.
term status: stable
domain: Thing
inverse of: made
type: Property
range: Agent
type: ObjectProperty
range: Resource
domain: Resource

Group
subclass of: Agent
subclass of: Resource
type: Class
subclass of: Thing
comment: Any group of Agents referred to as a single entity.

depiction
range: Thing
type: Property
type: ObjectProperty
comment: A depiction of some thing.
domain: Thing
range: Image
inverse of: depicts
term status: testing
range: Document
range: Resource
domain: Resource

Place
subclass of: Feature
subclass of: E27 Site
subclass of: Resource
type: Class
subclass of: Thing
comment: Any conceivable place, such as a town, a mountain, or the site of a building.
equivalent class: E27 Site
equivalent class: Feature

Agent
subclass of: Thing
subclass of: Agent
subclass of: Resource
type: Class
equivalent class: Agent
comment: An Agent is an abstract entity which has agency or is considered capable of acting in some way. Current subclasses include Deities and Persons.

Hand
subclass of: Resource
type: Class
subclass of: Thing
subclass of: WrittenWork
comment: A portion of a Written Work in a distinct hand. Written Works may consist of one or more hands.
subclass of: E33 Linguistic Object

MythologicalCreature
subclass of: Resource
type: Class
subclass of: Thing
subclass of: Agent
comment: Class for non-human, non-divine Agents, e.g. Polyphemus or Medusa.
deprecated: Will be removed in a future release.

knows
range: Thing
domain: Thing
type: Property
type: ObjectProperty
comment: A person known by this person (indicating some level of reciprocated interaction between the parties).
domain: Person
range: Person
term status: stable
range: Agent
range: Resource
range: SpatialThing
domain: Agent
domain: SpatialThing
domain: Resource

reuseIn
range: Thing
domain: Thing
type: ObjectProperty
comment: Links an instance of text reuse to a citation of the work in which the reuse appears.
range: Citation
domain: TextReuse
type: Property
range: Resource
domain: Resource
domain: Observation
domain: http://lodlaundromat.org/.well-known/genid/samples/jena///class//3f3130c59a5815df016231a7f07aa664/ed050a191dba52f09073dad2355d4a3a#1
domain: Activity

Online Account
subclass of: Resource
type: Class
comment: An online account.
subclass of: Thing
term status: testing

EvidentiaryItem
subclass of: http://lodlaundromat.org/.well-known/genid/samples/jena///class//3f3130c59a5815df016231a7f07aa664/ed050a191dba52f09073dad2355d4a3a#1
subclass of: Thing
subclass of: Resource
type: Class
subclass of: Observation
comment: Superclass for types of evidence that support assertions.
subclass of: Activity

Online Chat Account
subclass of: Resource
subclass of: Thing
type: Class
comment: An online chat account.
subclass of: Online Account
term status: unstable

thumbnail
range: Thing
domain: Thing
type: Property
type: ObjectProperty
comment: A derived thumbnail image.
domain: Image
range: Image
term status: testing
range: Document
range: Resource
domain: Resource
domain: Document

responsibleAgent
range: Thing
domain: Thing
type: ObjectProperty
comment: Connects a work of any type to the person, group, or insitution responsible for the creation of the work.
range: Agent
inverse of: responsibleFor
type: Property
range: Resource
domain: Resource

Person
subclass of: E21 Person
subclass of: Agent
subclass of: Resource
type: Class
subclass of: Thing
comment: Any person, whether historical, mythological, or fictional
equivalent class: E21 Person

witness
range: Thing
domain: Thing
type: ObjectProperty
comment: (Experimental) Connects an item in a collation to the witness it derives from.
domain: CollationItem
range: Siglum
type: Property
range: Resource
range: Citation
domain: Resource

embodies
range: Thing
domain: Thing
type: ObjectProperty
comment: The relationship between a Written Work and the abstract Conceptual Work it embodies. For example, the OCT text of Homer's Iliad's relationship to the idea of Homer's Iliad.
range: ConceptualWork
domain: WrittenWork
type: Property
range: Resource
domain: Resource
domain: E33 Linguistic Object

interest
range: Thing
domain: Thing
type: Property
type: ObjectProperty
comment: A page about a topic of interest to this person.
domain: Agent
range: Document
term status: testing
range: Resource
domain: Resource

depicts
domain: Thing
type: Property
type: ObjectProperty
comment: A thing depicted in this representation.
domain: Image
range: Thing
inverse of: depiction
term status: testing
range: Resource
domain: Resource
domain: Document

account
range: Thing
domain: Thing
type: Property
type: ObjectProperty
comment: Indicates an account held by this agent.
domain: Agent
range: Online Account
term status: testing
range: Resource
domain: Resource

AssembledWork
subclass of: Resource
type: Class
subclass of: Thing
subclass of: WrittenWork
comment: A Written Work that collects together more than one Written Work. Manuscripts are often AssembledWorks.
subclass of: E33 Linguistic Object

PlaceName
subclass of: Resource
type: Class
subclass of: Thing
subclass of: Name
comment: The name of a lawd:Place

Translation
subclass of: Resource
type: Class
subclass of: Thing
subclass of: WrittenWork
comment: A Written Work that translates one or more other Written Works that embody the same Conceptual Work.
subclass of: E33 Linguistic Object

PersonalName
subclass of: Resource
type: Class
subclass of: Thing
subclass of: Name
comment: A name belonging to a lawd:Person

schoolHomepage
range: Thing
domain: Thing
type: Property
type: ObjectProperty
comment: A homepage of a school attended by the person.
domain: Person
range: Document
term status: testing
range: Resource
domain: Agent
domain: SpatialThing
domain: Resource

Person
subclass of: Agent
subclass of: Resource
subclass of: Thing
comment: A person.
term status: stable
subclass of: SpatialThing
disjoint with: Project
type: Class
subclass of: Person
disjoint with: Organization

topic
domain: Thing
type: Property
type: ObjectProperty
comment: A topic of some page or document.
domain: Document
range: Thing
inverse of: page
term status: testing
range: Resource
domain: Resource

Project
subclass of: Resource
subclass of: Thing
type: Class
comment: A project (a collective endeavour of some kind).
disjoint with: Person
disjoint with: Document
term status: testing

member
range: Thing
domain: Thing
type: Property
type: ObjectProperty
comment: Indicates a member of a Group
domain: Group
range: Agent
term status: stable
range: Resource
domain: Agent
domain: Resource

TextPart
subclass of: Resource
type: Class
subclass of: Thing
subclass of: WrittenWork
comment: Any portion of a larger WrittenWork.
subclass of: E33 Linguistic Object

Reading
subclass of: Resource
type: Class
subclass of: Thing
subclass of: Concept
comment: (Experimental) The superclass for members of the readingScheme concept scheme. A Reading is a word, phrase, or larger chunk of text from a witness (or any observation of variance concerning the text, such as an omission or interpolation).

reuseFrom
range: Thing
domain: Thing
type: ObjectProperty
comment: Links an instance of text reuse to a citation of the work from which the text came.
range: Citation
domain: TextReuse
type: Property
range: Resource
domain: Resource
domain: Observation
domain: http://lodlaundromat.org/.well-known/genid/samples/jena///class//3f3130c59a5815df016231a7f07aa664/ed050a191dba52f09073dad2355d4a3a#1
domain: Activity

homepage
range: Thing
comment: A homepage for some thing.
range: Document
type: Property
term status: stable
sub property of: page
sub property of: is primary topic of
domain: Thing
type: ObjectProperty
type: InverseFunctionalProperty
range: Resource
domain: Resource

current project
domain: Thing
type: Property
type: ObjectProperty
comment: A current project this person works on.
domain: Person
range: Thing
term status: testing
range: Resource
domain: Agent
domain: SpatialThing
domain: Resource

weblog
range: Thing
domain: Thing
sub property of: page
type: Property
range: Document
term status: testing
comment: A weblog of some thing (whether person, group, company etc.).
domain: Agent
type: InverseFunctionalProperty
type: ObjectProperty
range: Resource
domain: Resource

phone
range: Thing
domain: Thing
type: Property
type: ObjectProperty
comment: A phone, specified using fully qualified tel: URI scheme (refs: http://www.w3.org/Addressing/schemes.html#tel).
term status: testing
range: Resource
domain: Resource

Image
subclass of: Resource
subclass of: Thing
type: Class
comment: An image.
subclass of: Document
term status: testing

hasAttestation
range: Thing
domain: Thing
type: ObjectProperty
comment: Indicates a lawd:Attestation providing evidence for a name, etc.
range: Attestation
type: Property
range: http://lodlaundromat.org/.well-known/genid/samples/jena///class//3f3130c59a5815df016231a7f07aa664/ed050a191dba52f09073dad2355d4a3a#1
range: Resource
range: Observation
range: EvidentiaryItem
range: Activity
domain: Resource

Citation
subclass of: Thing
subclass of: Resource
type: Class
comment: A Citation models a bibliographic reference as a resource.

made
domain: Thing
type: Property
type: ObjectProperty
comment: Something that was made by this agent.
domain: Agent
range: Thing
inverse of: maker
term status: stable
range: Resource
domain: Resource

WrittenWork
subclass of: Thing
subclass of: Resource
type: Class
subclass of: E33 Linguistic Object
comment: A written work, whether extant or not. May be considered to embody a Conceptual Work.
equivalent class: E33 Linguistic Object

is primary topic of
range: Thing
comment: A document that this thing is the primary topic of.
domain: Thing
sub property of: page
type: InverseFunctionalProperty
range: Document
type: Property
term status: stable
inverse of: primary topic
type: ObjectProperty
range: Resource
domain: Resource

Edition
subclass of: Resource
type: Class
subclass of: Thing
subclass of: WrittenWork
comment: A published (whether officially or not) Written Work that relies on one or more Written Works as sources
subclass of: E33 Linguistic Object

Document
subclass of: Resource
subclass of: Thing
type: Class
comment: A document.
disjoint with: Organization
disjoint with: Project
term status: testing

Online Gaming Account
subclass of: Resource
subclass of: Thing
type: Class
comment: An online gaming account.
subclass of: Online Account
term status: unstable

hasCitation
range: Thing
domain: Thing
type: ObjectProperty
comment: Indicates a Citation that contains the source for a lawd:Attestation
range: Citation
domain: EvidentiaryItem
type: Property
range: Resource
domain: Observation
domain: Resource
domain: http://lodlaundromat.org/.well-known/genid/samples/jena///class//3f3130c59a5815df016231a7f07aa664/ed050a191dba52f09073dad2355d4a3a#1
domain: Activity

CollationItem
subclass of: Resource
type: Class
subclass of: Thing
comment: (Experimental) Part of a collation of witnesses to a text.

workplace homepage
range: Thing
domain: Thing
type: Property
type: ObjectProperty
comment: A workplace homepage of some person; the homepage of an organization they work for.
domain: Person
range: Document
term status: testing
range: Resource
domain: Agent
domain: SpatialThing
domain: Resource

Siglum
subclass of: Resource
type: Class
subclass of: Thing
subclass of: Citation
comment: A Siglum represents a witness (a Written Work of some kind) and associates it with a symbol used to represent that work in the context of an Edition.

Deity
subclass of: Agent
subclass of: Resource
type: Class
subclass of: Thing
comment: Any divine Agent.

personal mailbox
domain: Thing
type: Property
type: InverseFunctionalProperty
type: ObjectProperty
comment: A personal mailbox, ie. an Internet mailbox associated with exactly one owner, the first owner of this mailbox. This is a 'static inverse functional property', in that there is (across time and change) at most one individual that ever has any particular value for foaf:mbox.
domain: Agent
range: Thing
term status: stable
range: Resource
domain: Resource

Name
subclass of: Thing
subclass of: Resource
type: Class
comment: A name is a resource providing a name for some thing. It may be specialized with subclasses like PersonalName or PlaceName

Attestation
subclass of: Resource
type: Class
subclass of: Thing
subclass of: EvidentiaryItem
comment: An Attestation models a piece of evidence for something in a text (e.g. the mention of a person in a document). Typically it is the conjunction of a Citation and an entity like a name or person.
subclass of: Observation
subclass of: Activity
subclass of: http://lodlaundromat.org/.well-known/genid/samples/jena///class//3f3130c59a5815df016231a7f07aa664/ed050a191dba52f09073dad2355d4a3a#1

focus
domain: Thing
type: Property
type: ObjectProperty
comment: The underlying or 'focal' entity associated with some SKOS-described concept.
domain: Concept
range: Thing
term status: testing
range: Resource
domain: Resource

openid
sub property of: page
range: Thing
domain: Thing
range: Document
type: ObjectProperty
term status: testing
type: Property
domain: Agent
type: InverseFunctionalProperty
sub property of: is primary topic of
comment: An OpenID for an Agent.
range: Resource
domain: Resource

origin
range: Thing
domain: Thing
type: ObjectProperty
comment: The place where an artifact originated.
range: Place
sub property of: where
type: Property
range: Resource
range: Feature
range: E27 Site
domain: Resource

Online E-commerce Account
subclass of: Resource
subclass of: Thing
type: Class
comment: An online e-commerce account.
subclass of: Online Account
term status: unstable

Group
subclass of: Agent
subclass of: Resource
subclass of: Thing
type: Class
comment: A class of Agents.
term status: stable

Agent
subclass of: Thing
subclass of: Resource
subclass of: Agent
type: Class
comment: An agent (eg. person, group, software or physical artifact).
equivalent class: Agent
term status: stable

Label Property
subclass of: Resource
subclass of: Thing
type: Class
comment: A foaf:LabelProperty is any RDF property with texual values that serve as labels.
term status: unstable

conjunctOf
range: Thing
domain: Thing
type: ObjectProperty
type: SymmetricProperty
comment: Indicates that a piece of evidence (any subclass of lawd:EvidentiaryItem) is joined to another—for example because they co-occur.
range: EvidentiaryItem
domain: EvidentiaryItem
type: Property
range: http://lodlaundromat.org/.well-known/genid/samples/jena///class//3f3130c59a5815df016231a7f07aa664/ed050a191dba52f09073dad2355d4a3a#1
range: Resource
range: Observation
range: Activity
domain: Observation
domain: Resource
domain: http://lodlaundromat.org/.well-known/genid/samples/jena///class//3f3130c59a5815df016231a7f07aa664/ed050a191dba52f09073dad2355d4a3a#1
domain: Activity

Observer Role Association
subclass of: Resource
type: Class
subclass of: Thing
subclass of: http://lodlaundromat.org/.well-known/genid/samples/jena///class//3f3130c59a5815df016231a7f07aa664/ed050a191dba52f09073dad2355d4a3a#2
equivalent class: http://lodlaundromat.org/.well-known/genid/samples/jena///class//3f3130c59a5815df016231a7f07aa664/ed050a191dba52f09073dad2355d4a3a#2
subclass of: Association
comment: An instance of lawd:ObserverRoleAssociation characterizes a prov:Agent's association to a prov:Activity as serving in a lawd:observer role.

Organization
subclass of: Resource
subclass of: Thing
subclass of: Agent
type: Class
comment: An organization.
disjoint with: Person
disjoint with: Document
term status: stable

publications
range: Thing
domain: Thing
type: Property
type: ObjectProperty
comment: A link to the publications of this person.
domain: Person
range: Document
term status: testing
range: Resource
domain: Agent
domain: SpatialThing
domain: Resource

image
range: Thing
domain: Thing
type: Property
type: ObjectProperty
comment: An image that can be used to represent some thing (ie. those depictions which are particularly representative of something, eg. one's photo on a homepage).
domain: Person
range: Image
sub property of: depiction
term status: testing
range: Resource
range: Document
domain: Resource
domain: Agent
domain: SpatialThing

work info homepage
range: Thing
domain: Thing
type: Property
type: ObjectProperty
comment: A work info homepage of some person; a page about their work for some organization.
domain: Person
range: Document
term status: testing
range: Resource
domain: Agent
domain: SpatialThing
domain: Resource

PersonalProfileDocument
subclass of: Resource
subclass of: Thing
type: Class
comment: A personal profile RDF document.
subclass of: Document
term status: testing

ConceptualWork
subclass of: Thing
subclass of: Resource
type: Class
comment: A Conceptual Work groups together one or more Written Works which have the same intellectual source. E.g. The Iliad, as opposed to a particular manuscript witness or edition of the Iliad.

primary topic
domain: Thing
domain: Document
type: FunctionalProperty
range: Thing
type: Property
term status: stable
type: ObjectProperty
comment: The primary topic of some page or document.
inverse of: is primary topic of
range: Resource
domain: Resource

based near
range: Thing
domain: Thing
type: Property
type: ObjectProperty
comment: A location that something is based near, for some broadly human notion of near.
domain: SpatialThing
range: SpatialThing
term status: testing
range: Resource
domain: Resource

account service homepage
range: Thing
domain: Thing
type: Property
type: ObjectProperty
comment: Indicates a homepage of the service provide for this online account.
domain: Online Account
range: Document
term status: testing
range: Resource
domain: Resource

responsibleFor
range: Thing
domain: Thing
inverse of: responsibleAgent
type: ObjectProperty
comment: Connects any kind of author or creator to the work he/she/it is responsible for creating or contributing to. The author may be anonymous or fictional.
domain: Agent
type: Property
range: Resource
domain: Resource

page
range: Thing
type: Property
type: ObjectProperty
comment: A page or document about this thing.
domain: Thing
range: Document
inverse of: topic
term status: testing
range: Resource
domain: Resource

Observation
subclass of: Resource
type: Class
subclass of: Thing
subclass of: http://lodlaundromat.org/.well-known/genid/samples/jena///class//3f3130c59a5815df016231a7f07aa664/ed050a191dba52f09073dad2355d4a3a#1
equivalent class: http://lodlaundromat.org/.well-known/genid/samples/jena///class//3f3130c59a5815df016231a7f07aa664/ed050a191dba52f09073dad2355d4a3a#1
subclass of: Activity
comment: An Observation is a scholarly assertion based on looking at evidence. An Observation might state, for example, that an entity provides evidence for the existence of a person or that a text quotes from another text.

hasName
range: Thing
domain: Thing
type: ObjectProperty
comment: Indicates that (e.g.) a Person or Place has a lawd:Name that is the range of the property.
range: Name
type: Property
range: Resource
domain: Resource

represents
range: Thing
domain: Thing
type: ObjectProperty
comment: Describes the relationship between a Citation or Siglum and the Written Work it indicates.
domain: Citation
range: WrittenWork
inverse of: representedBy
type: Property
range: Resource
range: E33 Linguistic Object
domain: Resource

topic_interest
domain: Thing
type: Property
type: ObjectProperty
comment: A thing of interest to this person.
domain: Agent
range: Thing
term status: testing
range: Resource
domain: Resource

foundAt
range: Thing
domain: Thing
type: ObjectProperty
comment: The place where an artifact was discovered.
range: Place
sub property of: where
type: Property
range: Resource
range: Feature
range: E27 Site
domain: Resource

account
range: Thing
domain: Thing
type: Property
type: ObjectProperty
comment: Indicates an account held by this agent.
domain: Agent
range: Online Account
term status: archaic
range: Resource
domain: Resource

where
range: Thing
domain: Thing
type: ObjectProperty
comment: Generic location relation. Useful when the nature of the related place (e.g. origin, findspot) is not clear.
range: Place
type: Property
range: Resource
range: E27 Site
range: Feature
domain: Resource

Sigla
subclass of: Resource
type: Class
subclass of: Thing
subclass of: OrderedList
comment: An ordered collection that maps Written Works used as sources for an Edition to symbols used to represent them in the context of that Edition.

tipjar
range: Thing
domain: Thing
type: Property
type: ObjectProperty
comment: A tipjar document for this agent, describing means for payment and reward.
domain: Agent
range: Document
sub property of: page
term status: testing
range: Resource
domain: Resource

representedBy
range: Thing
domain: Thing
inverse of: represents
type: ObjectProperty
deprecated: Will be removed in a future release.
range: Citation
domain: WrittenWork
type: Property
range: Resource
domain: Resource
domain: E33 Linguistic Object

past project
domain: Thing
type: Property
type: ObjectProperty
comment: A project this person has previously worked on.
domain: Person
range: Thing
term status: testing
range: Resource
domain: Agent
domain: SpatialThing
domain: Resource

firstName
type: Property
type: DatatypeProperty
comment: The first name of a person.
domain: Person
range: Literal
term status: testing
range: Resource
domain: Agent
domain: SpatialThing
domain: Thing
domain: Resource

ICQ chat ID
sub property of: nickname
term status: testing
domain: Agent
range: Literal
comment: An ICQ chat ID
type: InverseFunctionalProperty
type: Property
type: DatatypeProperty
type: ObjectProperty
range: Resource
domain: Resource
domain: Thing

birthday
type: Property
type: FunctionalProperty
type: DatatypeProperty
comment: The birthday of this Agent, represented in mm-dd string form, eg. '12-31'.
domain: Agent
range: Literal
term status: unstable
range: Resource
domain: Resource
domain: Thing

Given name
type: Property
type: DatatypeProperty
comment: The given name of some person.
term status: archaic

primaryForm
type: DatatypeProperty
comment: Indicates the primary form of a lawd:Name
domain: Name
type: Property
domain: Resource
domain: Thing

Given name
type: Property
type: DatatypeProperty
comment: The given name of some person.
term status: testing

Skype ID
type: Property
type: DatatypeProperty
comment: A Skype ID
domain: Agent
range: Literal
sub property of: nickname
term status: testing
range: Resource
domain: Resource
domain: Thing

lastName
type: Property
type: DatatypeProperty
comment: The last name of a person.
domain: Person
range: Literal
term status: testing
range: Resource
domain: Agent
domain: SpatialThing
domain: Thing
domain: Resource

Yahoo chat ID
domain: Agent
term status: testing
range: Literal
comment: A Yahoo chat ID
type: DatatypeProperty
sub property of: nickname
type: Property
type: InverseFunctionalProperty
type: ObjectProperty
range: Resource
domain: Resource
domain: Thing

membershipClass
type: Property
type: AnnotationProperty
comment: Indicates the class of individuals that are a member of a Group
term status: unstable

DNA checksum
type: Property
type: DatatypeProperty
comment: A checksum for the DNA of some thing. Joke.
range: Literal
term status: archaic
range: Resource

gender
type: Property
type: FunctionalProperty
type: DatatypeProperty
comment: The gender of this Agent (typically but not necessarily 'male' or 'female').
domain: Agent
range: Literal
term status: testing
range: Resource
domain: Resource
domain: Thing

sha1sum of a personal mailbox URI name
type: Property
type: InverseFunctionalProperty
type: DatatypeProperty
comment: The sha1sum of the URI of an Internet mailbox associated with exactly one owner, the first owner of the mailbox.
domain: Agent
range: Literal
term status: testing
type: ObjectProperty
range: Resource
domain: Resource
domain: Thing

logo
type: Property
type: ObjectProperty
type: InverseFunctionalProperty
comment: A logo representing some thing.
domain: Thing
range: Thing
term status: testing
range: Resource
domain: Resource

observer role
type: NamedIndividual
type: Role
comment: The role of justifying a claim by appealing to observed evidence.

funded by
type: Property
type: ObjectProperty
comment: An organization funding a project or person.
domain: Thing
range: Thing
term status: archaic
range: Resource
domain: Resource

familyName
type: Property
type: DatatypeProperty
comment: The family name of some person.
domain: Person
range: Literal
term status: testing
range: Resource
domain: Agent
domain: SpatialThing
domain: Thing
domain: Resource

variantForm
type: DatatypeProperty
comment: Indicates a variant form of a lawd:Name
domain: Name
sub property of: topDataProperty
type: Property
domain: Resource
domain: Thing

status
type: Property
type: DatatypeProperty
comment: A string expressing what the user is happy for the general public (normally) to know about their current activity.
domain: Agent
range: Literal
term status: unstable
range: Resource
domain: Resource
domain: Thing

MSN chat ID
sub property of: nickname
type: InverseFunctionalProperty
comment: An MSN chat ID
domain: Agent
type: DatatypeProperty
term status: testing
type: Property
range: Literal
type: ObjectProperty
range: Resource
domain: Resource
domain: Thing

sha1sum (hex)
type: Property
type: DatatypeProperty
comment: A sha1sum hash, in hex.
domain: Document
term status: unstable
domain: Resource
domain: Thing

Friend of a Friend (FOAF) vocabulary
type: Ontology
description: The Friend of a Friend (FOAF) RDF vocabulary, described using W3C RDF Schema and the Web Ontology Language.

readingScheme
type: NamedIndividual
comment: (Experimental) The SKOS scheme for classifying types of lawd:Reading.

jabber ID
type: Property
type: DatatypeProperty
type: InverseFunctionalProperty
comment: A jabber ID for something.
domain: Agent
range: Literal
term status: testing
type: ObjectProperty
range: Resource
domain: Resource
domain: Thing

account name
type: Property
type: DatatypeProperty
comment: Indicates the name (identifier) associated with this online account.
domain: Online Account
range: Literal
term status: testing
range: Resource
domain: Resource
domain: Thing

collation
type: NamedIndividual
type: Motivation
comment: a Motivation that represents the addition of a critical apparatus comment upon a text
broader: commenting

name
type: Property
type: DatatypeProperty
comment: A name for some thing.
domain: Thing
range: Literal
sub property of: label
term status: testing
range: Resource
domain: Resource

Linking Ancient World Data Ontology
license: http://creativecommons.org/license/by/3.0/
description: The goal of LAWD is to fill in the cracks between the data used and published by projects with a focus on the ancient world and the standard Linked Data vocablary schemes, like Dublin Core, the Open Annotation Collaboration, and CIDOC-CRM.
version IRI: http://lawd.info/ontology/1.0/
imports: core#
imports: current
modified: 2014-09-03
type: NamedIndividual
type: Ontology
issued: 2013-03-28
preferred namespace prefix: lawd
imports: prov-o#
rights: Copyright © 2013 Hugh A. Cayless
imports: core
imports: oa#
type: Vocabulary
type: Thing

age
type: Property
type: FunctionalProperty
type: DatatypeProperty
comment: The age in years of some agent.
domain: Agent
range: Literal
term status: unstable
range: Resource
domain: Resource
domain: Thing

myersBriggs
type: Property
type: DatatypeProperty
comment: A Myers Briggs (MBTI) personality classification.
domain: Person
range: Literal
term status: testing
range: Resource
domain: Agent
domain: SpatialThing
domain: Thing
domain: Resource

title
type: Property
type: DatatypeProperty
comment: Title (Mr, Mrs, Ms, Dr. etc)
term status: testing

nickname
type: Property
type: DatatypeProperty
comment: A short informal nickname characterising an agent (includes login identifiers, IRC and other chat nicknames).
term status: testing

abbreviation
type: DatatypeProperty
comment: A label representing an abbreviated form of a name or title, e.g. of an author or work. E.g. Homer -> Hom.; Odyssey -> Od.;
type: Property

Surname
type: Property
type: DatatypeProperty
comment: The surname of some person.
domain: Person
range: Literal
term status: archaic
range: Resource
domain: Agent
domain: SpatialThing
domain: Thing
domain: Resource

plan
type: Property
type: DatatypeProperty
comment: Aplan comment, in the tradition of finger and '.plan' files.
domain: Person
range: Literal
term status: testing
range: Resource
domain: Agent
domain: SpatialThing
domain: Thing
domain: Resource

AIM chat ID
type: Property
type: DatatypeProperty
domain: Agent
comment: An AIM chat ID
type: InverseFunctionalProperty
term status: testing
range: Literal
sub property of: nickname
type: ObjectProperty
range: Resource
domain: Resource
domain: Thing

geekcode
type: Property
type: DatatypeProperty
comment: A textual geekcode for this person, see http://www.geekcode.com/geek.html
domain: Person
range: Literal
term status: archaic
range: Resource
domain: Agent
domain: SpatialThing
domain: Thing
domain: Resource

family_name
type: Property
type: DatatypeProperty
comment: The family name of some person.
domain: Person
range: Literal
term status: archaic
range: Resource
domain: Agent
domain: SpatialThing
domain: Thing
domain: Resource

theme
type: Property
type: ObjectProperty
comment: A theme.
domain: Thing
range: Thing
term status: archaic
range: Resource
domain: Resource