Graph Collection
disjoint with: Nothing
subclass of: Thing
type: Class
comment: An instance of sd:GraphCollection represents a collection of zero or more named graph descriptions. Each named graph description belonging to an sd:GraphCollection MUST be linked with the sd:namedGraph predicate.

name
sub property of: topObjectProperty
property disjoint with: bottomObjectProperty
type: ObjectProperty
type: Property
domain: Named Graph
comment: Relates a named graph to the name by which it may be referenced in a FROM/FROM NAMED clause. The object of the sd:name property is an IRI.

input format
sub property of: topObjectProperty
property disjoint with: bottomObjectProperty
type: ObjectProperty
type: Property
domain: Service
range: Format
comment: Relates an instance of sd:Service to a format that is supported for parsing RDF input; for example, via a SPARQL 1.1 Update LOAD statement, or when URIs are dereferenced in FROM/FROM NAMED/USING/USING NAMED clauses.

Basic Federated Query
type: Thing
type: Feature
comment: sd:BasicFederatedQuery, when used as the object of the sd:feature property, indicates that the SPARQL service supports basic federated query using the SERVICE keyword as defined by SPARQL 1.1 Federation Extensions.

named graph
sub property of: topObjectProperty
property disjoint with: bottomObjectProperty
type: ObjectProperty
type: Property
domain: Graph Collection
range: Named Graph
comment: Relates an instance of sd:GraphCollection (or its subclass sd:Dataset) to the description of one of its named graphs. The description of such a named graph MUST include the sd:name property and MAY include the sd:graph property.

extension aggregate
sub property of: feature
sub property of: topObjectProperty
property disjoint with: bottomObjectProperty
type: ObjectProperty
type: Property
domain: Service
range: Aggregate
comment: Relates an instance of sd:Service to an aggregate that may be used in a SPARQL aggregate query (for instance in a HAVING clause or SELECT expression) besides the standard list of supported aggregates COUNT, SUM, MIN, MAX, AVG, GROUP_CONCAT, and SAMPLE

feature
sub property of: topObjectProperty
property disjoint with: bottomObjectProperty
type: ObjectProperty
type: Property
domain: Service
range: Feature
comment: Relates an instance of sd:Service with a resource representing a supported feature.

default dataset description
sub property of: topObjectProperty
property disjoint with: bottomObjectProperty
type: InverseFunctionalProperty
type: ObjectProperty
type: Property
domain: Service
range: Dataset
comment: Relates an instance of sd:Service to a description of the default dataset available when no explicit dataset is specified in the query, update request or via protocol parameters.

extension function
sub property of: feature
sub property of: topObjectProperty
property disjoint with: bottomObjectProperty
type: ObjectProperty
type: Property
domain: Service
range: Function
comment: Relates an instance of sd:Service to a function that may be used in a SPARQL SELECT expression or a FILTER, HAVING, GROUP BY, ORDER BY, or BIND clause.

Dereferences URIs
type: Thing
type: Feature
comment: sd:DereferencesURIs, when used as the object of the sd:feature property, indicates that a SPARQL service will dereference URIs used in FROM/FROM NAMED and USING/USING NAMED clauses and use the resulting RDF in the dataset during query evaluation.

SPARQL 1.1 Query
type: Language
type: Thing
type: Feature
comment: sd:SPARQL11Query is an sd:Language representing the SPARQL 1.1 Query language.

Aggregate
disjoint with: Nothing
subclass of: Thing
subclass of: Feature
type: Class
comment: An instance of sd:Aggregate represents an aggregate that may be used in a SPARQL aggregate query (for instance in a HAVING clause or SELECT expression) besides the standard list of supported aggregates COUNT, SUM, MIN, MAX, AVG, GROUP_CONCAT, and SAMPLE.

SPARQL 1.0 Query
type: Language
type: Thing
type: Feature
comment: sd:SPARQL10Query is an sd:Language representing the SPARQL 1.0 Query language.

default graph
sub property of: topObjectProperty
property disjoint with: bottomObjectProperty
type: ObjectProperty
type: Property
domain: Dataset
range: Graph
comment: Relates an instance of sd:Dataset to the description of its default graph.

default entailment regime
sub property of: feature
sub property of: topObjectProperty
property disjoint with: bottomObjectProperty
type: ObjectProperty
type: Property
domain: Service
range: Entailment Regime
comment: Relates an instance of sd:Service with a resource representing an entailment regime used for basic graph pattern matching. This property is intended for use when a single entailment regime by default applies to all graphs in the default dataset of the service. In situations where a different entailment regime applies to a specific graph in the dataset, the sd:entailmentRegime property should be used to indicate this fact in the description of that graph.

property feature
sub property of: feature
sub property of: topObjectProperty
property disjoint with: bottomObjectProperty
type: ObjectProperty
type: Property
domain: Service
range: Feature
comment: Relates an instance of sd:Service to a resource representing an implemented feature that extends the SPARQL Query or Update language and that is accessed by using the named property.

Union Default Graph
type: Thing
type: Feature
comment: sd:UnionDefaultGraph, when used as the object of the sd:feature property, indicates that the default graph of the dataset used during query and update evaluation (when an explicit dataset is not specified) is comprised of the union of all the named graphs in that dataset.

Language
disjoint with: Nothing
subclass of: Thing
subclass of: Feature
type: Class
comment: An instance of sd:Language represents one of the SPARQL languages, including specific configurations providing particular features or extensions. This document defines three instances of sd:Language: sd:SPARQL10Query, sd:SPARQL11Query, and sd:SPARQL11Update.

Named Graph
disjoint with: Nothing
subclass of: Thing
type: Class
comment: An instance of sd:NamedGraph represents a named graph having a name (via sd:name) and an optional graph description (via sd:graph).

available graph descriptions
sub property of: topObjectProperty
property disjoint with: bottomObjectProperty
type: ObjectProperty
type: Property
domain: Service
range: Graph Collection
comment: Relates an instance of sd:Service to a description of the graphs which are allowed in the construction of a dataset either via the SPARQL Protocol, with FROM/FROM NAMED clauses in a query, or with USING/USING NAMED in an update request, if the service limits the scope of dataset construction.

supported entailment profile
sub property of: topObjectProperty
property disjoint with: bottomObjectProperty
type: ObjectProperty
type: Property
domain: Named Graph
range: Entailment Profile
comment: Relates a named graph description with a resource representing a supported profile of the entailment regime (as declared by sd:entailmentRegime) used for basic graph pattern matching over that graph.

supported language
sub property of: feature
sub property of: topObjectProperty
property disjoint with: bottomObjectProperty
type: ObjectProperty
type: Property
domain: Service
range: Language
comment: Relates an instance of sd:Service to a SPARQL language (e.g. Query and Update) that it implements.

Service
disjoint with: Nothing
subclass of: Thing
type: Class
comment: An instance of sd:Service represents a SPARQL service made available via the SPARQL Protocol.

result format
sub property of: topObjectProperty
property disjoint with: bottomObjectProperty
type: ObjectProperty
type: Property
domain: Service
range: Format
comment: Relates an instance of sd:Service to a format that is supported for serializing query results.

Function
disjoint with: Nothing
subclass of: Thing
subclass of: Feature
type: Class
comment: An instance of sd:Function represents a function that may be used in a SPARQL SELECT expression or a FILTER, HAVING, GROUP BY, ORDER BY, or BIND clause.

Entailment Regime
disjoint with: Nothing
subclass of: Thing
subclass of: Feature
type: Class
comment: An instance of sd:EntailmentRegime represents an entailment regime used in basic graph pattern matching (as described by SPARQL 1.1 Query Language).

language extension
sub property of: feature
sub property of: topObjectProperty
property disjoint with: bottomObjectProperty
type: ObjectProperty
type: Property
domain: Service
range: Feature
comment: Relates an instance of sd:Service to a resource representing an implemented extension to the SPARQL Query or Update language.

SPARQL 1.1 Update
type: Language
type: Thing
type: Feature
comment: sd:SPARQLUpdate is an sd:Language representing the SPARQL 1.1 Update language.

default supported entailment profile
sub property of: feature
sub property of: topObjectProperty
property disjoint with: bottomObjectProperty
type: ObjectProperty
type: Property
domain: Service
range: Entailment Profile
comment: Relates an instance of sd:Service with a resource representing a supported profile of the default entailment regime (as declared by sd:defaultEntailmentRegime).

Feature
disjoint with: Nothing
subclass of: Thing
type: Class
comment: An instance of sd:Feature represents a feature of a SPARQL service. Specific types of features include functions, aggregates, languages, and entailment regimes and profiles. This document defines five instances of sd:Feature: sd:DereferencesURIs, sd:UnionDefaultGraph, sd:RequiresDataset, sd:EmptyGraphs, and sd:BasicFederatedQuery.

Graph
disjoint with: Nothing
subclass of: Thing
type: Class
comment: An instance of sd:Graph represents the description of an RDF graph.

graph
sub property of: topObjectProperty
property disjoint with: bottomObjectProperty
type: ObjectProperty
type: Property
domain: Named Graph
range: Graph
comment: Relates a named graph to its graph description.

Dataset
disjoint with: Nothing
subclass of: Graph Collection
subclass of: Thing
type: Class
comment: An instance of sd:Dataset represents a RDF Dataset comprised of a default graph and zero or more named graphs.

endpoint
sub property of: topObjectProperty
property disjoint with: bottomObjectProperty
type: InverseFunctionalProperty
type: ObjectProperty
type: Property
domain: Service
comment: The SPARQL endpoint of an sd:Service that implements the SPARQL Protocol service. The object of the sd:endpoint property is an IRI.

Empty Graphs
type: Thing
type: Feature
comment: sd:EmptyGraphs, when used as the object of the sd:feature property, indicates that the underlying graph store supports empty graphs. A graph store that supports empty graphs MUST NOT remove graphs that are left empty after triples are removed from them.

entailment regime
sub property of: topObjectProperty
property disjoint with: bottomObjectProperty
type: ObjectProperty
type: Property
domain: Named Graph
range: Entailment Regime
comment: Relates a named graph description with a resource representing an entailment regime used for basic graph pattern matching over that graph.

Requires Dataset
type: Thing
type: Feature
comment: sd:RequiresDataset, when used as the object of the sd:feature property, indicates that the SPARQL service requires an explicit dataset declaration (based on either FROM/FROM NAMED clauses in a query, USING/USING NAMED clauses in an update, or the appropriate SPARQL Protocol parameters).

Entailment Profile
disjoint with: Nothing
subclass of: Thing
subclass of: Feature
type: Class
comment: An instance of sd:EntailmentProfile represents a profile of an entailment regime. An entailment profile MAY impose restrictions on what constitutes valid RDF with respect to entailment.