Cluster
subclass of: Resource
type: Class
subclass of: Thing
subclass of: http://lodlaundromat.org/.well-known/genid/samples/jena///class//3735e9aae47175cb0b4d3fa5d2779a4c/9dfa0ced2e1a84d5e73e3f17cb1985f9#1
disjoint with: Protein
disjoint with: Sequence
comment: Cluster of proteins with similar sequences.

Sequence
subclass of: Resource
type: Class
subclass of: Thing
comment: An amino acid sequence.
disjoint with: Cluster