Instructional Method
property disjoint with: bottomObjectProperty
Relation: instructionalMethod-002
Has Version: instructionalMethod-002
sub property of: topObjectProperty
type: Thing
date: 2005-06-13
type: ObjectProperty
issued: 2005-06-13
relation: instructionalMethod-002
description: Instructional Method will typically include ways of presenting instructional materials or conducting instructional activities, patterns of learner-to-learner and learner-to-instructor interactions, and mechanisms by which group and individual levels of learning are measured. Instructional methods include all aspects of the instruction and learning processes from planning and implementation through evaluation and feedback.
modified: 2008-01-14
type: Property
comment: A process, used to engender knowledge, attitudes and skills, that the described resource is designed to support.
range: Method of Instruction

Link Set graph
different from: Functions graph
file prefix: LINKSET
different from: Data graph
different from: Curation graph
different from: Documentation graph
different from: Script graph
type: Thing
different from: Vocabulary graph
different from: Proxy graph
different from: Controllers graph
different from: Mapping graph
different from: Constraints graph
different from: Rules Graph
type: Graph role
different from: Collection graph
different from: View graph
different from: Transforms graph
different from: Schema graph
description: A "vaem:LinkSetGraph" is a graph that holds statements that specify links between resources

Date Accepted
Relation: dateAccepted-002
type: Thing
type: DatatypeProperty
sub property of: date
property disjoint with: bottomDataProperty
sub property of: topDataProperty
date: 2002-07-13
Has Version: dateAccepted-002
sub property of: Date
issued: 2002-07-13
relation: dateAccepted-002
modified: 2008-01-14
range: Literal
comment: Date of acceptance of the resource.
type: Property
description: Examples of resources to which a Date Accepted may be relevant are a thesis (accepted by a university department) or an article (accepted by a journal).

Access Rights
date: 2003-02-15
type: ObjectProperty
relation: accessRights-002
sub property of: topObjectProperty
issued: 2003-02-15
type: Thing
Relation: accessRights-002
sub property of: rights
Has Version: accessRights-002
property disjoint with: bottomObjectProperty
range: Rights Statement
type: Property
comment: Information about who can access the resource or an indication of its security status.
description: Access Rights may include information regarding access or restrictions based on privacy, security, or other policies.
modified: 2008-01-14

Method of Instruction
issued: 2008-01-14
subclass of: Thing
type: Thing
Relation: MethodOfInstruction-001
type: Class
disjoint with: Nothing
date: 2008-01-14
relation: MethodOfInstruction-001
Has Version: MethodOfInstruction-001
comment: A process that is used to engender knowledge, attitudes, and skills.

TopQuadrant
url: http:/www.topquadrant.com
name: TopQuadrant, Inc.
different from: VAEM Schema Version 2.0 Metadata
type: Party
type: Thing

UDC
Relation: UDC-003
date: 2000-07-11
relation: UDC-003
issued: 2000-07-11
Has Version: UDC-003
type: VocabularyEncodingScheme
type: Thing
modified: 2008-01-14
comment: The set of conceptual resources specified by the Universal Decimal Classification.

LCC
Relation: LCC-003
date: 2000-07-11
relation: LCC-003
issued: 2000-07-11
Has Version: LCC-003
type: VocabularyEncodingScheme
type: Thing
modified: 2008-01-14
comment: The set of conceptual resources specified by the Library of Congress Classification.

Bibliographic Citation
date: 2003-02-15
Has Version: bibliographicCitation-002
sub property of: topDataProperty
sub property of: identifier
property disjoint with: bottomDataProperty
type: Thing
Relation: bibliographicCitation-002
issued: 2003-02-15
type: DatatypeProperty
sub property of: Identifier
relation: bibliographicCitation-002
description: Recommended practice is to include sufficient bibliographic detail to identify the resource as unambiguously as possible.
range: Literal
domain: Bibliographic Resource
comment: A bibliographic reference for the resource.
type: Property
modified: 2008-01-14

ISO 3166
Relation: ISO3166-004
date: 2000-07-11
relation: ISO3166-004
issued: 2000-07-11
Has Version: ISO3166-004
type: Thing
modified: 2008-01-14
type: Datatype
comment: The set of codes listed in ISO 3166-1 for the representation of names of countries.

W3C-DTF
Relation: W3CDTF-003
date: 2000-07-11
relation: W3CDTF-003
issued: 2000-07-11
Has Version: W3CDTF-003
type: Thing
modified: 2008-01-14
type: Datatype
comment: The set of dates and times constructed according to the W3C Date and Time Formats Specification.

file prefix
type: DatatypeProperty
property disjoint with: RDF/XML file URL
property disjoint with: bottomDataProperty
property disjoint with: namespace
property disjoint with: specificity
sub property of: topDataProperty
property disjoint with: latest published version
property disjoint with: url
property disjoint with: previous published version
property disjoint with: turtle file URL
description: The property "vaem:filePrefix" is for specifying a preferred file prefix for a graph. For example a schema graph may be given the file prefix "SCHEMA" followed by an underscore "_".
range: string

has license type
sub property of: topObjectProperty
property disjoint with: bottomObjectProperty
type: ObjectProperty
description: The property "vaem:hasLicenseType" points to an entry in the VOAG ontology for licenses

Rights Statement
type: Thing
subclass of: Thing
Has Version: RightsStatement-001
relation: RightsStatement-001
disjoint with: Nothing
date: 2008-01-14
type: Class
issued: 2008-01-14
Relation: RightsStatement-001
comment: A statement about the intellectual property rights (IPR) held in or over a Resource, a legal document giving official permission to do something with a resource, or a statement about access rights.

Audience
property disjoint with: bottomObjectProperty
date: 2001-05-21
sub property of: topObjectProperty
issued: 2001-05-21
Has Version: audience-003
Relation: audience-003
type: ObjectProperty
type: Thing
relation: audience-003
modified: 2008-01-14
type: Property
comment: A class of entity for whom the resource is intended or useful.
range: Agent Class

Domain
disjoint with: Nothing
subclass of: Thing
type: Class
description: A dimension identifies a separation of concens that serves as a way to categorize an ontology graph. In VAEM, the notion of "Dimension" is partitioned into "Aspect", "Discipline", "Domain" and "Viewpoint".

owner
sub property of: topDataProperty
property disjoint with: previous published version
property disjoint with: url
property disjoint with: namespace
property disjoint with: RDF/XML file URL
property disjoint with: bottomDataProperty
property disjoint with: latest published version
property disjoint with: specificity
property disjoint with: turtle file URL
type: DatatypeProperty
range: string

Rights Holder
date: 2004-06-14
relation: rightsHolder-002
issued: 2004-06-14
type: Thing
type: ObjectProperty
property disjoint with: bottomObjectProperty
sub property of: topObjectProperty
Relation: rightsHolder-002
Has Version: rightsHolder-002
modified: 2008-01-14
type: Property
comment: A person or organization owning or managing rights over the resource.
range: Agent

Linguistic System
type: Class
relation: LinguisticSystem-001
Relation: LinguisticSystem-001
Has Version: LinguisticSystem-001
issued: 2008-01-14
subclass of: Thing
disjoint with: Nothing
type: Thing
date: 2008-01-14
description: Examples include written, spoken, sign, and computer languages.
comment: A system of signs, symbols, sounds, gestures, or rules used in communication.

Graph role
disjoint with: Nothing
subclass of: Thing
type: Class
description: GraphRole is used to characterize how a graph of resources participates in an ontology set. For example, a graph can be a schema, vocabulary, dataset, script, or ruleset
subclass of: http://lodlaundromat.org/.well-known/genid/samples/pellet///predicate//35bcc76a9fca5c0a276e1f35afed697d/35bcc76a9fca5c0a276e1f35afed697d#28
subclass of: http://lodlaundromat.org/.well-known/genid/35bcc76a9fca5c0a276e1f35afed697d#28
subclass of: http://lodlaundromat.org/.well-known/genid/samples/pellet///predicate//35bcc76a9fca5c0a276e1f35afed697d/35bcc76a9fca5c0a276e1f35afed697d#29
subclass of: http://lodlaundromat.org/.well-known/genid/35bcc76a9fca5c0a276e1f35afed697d#29

latest published version
property disjoint with: rationale
type: DatatypeProperty
property disjoint with: name
property disjoint with: specificity
property disjoint with: bottomDataProperty
property disjoint with: file prefix
property disjoint with: owner
property disjoint with: namespace prefix
property disjoint with: description
property disjoint with: intent
sub property of: topDataProperty
property disjoint with: title
property disjoint with: revision
description: The property "vaem:latestPublishedVersion"is a URL to documentation for the latest version of a graph.
range: anyURI

License
type: ObjectProperty
sub property of: topObjectProperty
sub property of: rights
issued: 2004-06-14
Relation: license-002
date: 2004-06-14
relation: license-002
property disjoint with: bottomObjectProperty
Has Version: license-002
type: Thing
comment: A legal document giving official permission to do something with the resource.
type: Property
range: License Document
modified: 2008-01-14

Mediator
type: ObjectProperty
Relation: mediator-003
issued: 2001-05-21
relation: mediator-003
sub property of: topObjectProperty
Has Version: mediator-003
property disjoint with: bottomObjectProperty
date: 2001-05-21
type: Thing
sub property of: Audience
type: Property
range: Agent Class
modified: 2008-01-14
comment: An entity that mediates access to the resource and for whom the resource is intended or useful.
description: In an educational context, a mediator might be a parent, teacher, teaching assistant, or care-giver.

Has Version
relation: hasVersion-003
sub property of: topObjectProperty
Has Version: hasVersion-003
sub property of: relation
property disjoint with: bottomObjectProperty
note: This term is intended to be used with non-literal values as defined in the DCMI Abstract Model (http://dublincore.org/documents/abstract-model/). As of December 2007, the DCMI Usage Board is seeking a way to express this intention with a formal range declaration.
issued: 2000-07-11
date: 2000-07-11
type: Thing
type: ObjectProperty
Relation: hasVersion-003
sub property of: Relation
comment: A related resource that is a version, edition, or adaptation of the described resource.
modified: 2008-01-14
type: Property

NLM
Relation: NLM-002
date: 2005-06-13
relation: NLM-002
issued: 2005-06-13
Has Version: NLM-002
type: VocabularyEncodingScheme
type: Thing
modified: 2008-01-14
comment: The set of conceptual resources specified by the National Library of Medicine Classification.

Documentation graph
different from: View graph
different from: Data graph
file prefix: DOC
different from: Collection graph
different from: Vocabulary graph
different from: Mapping graph
different from: Controllers graph
different from: Script graph
different from: Rules Graph
type: Thing
different from: Constraints graph
type: Graph role
different from: Link Set graph
different from: Schema graph
different from: Functions graph
different from: Curation graph
different from: Transforms graph
different from: Proxy graph

Agent Class
date: 2008-01-14
relation: AgentClass-003
Relation: AgentClass-003
subclass of: Thing
disjoint with: Nothing
Has Version: AgentClass-003
issued: 2008-01-14
type: Class
type: Thing
subclass of: Class
description: Examples of Agent Class include groups seen as classes, such as students, women, charities, lecturers.
modified: 2012-06-14
comment: A group of agents.

Policy
Relation: Policy-001
type: Class
relation: Policy-001
date: 2008-01-14
issued: 2008-01-14
Has Version: Policy-001
type: Thing
disjoint with: Nothing
subclass of: Thing
comment: A plan or course of action by an authority, intended to influence and determine decisions, actions, and other matters.

Date Valid
relation: valid-003
sub property of: topDataProperty
date: 2000-07-11
Relation: valid-003
issued: 2000-07-11
type: DatatypeProperty
sub property of: date
sub property of: Date
property disjoint with: bottomDataProperty
Has Version: valid-003
type: Thing
type: Property
range: Literal
comment: Date (often a range) of validity of a resource.
modified: 2008-01-14

Data graph
different from: Rules Graph
different from: Transforms graph
different from: Controllers graph
different from: View graph
different from: Collection graph
file prefix: DATA
different from: Vocabulary graph
different from: Functions graph
different from: Curation graph
different from: Link Set graph
different from: Constraints graph
different from: Schema graph
different from: Mapping graph
type: Thing
different from: Proxy graph
different from: Script graph
different from: Documentation graph
type: Graph role

Method of Accrual
type: Thing
disjoint with: Nothing
Has Version: MethodOfAccrual-001
relation: MethodOfAccrual-001
issued: 2008-01-14
date: 2008-01-14
Relation: MethodOfAccrual-001
type: Class
subclass of: Thing
comment: A method by which resources are added to a collection.

Provenance Statement
type: Thing
issued: 2008-01-14
Has Version: ProvenanceStatement-001
Relation: ProvenanceStatement-001
type: Class
subclass of: Thing
disjoint with: Nothing
date: 2008-01-14
relation: ProvenanceStatement-001
comment: A statement of any changes in ownership and custody of a resource since its creation that are significant for its authenticity, integrity, and interpretation.

Requires
relation: requires-003
Has Version: requires-003
Relation: requires-003
sub property of: topObjectProperty
issued: 2000-07-11
sub property of: relation
date: 2000-07-11
note: This term is intended to be used with non-literal values as defined in the DCMI Abstract Model (http://dublincore.org/documents/abstract-model/). As of December 2007, the DCMI Usage Board is seeking a way to express this intention with a formal range declaration.
property disjoint with: bottomObjectProperty
type: Thing
sub property of: Relation
type: ObjectProperty
type: Property
comment: A related resource that is required by the described resource to support its function, delivery, or coherence.
modified: 2008-01-14

replaces
Relation: replaces-003
note: This term is intended to be used with non-literal values as defined in the DCMI Abstract Model (http://dublincore.org/documents/abstract-model/). As of December 2007, the DCMI Usage Board is seeking a way to express this intention with a formal range declaration.
date: 2000-07-11
relation: replaces-003
issued: 2000-07-11
Has Version: replaces-003
type: Thing
modified: 2008-01-14
range: Resource
comment: A related resource that is supplanted, displaced, or superseded by the described resource.
sub property of: relation
sub property of: Relation
label: Replaces
type: AnnotationProperty
type: Property

has owner
sub property of: topObjectProperty
property disjoint with: bottomObjectProperty
type: ObjectProperty

MeSH
Relation: MESH-003
date: 2000-07-11
relation: MESH-003
issued: 2000-07-11
Has Version: MESH-003
type: VocabularyEncodingScheme
type: Thing
modified: 2008-01-14
comment: The set of labeled concepts specified by the Medical Subject Headings.

ViewpointDimension
disjoint with: Nothing
subclass of: Domain
subclass of: Thing
type: Class
description: Viewpoint is used to denote how a set of resources, or an individual resource, is relevant to a context of use. The term "viewpoint" is adopted from the ISO RM-ODP specifications and its more recent use in enterprise architecture descriptions. The RM-ODP introducesd the concept of viewpoint to describe a system from a particular set of concerns. RM-ODP defines five viewpoints. Together they provide a complete description of a system: enterprise viewpoint, information viewpoint, computational viewpoint, engineering viewpoint, and technology viewpoint. In VAEM, "Viewpoint" is used as a dimension for characterizing an ontology graph. The viewpoints of an ontology may not always correpsond directly to those of a system but the idea of describing a subject area of interest from distinct viewpoints is still relevant. A viewpoint can be further distinguished by "aspects". For example the "information viewpoint" of an application can be partitioned into separate graphs for the "security", "operational" and"data retention" aspects.

Is Version Of
note: This term is intended to be used with non-literal values as defined in the DCMI Abstract Model (http://dublincore.org/documents/abstract-model/). As of December 2007, the DCMI Usage Board is seeking a way to express this intention with a formal range declaration.
type: ObjectProperty
Has Version: isVersionOf-003
sub property of: Relation
sub property of: relation
date: 2000-07-11
sub property of: topObjectProperty
type: Thing
issued: 2000-07-11
Relation: isVersionOf-003
relation: isVersionOf-003
property disjoint with: bottomObjectProperty
type: Property
comment: A related resource of which the described resource is a version, edition, or adaptation.
description: Changes in version imply substantive changes in content rather than differences in format.
modified: 2008-01-14

Audience Education Level
type: Thing
relation: educationLevel-002
issued: 2002-07-13
Has Version: educationLevel-002
sub property of: Audience
date: 2002-07-13
sub property of: topObjectProperty
type: ObjectProperty
property disjoint with: bottomObjectProperty
Relation: educationLevel-002
modified: 2008-01-14
type: Property
comment: A class of entity, defined in terms of progression through an educational or training context, for which the described resource is intended.
range: Agent Class

DCMI Point
Relation: Point-003
date: 2000-07-11
relation: Point-003
issued: 2000-07-11
Has Version: Point-003
type: Thing
modified: 2008-01-14
type: Datatype
comment: The set of points in space defined by their geographic coordinates according to the DCMI Point Encoding Scheme.

Coverage
type: Thing
relation: coverageT-001
type: ObjectProperty
date: 2008-01-14
Has Version: coverageT-001
Relation: coverageT-001
sub property of: coverage
property disjoint with: bottomObjectProperty
sub property of: topObjectProperty
issued: 2008-01-14
comment: The spatial or temporal topic of the resource, the spatial applicability of the resource, or the jurisdiction under which the resource is relevant.
modified: 2008-01-14
type: Property
range: Location, Period, or Jurisdiction
description: Spatial topic and spatial applicability may be a named place or a location specified by its geographic coordinates. Temporal topic may be a named period, date, or date range. A jurisdiction may be a named administrative entity or a geographic place to which the resource applies. Recommended best practice is to use a controlled vocabulary such as the Thesaurus of Geographic Names [TGN]. Where appropriate, named places or time periods can be used in preference to numeric identifiers such as sets of coordinates or date ranges.

Period of Time
subclass of: Thing
type: Thing
issued: 2008-01-14
date: 2008-01-14
type: Class
subclass of: Location, Period, or Jurisdiction
Has Version: PeriodOfTime-001
relation: PeriodOfTime-001
disjoint with: Nothing
Relation: PeriodOfTime-001
comment: An interval of time that is named or defined by its start and end dates.

Standard
Relation: Standard-001
date: 2008-01-14
subclass of: Thing
disjoint with: Nothing
Has Version: Standard-001
relation: Standard-001
type: Class
issued: 2008-01-14
type: Thing
comment: A basis for comparison; a reference point against which other things can be evaluated.

Schema graph
different from: Functions graph
different from: Vocabulary graph
different from: View graph
different from: Collection graph
different from: Curation graph
different from: Transforms graph
type: Thing
different from: Controllers graph
file prefix: SCHEMA
different from: Rules Graph
different from: Script graph
different from: Mapping graph
different from: Data graph
different from: Constraints graph
different from: Documentation graph
different from: Proxy graph
different from: Link Set graph
type: Graph role

created
Relation: created-003
date: 2000-07-11
relation: created-003
issued: 2000-07-11
Has Version: created-003
type: Thing
sub property of: date
range: Literal
modified: 2008-01-14
comment: Date of creation of the resource.
type: AnnotationProperty
type: Property
range: date
label: Date Created
sub property of: Date

Identifier
sub property of: identifier
type: DatatypeProperty
relation: identifierT-001
sub property of: topDataProperty
date: 2008-01-14
Has Version: identifierT-001
issued: 2008-01-14
property disjoint with: bottomDataProperty
Relation: identifierT-001
type: Thing
range: Literal
description: Recommended best practice is to identify the resource by means of a string conforming to a formal identification system.
type: Property
comment: An unambiguous reference to the resource within a given context.
modified: 2008-01-14

Domain Dimension
disjoint with: Nothing
subclass of: Domain
subclass of: Thing
type: Class
description: A domain is a subject area of interest. Examples of domains are "enterprise", "process", "organization" and "system". In VAEM, "Domain" is used as a dimension for characterizing an ontology graph

id
sub property of: topDataProperty
property disjoint with: bottomDataProperty
type: DatatypeProperty
description: The property "vaem:id" is intended for general use as a means to specifiy an identifier. The type of this property is intentionally set to "rdf:Property" so that use of the property can allow both object and scaler values. For this reason, the property is rangeless

Provenance
Has Version: provenance-002
Relation: provenance-002
issued: 2004-09-20
type: Thing
sub property of: topObjectProperty
relation: provenance-002
date: 2004-09-20
type: ObjectProperty
property disjoint with: bottomObjectProperty
description: The statement may include a description of any changes successive custodians made to the resource.
modified: 2008-01-14
type: Property
comment: A statement of any changes in ownership and custody of the resource since its creation that are significant for its authenticity, integrity, and interpretation.
range: Provenance Statement

DCMI Metadata Terms - other
publisher: DCMI
type: Thing
modified: 2012-06-14

revision
property disjoint with: url
property disjoint with: turtle file URL
property disjoint with: latest published version
property disjoint with: bottomDataProperty
property disjoint with: specificity
sub property of: topDataProperty
property disjoint with: previous published version
property disjoint with: namespace
type: DatatypeProperty
property disjoint with: RDF/XML file URL
description: The property "vaem:revision" is a property intended for general use as the name implies.
range: string

has dimension
sub property of: topObjectProperty
property disjoint with: bottomObjectProperty
type: ObjectProperty
description: The property "vaem:hasDimension" is used categorize an ontology. In VAEM, the property is used to characterize an ontology graph.

specificity
property disjoint with: name
type: DatatypeProperty
property disjoint with: latest published version
property disjoint with: namespace
property disjoint with: RDF/XML file URL
sub property of: topDataProperty
property disjoint with: turtle file URL
property disjoint with: owner
property disjoint with: rationale
property disjoint with: description
property disjoint with: file prefix
property disjoint with: title
property disjoint with: revision
property disjoint with: previous published version
property disjoint with: intent
property disjoint with: namespace prefix
property disjoint with: bottomDataProperty
property disjoint with: url
description: The property "vaem:specificity" is intended to specify the level of detail of an ontology. The values that can be set for this property are restriced to an integer from 1 to 5. An ontology at level 1 has concepts of more general applicability than one at level 5. By having graphs at different levels of specificity it is possible to support greater modularity for selective imports
range: nonNegativeInteger

has graph role
sub property of: topObjectProperty
property disjoint with: bottomObjectProperty
type: ObjectProperty
description: The property "lms:hasGraphRole" is used to characterize how a resource participates in an ontology set. The property is used to specify the role that a graph plays, for example, an ontology graph can be a schema, vocabulary, dataset, script, or ruleset
range: Graph role

Location
Relation: Location-001
date: 2008-01-14
type: Class
subclass of: Location, Period, or Jurisdiction
relation: Location-001
type: Thing
issued: 2008-01-14
Has Version: Location-001
subclass of: Thing
disjoint with: Nothing
comment: A spatial region or named place.

Bibliographic Resource
Relation: BibliographicResource-001
date: 2008-01-14
subclass of: Thing
relation: BibliographicResource-001
issued: 2008-01-14
type: Class
Has Version: BibliographicResource-001
type: Thing
disjoint with: Nothing
comment: A book, article, or other documentary resource.

description
property disjoint with: specificity
property disjoint with: namespace
property disjoint with: latest published version
property disjoint with: bottomDataProperty
property disjoint with: RDF/XML file URL
property disjoint with: previous published version
property disjoint with: turtle file URL
sub property of: topDataProperty
type: DatatypeProperty
property disjoint with: url
range: string

Format
relation: formatT-001
Has Version: formatT-001
date: 2008-01-14
sub property of: topObjectProperty
issued: 2008-01-14
sub property of: format
type: ObjectProperty
property disjoint with: bottomObjectProperty
type: Thing
Relation: formatT-001
type: Property
description: Examples of dimensions include size and duration. Recommended best practice is to use a controlled vocabulary such as the list of Internet Media Types [MIME].
modified: 2008-01-14
comment: The file format, physical medium, or dimensions of the resource.
range: Media Type or Extent

name
sub property of: topDataProperty
property disjoint with: previous published version
property disjoint with: bottomDataProperty
type: DatatypeProperty
property disjoint with: specificity
property disjoint with: RDF/XML file URL
property disjoint with: turtle file URL
property disjoint with: latest published version
property disjoint with: namespace
property disjoint with: url
description: The property "vaem:name" is intended for general use. In many cases "rdfs:label" could be used give names to resources. In the case where compliance with a specific naming rule is needed, "vaem:name" allows a resource to carry a name that is used in more specific contexts.
range: string

ISO 639-2
Relation: ISO639-2-003
date: 2000-07-11
relation: ISO639-2-003
issued: 2000-07-11
Has Version: ISO639-2-003
type: Thing
modified: 2008-01-14
type: Datatype
comment: The three-letter alphabetic codes listed in ISO639-2 for the representation of names of languages.

Spatial Coverage
type: ObjectProperty
relation: spatial-003
date: 2000-07-11
Relation: spatial-003
issued: 2000-07-11
property disjoint with: bottomObjectProperty
Has Version: spatial-003
sub property of: topObjectProperty
sub property of: Coverage
sub property of: coverage
type: Thing
type: Property
range: Location
comment: Spatial characteristics of the resource.
modified: 2008-01-14

Mapping graph
different from: Vocabulary graph
different from: Link Set graph
different from: Script graph
different from: Constraints graph
different from: Transforms graph
different from: Data graph
different from: View graph
different from: Controllers graph
type: Thing
different from: Collection graph
different from: Curation graph
different from: Functions graph
different from: Documentation graph
different from: Rules Graph
different from: Proxy graph
file prefix: MAPPINGS
different from: Schema graph
type: Graph role
description: A graph that specifies a transformation of a graph into another graph or graphs. Invariably this is a SPINMap graph using SPARQL Rules (SPIN) to express the transforms.

Physical Medium
relation: PhysicalMedium-001
type: Class
date: 2008-01-14
subclass of: Media Type or Extent
subclass of: Media Type
issued: 2008-01-14
subclass of: Thing
type: Thing
disjoint with: Nothing
Relation: PhysicalMedium-001
Has Version: PhysicalMedium-001
description: Examples include paper, canvas, or DVD.
comment: A physical material or carrier.

Is Format Of
date: 2000-07-11
relation: isFormatOf-003
Has Version: isFormatOf-003
property disjoint with: bottomObjectProperty
issued: 2000-07-11
sub property of: relation
note: This term is intended to be used with non-literal values as defined in the DCMI Abstract Model (http://dublincore.org/documents/abstract-model/). As of December 2007, the DCMI Usage Board is seeking a way to express this intention with a formal range declaration.
type: Thing
type: ObjectProperty
sub property of: topObjectProperty
sub property of: Relation
Relation: isFormatOf-003
modified: 2008-01-14
type: Property
comment: A related resource that is substantially the same as the described resource, but in another format.

Alternative Title
property disjoint with: bottomDataProperty
Relation: alternative-003
date: 2000-07-11
sub property of: title
type: Thing
issued: 2000-07-11
sub property of: topDataProperty
Has Version: alternative-003
relation: alternative-003
type: DatatypeProperty
type: Property
modified: 2010-10-11
range: Literal
description: The distinction between titles and alternative titles is application-specific.
comment: An alternative name for the resource.

Language
sub property of: topObjectProperty
Relation: languageT-001
Has Version: languageT-001
date: 2008-01-14
relation: languageT-001
type: ObjectProperty
sub property of: language
type: Thing
issued: 2008-01-14
property disjoint with: bottomObjectProperty
modified: 2008-01-14
type: Property
description: Recommended best practice is to use a controlled vocabulary such as RFC 4646 [RFC4646].
comment: A language of the resource.
range: Linguistic System

Proxy graph
different from: Mapping graph
different from: Curation graph
different from: Functions graph
different from: Script graph
different from: Data graph
different from: Transforms graph
different from: Collection graph
different from: Documentation graph
different from: Schema graph
type: Graph role
file prefix: PROXY
different from: View graph
different from: Vocabulary graph
different from: Link Set graph
different from: Controllers graph
different from: Rules Graph
type: Thing
different from: Constraints graph

Media Type or Extent
Has Version: MediaTypeOrExtent-001
issued: 2008-01-14
Relation: MediaTypeOrExtent-001
subclass of: Thing
date: 2008-01-14
relation: MediaTypeOrExtent-001
type: Thing
type: Class
disjoint with: Nothing
comment: A media type or extent.

Source
note: This term is intended to be used with non-literal values as defined in the DCMI Abstract Model (http://dublincore.org/documents/abstract-model/). As of December 2007, the DCMI Usage Board is seeking a way to express this intention with a formal range declaration.
relation: sourceT-001
property disjoint with: bottomObjectProperty
date: 2008-01-14
sub property of: source
sub property of: Relation
issued: 2008-01-14
sub property of: topObjectProperty
sub property of: relation
type: ObjectProperty
Relation: sourceT-001
type: Thing
Has Version: sourceT-001
description: The described resource may be derived from the related resource in whole or in part. Recommended best practice is to identify the related resource by means of a string conforming to a formal identification system.
comment: A related resource from which the described resource is derived.
type: Property
modified: 2008-01-14

Date
type: DatatypeProperty
issued: 2008-01-14
Relation: dateT-001
sub property of: topDataProperty
Has Version: dateT-001
date: 2008-01-14
property disjoint with: bottomDataProperty
type: Thing
sub property of: date
relation: dateT-001
comment: A point or period of time associated with an event in the lifecycle of the resource.
description: Date may be used to express temporal information at any level of granularity. Recommended best practice is to use an encoding scheme, such as the W3CDTF profile of ISO 8601 [W3CDTF].
modified: 2008-01-14
type: Property
range: Literal

VAEM Schema Version 2.0 Metadata
title: Vocabulary for Attaching Essential Metadata (VAEM) - Version 2.0
owner: TopQuadrant, Inc.
description: VAEM stands for "Vocabulary for Attaching Essential Metadata". What VAEM regards as essential metadata is data about dates and times, confidentiality, and other characterisitic qualifiers of the ontology, but also references to where a ontology is documented and where to find ontology registration for governance, attribution and provenance. VAEM makes use of some properties from the DC terms vocabulary using the namespace prefix "dct". VAEM is OWL-DL compliant.
different from: TopQuadrant
latest published version: http://www.linkedmodel.org/doc/2014/SCHEMA_vaem-v2.0
has graph role: Schema graph
has steward: TopQuadrant
intent: The purpose of VAEM is to provide, by import, a foundation for commonly needed resources for metadata on an ontology.
has owner: TopQuadrant
revision: 2.0
turtle file URL: http://www.linkedmodel.org/2.0/schema/SCHEMA_vaem-v2.0.ttl
type: Graph Metadata
type: Thing
previous published version: http://linkedmodel.org/doc/vaem/1.2/
namespace prefix: vaem
RDF/XML file URL: http://www.linkedmodel.org/2.0/schema/SCHEMA_vaem-v2.0.rdf
namespace: http://www.linkedmodel.org/schema/vaem#
name: VAEM
uses non-imported resource: modified
created: 2011-04-20
uses non-imported resource: abstract
uses non-imported resource: created
uses non-imported resource: CC-SHAREALIKE 3PT0-US
with attribution to: VAEM is issued under a Creative Commons Attribution Share Alike 3.0 United States License. Attribution should be made to TopQuadrant, Inc.
uses non-imported resource: title
uses non-imported resource: author
title: VAEM Version 2.0 Metadata
modified: 2014-07-26
abstract: VAEM stands for "Vocabulary for Attaching Essential Metadata". What VAEM regards as essential metadata is data about dates and times, confidentiality, and other characterisitic qualifiers of the ontology, but also references to where a ontology is documented and where to find ontology registration for governance, attribution and provenance. VAEM makes use of some properties from the DC terms vocabulary using the namespace prefix "dct". VAEM is OWL-DL compliant.

Temporal Coverage
sub property of: Coverage
Has Version: temporal-003
date: 2000-07-11
property disjoint with: bottomObjectProperty
issued: 2000-07-11
sub property of: topObjectProperty
relation: temporal-003
type: Thing
sub property of: coverage
Relation: temporal-003
type: ObjectProperty
type: Property
modified: 2008-01-14
range: Period of Time
comment: Temporal characteristics of the resource.

abstract
Relation: abstract-003
date: 2000-07-11
relation: abstract-003
issued: 2000-07-11
Has Version: abstract-003
type: Thing
sub property of: description
type: AnnotationProperty
type: Property
comment: A summary of the resource.
label: Abstract
range: string
modified: 2008-01-14

Is Part Of
issued: 2000-07-11
date: 2000-07-11
sub property of: relation
sub property of: topObjectProperty
sub property of: Relation
type: ObjectProperty
note: This term is intended to be used with non-literal values as defined in the DCMI Abstract Model (http://dublincore.org/documents/abstract-model/). As of December 2007, the DCMI Usage Board is seeking a way to express this intention with a formal range declaration.
type: Thing
Has Version: isPartOf-003
Relation: isPartOf-003
property disjoint with: bottomObjectProperty
relation: isPartOf-003
type: Property
modified: 2008-01-14
comment: A related resource in which the described resource is physically or logically included.

RFC 5646
Relation: RFC5646-001
date: 2010-10-11
relation: RFC5646-001
issued: 2010-10-11
Has Version: RFC5646-001
type: Thing
description: RFC 5646 obsoletes RFC 4646.
type: Datatype
comment: The set of tags constructed according to RFC 5646 for the identification of languages.

View graph
different from: Collection graph
different from: Link Set graph
different from: Data graph
different from: Curation graph
different from: Constraints graph
different from: Functions graph
different from: Vocabulary graph
different from: Mapping graph
type: Thing
different from: Rules Graph
different from: Proxy graph
different from: Schema graph
different from: Script graph
type: Graph role
different from: Controllers graph
different from: Documentation graph
different from: Transforms graph
file prefix: VIEWS

has steward
sub property of: topObjectProperty
property disjoint with: bottomObjectProperty
type: ObjectProperty
description: A property that is used to refer to a "Steward", that is, the party or role that is responsible for maintaining an asset, in the case of VAEM, an ontology graph.

RFC 1766
Relation: RFC1766-003
date: 2000-07-11
relation: RFC1766-003
issued: 2000-07-11
Has Version: RFC1766-003
type: Thing
modified: 2008-01-14
type: Datatype
comment: The set of tags, constructed according to RFC 1766, for the identification of languages.

Jurisdiction
Relation: Jurisdiction-001
date: 2008-01-14
subclass of: Location, Period, or Jurisdiction
issued: 2008-01-14
Has Version: Jurisdiction-001
subclass of: Thing
type: Class
relation: Jurisdiction-001
type: Thing
disjoint with: Nothing
comment: The extent or range of judicial, law enforcement, or other authority.

License Document
issued: 2008-01-14
Relation: LicenseDocument-001
subclass of: Rights Statement
relation: LicenseDocument-001
disjoint with: Nothing
type: Thing
type: Class
subclass of: Thing
date: 2008-01-14
Has Version: LicenseDocument-001
comment: A legal document giving official permission to do something with a Resource.

Date Submitted
date: 2002-07-13
property disjoint with: bottomDataProperty
sub property of: date
type: Thing
relation: dateSubmitted-002
sub property of: Date
issued: 2002-07-13
type: DatatypeProperty
sub property of: topDataProperty
Has Version: dateSubmitted-002
Relation: dateSubmitted-002
type: Property
range: Literal
comment: Date of submission of the resource.
modified: 2008-01-14
description: Examples of resources to which a Date Submitted may be relevant are a thesis (submitted to a university department) or an article (submitted to a journal).

LCSH
Relation: LCSH-003
date: 2000-07-11
relation: LCSH-003
issued: 2000-07-11
Has Version: LCSH-003
type: VocabularyEncodingScheme
type: Thing
modified: 2008-01-14
comment: The set of labeled concepts specified by the Library of Congress Subject Headings.

IMT
Relation: IMT-004
date: 2000-07-11
relation: IMT-004
issued: 2000-07-11
Has Version: IMT-004
type: VocabularyEncodingScheme
type: Thing
modified: 2008-01-14
comment: The set of media types specified by the Internet Assigned Numbers Authority.

Relation
note: This term is intended to be used with non-literal values as defined in the DCMI Abstract Model (http://dublincore.org/documents/abstract-model/). As of December 2007, the DCMI Usage Board is seeking a way to express this intention with a formal range declaration.
relation: relationT-001
date: 2008-01-14
type: Thing
type: ObjectProperty
Has Version: relationT-001
sub property of: relation
property disjoint with: bottomObjectProperty
issued: 2008-01-14
sub property of: topObjectProperty
Relation: relationT-001
comment: A related resource.
description: Recommended best practice is to identify the related resource by means of a string conforming to a formal identification system.
type: Property
modified: 2008-01-14

title
Relation: titleT-002
date: 2008-01-14
relation: titleT-002
issued: 2008-01-14
Has Version: titleT-002
type: Thing
type: Property
comment: A name given to the resource.
modified: 2010-10-11
sub property of: title
range: Literal
label: Title
type: AnnotationProperty
range: string

Agent
type: Thing
date: 2008-01-14
Has Version: Agent-001
type: Agent Class
subclass of: Thing
issued: 2008-01-14
Relation: Agent-001
relation: Agent-001
type: Class
disjoint with: Nothing
description: Examples of Agent include person, organization, and software agent.
comment: A resource that acts or has the power to act.

DCMI Box
Relation: Box-003
date: 2000-07-11
relation: Box-003
issued: 2000-07-11
Has Version: Box-003
type: Thing
modified: 2008-01-14
type: Datatype
comment: The set of regions in space defined by their geographic coordinates according to the DCMI Box Encoding Scheme.

Controllers graph
different from: Vocabulary graph
different from: Functions graph
different from: Transforms graph
different from: Documentation graph
different from: Schema graph
different from: Constraints graph
different from: Link Set graph
different from: View graph
different from: Rules Graph
different from: Mapping graph
type: Thing
different from: Proxy graph
different from: Curation graph
different from: Collection graph
type: Graph role
file prefix: CONTROLLERS
different from: Data graph
different from: Script graph

File Format
type: Thing
type: Class
date: 2008-01-14
relation: FileFormat-001
subclass of: Media Type
issued: 2008-01-14
Has Version: FileFormat-001
disjoint with: Nothing
subclass of: Media Type or Extent
subclass of: Thing
Relation: FileFormat-001
description: Examples include the formats defined by the list of Internet Media Types.
comment: A digital resource format.

abbreviation
sub property of: topDataProperty
property disjoint with: bottomDataProperty
type: DatatypeProperty
description: The property "vaem:abbreviation" provides a common way to define a commonly used abbreviation on a resource

release date
sub property of: date
sub property of: topDataProperty
property disjoint with: bottomDataProperty
type: DatatypeProperty
description: The property "vaem:releaseDate" is intended for general use as the name implies. The range of the property is set as "vaem:dateUnion" so as to allow a value to have a number of forms from a year only to a full timestamp

has aspect
sub property of: topObjectProperty
sub property of: has dimension
property disjoint with: bottomObjectProperty
type: ObjectProperty
description: The property "vaem:hasAspect" is used to distinguish among sets of features of a domain or subject area. The term is borrowed from "aspect-oriented" programming, where it is used to separate concerns. An ontology may be characterized by this dimension so as to parition features that are orthogonal. For example, in a systems ontology we can distinguish aspects for "structure", "function", "behavior" and "interface". The property is an "rdf:Property" to allow both scalar and object values

Medium
Relation: medium-003
relation: medium-003
date: 2000-07-11
issued: 2000-07-11
type: ObjectProperty
property disjoint with: bottomObjectProperty
sub property of: topObjectProperty
Has Version: medium-003
sub property of: Format
type: Thing
sub property of: format
range: Physical Medium
comment: The material or physical carrier of the resource.
domain: Physical Resource
type: Property
modified: 2008-01-14

subject
Relation: subjectT-002
note: This term is intended to be used with non-literal values as defined in the DCMI Abstract Model (http://dublincore.org/documents/abstract-model/). As of December 2007, the DCMI Usage Board is seeking a way to express this intention with a formal range declaration.
date: 2008-01-14
relation: subjectT-002
issued: 2008-01-14
Has Version: subjectT-002
type: Thing
modified: 2012-06-14
description: Typically, the subject will be represented using keywords, key phrases, or classification codes. Recommended best practice is to use a controlled vocabulary.
range: string
sub property of: subject
type: AnnotationProperty
type: Property
comment: The topic of the resource.
label: Subject

Type
property disjoint with: bottomObjectProperty
sub property of: topObjectProperty
date: 2008-01-14
Has Version: typeT-001
sub property of: type
type: Thing
Relation: typeT-001
relation: typeT-001
type: ObjectProperty
issued: 2008-01-14
description: Recommended best practice is to use a controlled vocabulary such as the DCMI Type Vocabulary [DCMITYPE]. To describe the file format, physical medium, or dimensions of the resource, use the Format element.
modified: 2008-01-14
range: Class
type: Property
comment: The nature or genre of the resource.

Size or Duration
subclass of: Thing
disjoint with: Nothing
type: Thing
relation: SizeOrDuration-001
date: 2008-01-14
type: Class
subclass of: Media Type or Extent
Has Version: SizeOrDuration-001
issued: 2008-01-14
Relation: SizeOrDuration-001
description: Examples include a number of pages, a specification of length, width, and breadth, or a period in hours, minutes, and seconds.
comment: A dimension or extent, or a time taken to play or execute.

rationale
sub property of: topDataProperty
property disjoint with: namespace
property disjoint with: url
property disjoint with: bottomDataProperty
property disjoint with: specificity
property disjoint with: RDF/XML file URL
property disjoint with: turtle file URL
property disjoint with: latest published version
property disjoint with: previous published version
type: DatatypeProperty
description: A description of a justification for some other assertion or value
range: string

Transforms graph
type: Graph role
file prefix: TRANSFORMS
different from: Vocabulary graph
different from: Controllers graph
different from: Curation graph
different from: Proxy graph
different from: Data graph
different from: Rules Graph
different from: Schema graph
different from: Link Set graph
different from: Script graph
different from: Collection graph
different from: Mapping graph
different from: View graph
different from: Documentation graph
type: Thing
different from: Constraints graph
different from: Functions graph

Functions graph
different from: Script graph
different from: Collection graph
file prefix: FUNCTIONS
different from: Proxy graph
different from: Mapping graph
different from: Transforms graph
different from: Curation graph
different from: Documentation graph
different from: Constraints graph
type: Thing
type: Graph role
different from: Controllers graph
different from: Link Set graph
different from: Vocabulary graph
different from: Schema graph
different from: Rules Graph
different from: View graph
different from: Data graph

has identifier
sub property of: topObjectProperty
property disjoint with: bottomObjectProperty
type: ObjectProperty
description: The property "vaemhasIdentifier" is intended for general use as a means to specifiy a unique reference to something. This is an object property that is a sub-property of "vame:id"

modified
Relation: modified-003
date: 2000-07-11
relation: modified-003
issued: 2000-07-11
Has Version: modified-003
type: Thing
range: date
modified: 2008-01-14
sub property of: Date
type: Property
range: Literal
type: AnnotationProperty
label: Date Modified
sub property of: date
comment: Date on which the resource was changed.

URI
Relation: URI-003
date: 2000-07-11
relation: URI-003
issued: 2000-07-11
Has Version: URI-003
type: Thing
modified: 2008-01-14
type: Datatype
comment: The set of identifiers constructed according to the generic syntax for Uniform Resource Identifiers as specified by the Internet Engineering Task Force.

TGN
Relation: TGN-003
date: 2000-07-11
relation: TGN-003
issued: 2000-07-11
Has Version: TGN-003
type: VocabularyEncodingScheme
type: Thing
modified: 2008-01-14
comment: The set of places specified by the Getty Thesaurus of Geographic Names.

Conforms To
date: 2001-05-21
issued: 2001-05-21
type: ObjectProperty
property disjoint with: bottomObjectProperty
sub property of: relation
Has Version: conformsTo-003
relation: conformsTo-003
sub property of: topObjectProperty
sub property of: Relation
type: Thing
Relation: conformsTo-003
modified: 2008-01-14
range: Standard
comment: An established standard to which the described resource conforms.
type: Property

rights
Relation: rightsT-001
date: 2008-01-14
relation: rightsT-001
issued: 2008-01-14
Has Version: rightsT-001
type: Thing
label: Rights
range: Rights Statement
range: string
description: Typically, rights information includes a statement about various property rights associated with the resource, including intellectual property rights.
comment: Information about rights held in and over the resource.
type: AnnotationProperty
modified: 2008-01-14
type: Property
sub property of: rights

RFC 3066
Relation: RFC3066-002
date: 2002-07-13
relation: RFC3066-002
issued: 2002-07-13
Has Version: RFC3066-002
type: Thing
description: RFC 3066 has been obsoleted by RFC 4646.
modified: 2008-01-14
type: Datatype
comment: The set of tags constructed according to RFC 3066 for the identification of languages.

title
type: DatatypeProperty
property disjoint with: previous published version
property disjoint with: namespace
property disjoint with: bottomDataProperty
property disjoint with: specificity
property disjoint with: turtle file URL
sub property of: topDataProperty
property disjoint with: url
property disjoint with: RDF/XML file URL
property disjoint with: latest published version
range: string

creator
Relation: creatorT-002
date: 2008-01-14
relation: creatorT-002
issued: 2008-01-14
Has Version: creatorT-002
type: Thing
modified: 2010-10-11
comment: An entity primarily responsible for making the resource.
range: string
equivalent property: maker
sub property of: contributor
sub property of: creator
type: Property
label: Creator
type: AnnotationProperty
description: Examples of a Creator include a person, an organization, or a service.
range: Agent

Discipline Dimension
disjoint with: Nothing
subclass of: Domain
subclass of: Thing
type: Class
description: A discipline is a specific area of work or study. Examples of disciplines in the engineering domain are electrical engineering, mechanical engineering and, in the financial domain, risk assessment, investment analysis. In VAEM, discipline is used as a dimension for characterizing an ontology graph

Accrual Policy
relation: accrualPolicy-003
Has Version: accrualPolicy-003
type: ObjectProperty
date: 2005-06-13
issued: 2005-06-13
type: Thing
property disjoint with: bottomObjectProperty
sub property of: topObjectProperty
Relation: accrualPolicy-003
modified: 2010-10-11
type: Property
comment: The policy governing the addition of items to a collection.
domain: Collection
range: Policy

DCMI Period
Relation: Period-003
date: 2000-07-11
relation: Period-003
issued: 2000-07-11
Has Version: Period-003
type: Thing
modified: 2008-01-14
type: Datatype
comment: The set of time intervals defined by their limits according to the DCMI Period Encoding Scheme.

DDC
Relation: DDC-003
date: 2000-07-11
relation: DDC-003
issued: 2000-07-11
Has Version: DDC-003
type: VocabularyEncodingScheme
type: Thing
modified: 2008-01-14
comment: The set of conceptual resources specified by the Dewey Decimal Classification.

Has Part
property disjoint with: bottomObjectProperty
relation: hasPart-003
Relation: hasPart-003
type: ObjectProperty
date: 2000-07-11
type: Thing
issued: 2000-07-11
note: This term is intended to be used with non-literal values as defined in the DCMI Abstract Model (http://dublincore.org/documents/abstract-model/). As of December 2007, the DCMI Usage Board is seeking a way to express this intention with a formal range declaration.
sub property of: relation
Has Version: hasPart-003
sub property of: topObjectProperty
sub property of: Relation
type: Property
modified: 2008-01-14
comment: A related resource that is included either physically or logically in the described resource.

Party
disjoint with: Nothing
subclass of: Thing
type: Class
subclass of: http://lodlaundromat.org/.well-known/genid/samples/pellet///predicate//35bcc76a9fca5c0a276e1f35afed697d/35bcc76a9fca5c0a276e1f35afed697d#26
subclass of: http://lodlaundromat.org/.well-known/genid/35bcc76a9fca5c0a276e1f35afed697d#27
subclass of: http://lodlaundromat.org/.well-known/genid/samples/pellet///predicate//35bcc76a9fca5c0a276e1f35afed697d/35bcc76a9fca5c0a276e1f35afed697d#27
description: A "Party" is a generalization for an actor that may be realized as a person, organizaiton or named role.
subclass of: http://lodlaundromat.org/.well-known/genid/35bcc76a9fca5c0a276e1f35afed697d#25
subclass of: http://lodlaundromat.org/.well-known/genid/samples/pellet///predicate//35bcc76a9fca5c0a276e1f35afed697d/35bcc76a9fca5c0a276e1f35afed697d#25
subclass of: http://lodlaundromat.org/.well-known/genid/35bcc76a9fca5c0a276e1f35afed697d#26

RDF/XML file URL
property disjoint with: bottomDataProperty
property disjoint with: title
property disjoint with: name
property disjoint with: revision
property disjoint with: intent
property disjoint with: rationale
type: DatatypeProperty
property disjoint with: file prefix
property disjoint with: description
property disjoint with: namespace prefix
sub property of: topDataProperty
property disjoint with: specificity
property disjoint with: owner
description: The property "vaem:rdfxmlFileURL" is used to provide a link to the location of the ontology's RDF/XML file
range: anyURI

has discipline
sub property of: topObjectProperty
sub property of: has dimension
property disjoint with: bottomObjectProperty
type: ObjectProperty
description: The property "vaem:hasDiscipline" is used to indicate relevance of a set of resources, or a resource itself, to a specific discipline of work or study. Examples of disciplines in the engineering domain are electrical engineering, mechanical engineering and, in the financial domain, risk assessment, investment analysis. In VAEM, the property is used as a dimension for characterizing an ontology graph. The property is an "rdf:Property" to allow both scalar and object values

Accrual Periodicity
sub property of: topObjectProperty
issued: 2005-06-13
date: 2005-06-13
type: Thing
Relation: accrualPeriodicity-003
property disjoint with: bottomObjectProperty
Has Version: accrualPeriodicity-003
type: ObjectProperty
relation: accrualPeriodicity-003
modified: 2010-10-11
type: Property
comment: The frequency with which items are added to a collection.
domain: Collection
range: Frequency

ISO 639-3
Relation: ISO639-3-001
date: 2008-01-14
relation: ISO639-3-001
issued: 2008-01-14
Has Version: ISO639-3-001
type: Thing
type: Datatype
comment: The set of three-letter codes listed in ISO 639-3 for the representation of names of languages.

Is Required By
date: 2000-07-11
property disjoint with: bottomObjectProperty
Relation: isRequiredBy-003
relation: isRequiredBy-003
sub property of: relation
note: This term is intended to be used with non-literal values as defined in the DCMI Abstract Model (http://dublincore.org/documents/abstract-model/). As of December 2007, the DCMI Usage Board is seeking a way to express this intention with a formal range declaration.
Has Version: isRequiredBy-003
sub property of: topObjectProperty
type: ObjectProperty
issued: 2000-07-11
sub property of: Relation
type: Thing
comment: A related resource that requires the described resource to support its function, delivery, or coherence.
type: Property
modified: 2008-01-14

Vocabulary graph
different from: Script graph
different from: Controllers graph
type: Thing
different from: Mapping graph
different from: Proxy graph
file prefix: VOCAB
different from: Transforms graph
different from: View graph
different from: Constraints graph
different from: Link Set graph
different from: Collection graph
different from: Rules Graph
different from: Documentation graph
different from: Functions graph
type: Graph role
different from: Data graph
different from: Curation graph
different from: Schema graph
description: An RDF/OWL Graph that is a controlled set of instances.

description
Relation: descriptionT-001
date: 2008-01-14
relation: descriptionT-001
issued: 2008-01-14
Has Version: descriptionT-001
type: Thing
type: AnnotationProperty
range: string
comment: An account of the resource.
description: Description may include but is not limited to: an abstract, a table of contents, a graphical representation, or a free-text account of the resource.
modified: 2008-01-14
sub property of: description
type: Property
label: Description

Has Format
sub property of: topObjectProperty
relation: hasFormat-003
type: ObjectProperty
issued: 2000-07-11
Relation: hasFormat-003
date: 2000-07-11
type: Thing
property disjoint with: bottomObjectProperty
Has Version: hasFormat-003
sub property of: Relation
note: This term is intended to be used with non-literal values as defined in the DCMI Abstract Model (http://dublincore.org/documents/abstract-model/). As of December 2007, the DCMI Usage Board is seeking a way to express this intention with a formal range declaration.
sub property of: relation
modified: 2008-01-14
type: Property
comment: A related resource that is substantially the same as the pre-existing described resource, but in another format.

Date Available
Relation: available-003
type: Thing
property disjoint with: bottomDataProperty
date: 2000-07-11
issued: 2000-07-11
Has Version: available-003
sub property of: date
relation: available-003
type: DatatypeProperty
sub property of: topDataProperty
sub property of: Date
comment: Date (often a range) that the resource became or will become available.
modified: 2008-01-14
type: Property
range: Literal

reifiable by
sub property of: topObjectProperty
property disjoint with: bottomObjectProperty
type: ObjectProperty
description: To express how statements in a model can be reifiable, this property is used to explicitly associate a property with a user-defined sub-class of "rdf:Statement". A recommended way of using this is to declare the properties that share the same reification constructs as sub-properties of a parent property that carries the "vaem:reifiableBy" property. The parent property should be of type "rdf:Property" so that it can have both datatype and object properties as sub-properties. By this means use and transformations of a model can be understood through a fully specified metamodel. "vaem:reifiableBy" is rangeless in order to comply with OWL DL semantics. Its range would have been rdfs:Class in order to refer to "rdf:Statement" sub-classes

Script graph
different from: View graph
different from: Link Set graph
different from: Data graph
different from: Collection graph
different from: Rules Graph
type: Graph role
different from: Functions graph
different from: Documentation graph
different from: Curation graph
different from: Controllers graph
different from: Mapping graph
file prefix: SCRIPT
different from: Proxy graph
different from: Schema graph
different from: Vocabulary graph
different from: Constraints graph
different from: Transforms graph
type: Thing

RFC 4646
Relation: RFC4646-001
date: 2008-01-14
relation: RFC4646-001
issued: 2008-01-14
Has Version: RFC4646-001
type: Thing
description: RFC 4646 obsoletes RFC 3066.
type: Datatype
comment: The set of tags constructed according to RFC 4646 for the identification of languages.

Is Replaced By
type: ObjectProperty
sub property of: topObjectProperty
date: 2000-07-11
sub property of: relation
property disjoint with: bottomObjectProperty
relation: isReplacedBy-003
note: This term is intended to be used with non-literal values as defined in the DCMI Abstract Model (http://dublincore.org/documents/abstract-model/). As of December 2007, the DCMI Usage Board is seeking a way to express this intention with a formal range declaration.
issued: 2000-07-11
Relation: isReplacedBy-003
sub property of: Relation
Has Version: isReplacedBy-003
type: Thing
type: Property
modified: 2008-01-14
comment: A related resource that supplants, displaces, or supersedes the described resource.

Media Type
disjoint with: Nothing
subclass of: Media Type or Extent
type: Class
date: 2008-01-14
relation: MediaType-001
subclass of: Thing
type: Thing
Has Version: MediaType-001
Relation: MediaType-001
issued: 2008-01-14
comment: A file format or physical medium.

intent
property disjoint with: url
property disjoint with: RDF/XML file URL
property disjoint with: turtle file URL
property disjoint with: namespace
type: DatatypeProperty
property disjoint with: bottomDataProperty
property disjoint with: latest published version
property disjoint with: specificity
sub property of: topDataProperty
property disjoint with: previous published version
description: The property "vaem:intent" is used to outline a statement of purpose. This typically expresses one or more desired outcomes
range: string

Table Of Contents
Relation: tableOfContents-003
relation: tableOfContents-003
sub property of: description
date: 2000-07-11
property disjoint with: bottomObjectProperty
type: Thing
sub property of: topObjectProperty
type: ObjectProperty
Has Version: tableOfContents-003
issued: 2000-07-11
modified: 2008-01-14
type: Property
comment: A list of subunits of the resource.

namespace prefix
sub property of: topDataProperty
property disjoint with: RDF/XML file URL
property disjoint with: namespace
property disjoint with: url
type: DatatypeProperty
property disjoint with: previous published version
property disjoint with: latest published version
property disjoint with: bottomDataProperty
property disjoint with: turtle file URL
property disjoint with: specificity
description: The property "vaem:namespacePrefix" specifes a short handle or label for the URI of an Ontology. Multiple graphs can define statements for resources in the same Ontololgy namespace. For example, a foundation level graph with the base URI of "http://www.somesite.com/1.0/schema/OurOntology" may define general concepts for "OurOntology". Another graph with the base URI "http://www.somesite.com/1.0/schema/level2/OurOntology" may add more specific details to the same "OurOntology". Each of these two graphs would carry the same value for "vaem:namespacePrefix", for this example, perhaps, "ourOntology"
range: string

Publisher
Relation: publisherT-001
date: 2008-01-14
issued: 2008-01-14
relation: publisherT-001
type: Thing
Has Version: publisherT-001
sub property of: topObjectProperty
property disjoint with: bottomObjectProperty
sub property of: publisher
type: ObjectProperty
modified: 2010-10-11
range: Agent
comment: An entity responsible for making the resource available.
type: Property
description: Examples of a Publisher include a person, an organization, or a service.

Graph Metadata
disjoint with: Nothing
subclass of: Thing
type: Class
subclass of: http://lodlaundromat.org/.well-known/genid/35bcc76a9fca5c0a276e1f35afed697d#8
subclass of: http://lodlaundromat.org/.well-known/genid/samples/pellet///predicate//35bcc76a9fca5c0a276e1f35afed697d/35bcc76a9fca5c0a276e1f35afed697d#16
subclass of: http://lodlaundromat.org/.well-known/genid/samples/pellet///predicate//35bcc76a9fca5c0a276e1f35afed697d/35bcc76a9fca5c0a276e1f35afed697d#14
subclass of: http://lodlaundromat.org/.well-known/genid/samples/pellet///predicate//35bcc76a9fca5c0a276e1f35afed697d/35bcc76a9fca5c0a276e1f35afed697d#13
subclass of: http://lodlaundromat.org/.well-known/genid/35bcc76a9fca5c0a276e1f35afed697d#21
subclass of: http://lodlaundromat.org/.well-known/genid/samples/pellet///predicate//35bcc76a9fca5c0a276e1f35afed697d/35bcc76a9fca5c0a276e1f35afed697d#3
subclass of: http://lodlaundromat.org/.well-known/genid/samples/pellet///predicate//35bcc76a9fca5c0a276e1f35afed697d/35bcc76a9fca5c0a276e1f35afed697d#2
subclass of: http://lodlaundromat.org/.well-known/genid/35bcc76a9fca5c0a276e1f35afed697d#12
subclass of: http://lodlaundromat.org/.well-known/genid/35bcc76a9fca5c0a276e1f35afed697d#11
subclass of: http://lodlaundromat.org/.well-known/genid/samples/pellet///predicate//35bcc76a9fca5c0a276e1f35afed697d/35bcc76a9fca5c0a276e1f35afed697d#4
subclass of: http://lodlaundromat.org/.well-known/genid/samples/pellet///predicate//35bcc76a9fca5c0a276e1f35afed697d/35bcc76a9fca5c0a276e1f35afed697d#9
subclass of: http://lodlaundromat.org/.well-known/genid/samples/pellet///predicate//35bcc76a9fca5c0a276e1f35afed697d/35bcc76a9fca5c0a276e1f35afed697d#8
subclass of: http://lodlaundromat.org/.well-known/genid/samples/pellet///predicate//35bcc76a9fca5c0a276e1f35afed697d/35bcc76a9fca5c0a276e1f35afed697d#24
subclass of: http://lodlaundromat.org/.well-known/genid/35bcc76a9fca5c0a276e1f35afed697d#2
subclass of: http://lodlaundromat.org/.well-known/genid/35bcc76a9fca5c0a276e1f35afed697d#16
subclass of: http://lodlaundromat.org/.well-known/genid/35bcc76a9fca5c0a276e1f35afed697d#15
subclass of: http://lodlaundromat.org/.well-known/genid/samples/pellet///predicate//35bcc76a9fca5c0a276e1f35afed697d/35bcc76a9fca5c0a276e1f35afed697d#10
subclass of: http://lodlaundromat.org/.well-known/genid/35bcc76a9fca5c0a276e1f35afed697d#6
subclass of: http://lodlaundromat.org/.well-known/genid/35bcc76a9fca5c0a276e1f35afed697d#19
subclass of: http://lodlaundromat.org/.well-known/genid/samples/pellet///predicate//35bcc76a9fca5c0a276e1f35afed697d/35bcc76a9fca5c0a276e1f35afed697d#18
subclass of: http://lodlaundromat.org/.well-known/genid/samples/pellet///predicate//35bcc76a9fca5c0a276e1f35afed697d/35bcc76a9fca5c0a276e1f35afed697d#17
subclass of: http://lodlaundromat.org/.well-known/genid/35bcc76a9fca5c0a276e1f35afed697d#23
subclass of: http://lodlaundromat.org/.well-known/genid/35bcc76a9fca5c0a276e1f35afed697d#22
subclass of: http://lodlaundromat.org/.well-known/genid/samples/pellet///predicate//35bcc76a9fca5c0a276e1f35afed697d/35bcc76a9fca5c0a276e1f35afed697d#5
subclass of: http://lodlaundromat.org/.well-known/genid/samples/pellet///predicate//35bcc76a9fca5c0a276e1f35afed697d/35bcc76a9fca5c0a276e1f35afed697d#21
subclass of: http://lodlaundromat.org/.well-known/genid/samples/pellet///predicate//35bcc76a9fca5c0a276e1f35afed697d/35bcc76a9fca5c0a276e1f35afed697d#20
subclass of: http://lodlaundromat.org/.well-known/genid/35bcc76a9fca5c0a276e1f35afed697d#20
description: "vaem:GraphMetaData" defines basic metadata for the registration and publishing of a graph. For specificaiton of governance the vocabulary "VOAG" may be used.
subclass of: http://lodlaundromat.org/.well-known/genid/35bcc76a9fca5c0a276e1f35afed697d#3
subclass of: http://lodlaundromat.org/.well-known/genid/35bcc76a9fca5c0a276e1f35afed697d#24
subclass of: http://lodlaundromat.org/.well-known/genid/35bcc76a9fca5c0a276e1f35afed697d#7
subclass of: http://lodlaundromat.org/.well-known/genid/samples/pellet///predicate//35bcc76a9fca5c0a276e1f35afed697d/35bcc76a9fca5c0a276e1f35afed697d#7
subclass of: http://lodlaundromat.org/.well-known/genid/samples/pellet///predicate//35bcc76a9fca5c0a276e1f35afed697d/35bcc76a9fca5c0a276e1f35afed697d#6
subclass of: http://lodlaundromat.org/.well-known/genid/samples/pellet///predicate//35bcc76a9fca5c0a276e1f35afed697d/35bcc76a9fca5c0a276e1f35afed697d#22
subclass of: http://lodlaundromat.org/.well-known/genid/35bcc76a9fca5c0a276e1f35afed697d#17
subclass of: http://lodlaundromat.org/.well-known/genid/samples/pellet///predicate//35bcc76a9fca5c0a276e1f35afed697d/35bcc76a9fca5c0a276e1f35afed697d#12
subclass of: http://lodlaundromat.org/.well-known/genid/samples/pellet///predicate//35bcc76a9fca5c0a276e1f35afed697d/35bcc76a9fca5c0a276e1f35afed697d#11
subclass of: http://lodlaundromat.org/.well-known/genid/samples/pellet///predicate//35bcc76a9fca5c0a276e1f35afed697d/35bcc76a9fca5c0a276e1f35afed697d#1
subclass of: http://lodlaundromat.org/.well-known/genid/samples/pellet///predicate//35bcc76a9fca5c0a276e1f35afed697d/35bcc76a9fca5c0a276e1f35afed697d#15
subclass of: http://lodlaundromat.org/.well-known/genid/samples/pellet///predicate//35bcc76a9fca5c0a276e1f35afed697d/35bcc76a9fca5c0a276e1f35afed697d#19
subclass of: http://lodlaundromat.org/.well-known/genid/35bcc76a9fca5c0a276e1f35afed697d#10
subclass of: http://lodlaundromat.org/.well-known/genid/samples/pellet///predicate//35bcc76a9fca5c0a276e1f35afed697d/35bcc76a9fca5c0a276e1f35afed697d#23
subclass of: http://lodlaundromat.org/.well-known/genid/35bcc76a9fca5c0a276e1f35afed697d#1
subclass of: http://lodlaundromat.org/.well-known/genid/35bcc76a9fca5c0a276e1f35afed697d#14
subclass of: http://lodlaundromat.org/.well-known/genid/35bcc76a9fca5c0a276e1f35afed697d#13
subclass of: http://lodlaundromat.org/.well-known/genid/35bcc76a9fca5c0a276e1f35afed697d#5
subclass of: http://lodlaundromat.org/.well-known/genid/35bcc76a9fca5c0a276e1f35afed697d#4
subclass of: http://lodlaundromat.org/.well-known/genid/35bcc76a9fca5c0a276e1f35afed697d#9
subclass of: http://lodlaundromat.org/.well-known/genid/35bcc76a9fca5c0a276e1f35afed697d#18

Rules Graph
different from: Documentation graph
different from: Controllers graph
type: Graph role
different from: Data graph
different from: Constraints graph
different from: Schema graph
file prefix: RULES
type: Thing
different from: Link Set graph
different from: Transforms graph
different from: Functions graph
different from: Script graph
different from: Collection graph
different from: Curation graph
different from: Proxy graph
different from: Mapping graph
different from: Vocabulary graph
different from: View graph

DCMI Type Vocabulary
Relation: DCMIType-005
date: 2000-07-11
relation: DCMIType-005
issued: 2000-07-11
Has Version: DCMIType-005
type: VocabularyEncodingScheme
type: Thing
modified: 2012-06-14
comment: The set of classes specified by the DCMI Type Vocabulary, used to categorize the nature or genre of the resource.

Aspect Dimension
disjoint with: Nothing
subclass of: Domain
subclass of: Thing
type: Class
description: Aspect is used to distinguish among sets of features of a domain or subject area. The term is borrowed from "aspect-oriented" programming, where it is used to separate concerns. An ontology may be characterized by this dimension so as to parition features that are orthogonal. For example, in a systems ontology there may be aspects for "structure", "function", "behavior" and "interface" or "interoperability". A viewpoint can be distinguished by "aspects". For example the "information viewpoint" of an application can be partitioned into separate graphs for the "security", "operational" and"data retention" aspects.

Extent
sub property of: topObjectProperty
relation: extent-003
issued: 2000-07-11
date: 2000-07-11
Has Version: extent-003
type: ObjectProperty
Relation: extent-003
type: Thing
sub property of: format
property disjoint with: bottomObjectProperty
sub property of: Format
type: Property
comment: The size or duration of the resource.
range: Size or Duration
modified: 2008-01-14

has metadata
sub property of: topObjectProperty
property disjoint with: bottomObjectProperty
type: ObjectProperty
description: The property "hasMetadata" is used to reference a metadata information structure.

turtle file URL
type: DatatypeProperty
property disjoint with: file prefix
property disjoint with: description
sub property of: topDataProperty
property disjoint with: bottomDataProperty
property disjoint with: intent
property disjoint with: specificity
property disjoint with: rationale
property disjoint with: revision
property disjoint with: namespace prefix
property disjoint with: owner
property disjoint with: title
property disjoint with: name
description: The property "vaem:turtleFileURL" is used to provide a link to the location of the ontology's turtle file
range: anyURI

Location, Period, or Jurisdiction
date: 2008-01-14
disjoint with: Nothing
type: Thing
issued: 2008-01-14
Has Version: LocationPeriodOrJurisdiction-001
Relation: LocationPeriodOrJurisdiction-001
relation: LocationPeriodOrJurisdiction-001
subclass of: Thing
type: Class
comment: A location, period of time, or jurisdiction.

Accrual Method
issued: 2005-06-13
Has Version: accrualMethod-003
Relation: accrualMethod-003
type: ObjectProperty
sub property of: topObjectProperty
date: 2005-06-13
property disjoint with: bottomObjectProperty
type: Thing
relation: accrualMethod-003
modified: 2010-10-11
type: Property
comment: The method by which items are added to a collection.
domain: Collection
range: Method of Accrual

References
Relation: references-003
relation: references-003
note: This term is intended to be used with non-literal values as defined in the DCMI Abstract Model (http://dublincore.org/documents/abstract-model/). As of December 2007, the DCMI Usage Board is seeking a way to express this intention with a formal range declaration.
issued: 2000-07-11
date: 2000-07-11
sub property of: topObjectProperty
property disjoint with: bottomObjectProperty
type: ObjectProperty
type: Thing
sub property of: relation
Has Version: references-003
sub property of: Relation
type: Property
modified: 2008-01-14
comment: A related resource that is referenced, cited, or otherwise pointed to by the described resource.

url
sub property of: topDataProperty
property disjoint with: intent
property disjoint with: description
property disjoint with: bottomDataProperty
property disjoint with: rationale
property disjoint with: specificity
property disjoint with: namespace prefix
property disjoint with: name
type: DatatypeProperty
property disjoint with: title
property disjoint with: owner
property disjoint with: revision
property disjoint with: file prefix
description: The property "vaem:url" is intended for general use as the name implies. The range of the property is set as an XSD URI
range: anyURI

contributor
Relation: contributorT-001
date: 2008-01-14
relation: contributorT-001
issued: 2008-01-14
Has Version: contributorT-001
type: Thing
comment: An entity responsible for making contributions to the resource.
range: string
description: Examples of a Contributor include a person, an organization, or a service.
type: AnnotationProperty
label: Contributor
type: Property
modified: 2010-10-11
sub property of: contributor
range: Agent

has viewpoint
sub property of: topObjectProperty
sub property of: has dimension
property disjoint with: bottomObjectProperty
type: ObjectProperty
description: The property "vaem:hasViewpoint" is used to denote how a set of resources, or an individual resource, is relevant to a context of use. The term "viewpoint" is adopted from the ISO RM-ODP specifications and its more recent use in enterprise architecture descriptions. In VAEM, the property is used as a dimension for characterizing an ontology graph. The property is an "rdf:Property" to allow both scalar and object values

Physical Resource
date: 2008-01-14
relation: PhysicalResource-001
subclass of: Thing
type: Class
type: Thing
Has Version: PhysicalResource-001
issued: 2008-01-14
Relation: PhysicalResource-001
disjoint with: Nothing
comment: A material thing.

previous published version
property disjoint with: description
property disjoint with: bottomDataProperty
property disjoint with: revision
property disjoint with: namespace prefix
property disjoint with: title
sub property of: topDataProperty
property disjoint with: intent
property disjoint with: owner
property disjoint with: specificity
property disjoint with: rationale
property disjoint with: name
type: DatatypeProperty
property disjoint with: file prefix
description: The property "vaem:previousPublishedVersion"is a URL to documentation for the previous version of a graph.
range: anyURI

Date Copyrighted
sub property of: topDataProperty
date: 2002-07-13
sub property of: Date
property disjoint with: bottomDataProperty
relation: dateCopyrighted-002
type: Thing
sub property of: date
issued: 2002-07-13
type: DatatypeProperty
Relation: dateCopyrighted-002
Has Version: dateCopyrighted-002
range: Literal
type: Property
comment: Date of copyright.
modified: 2008-01-14

has domain
sub property of: topObjectProperty
sub property of: has dimension
property disjoint with: bottomObjectProperty
type: ObjectProperty
description: The property "vaem:hasDomain" is used to specify how a set of resources, or an individual resource is grounded in a domain, that is, a subject area of interest. Examples of domains are "enterprise", "process", "organization" and "system". In VAEM, the property is used as a dimension for characterizing an ontology graph. The property is an "rdf:Property" to allow both scalar and object values

Date Issued
relation: issued-003
sub property of: Date
sub property of: topDataProperty
type: DatatypeProperty
property disjoint with: bottomDataProperty
type: Thing
Relation: issued-003
Has Version: issued-003
date: 2000-07-11
issued: 2000-07-11
sub property of: date
range: Literal
comment: Date of formal issuance (e.g., publication) of the resource.
modified: 2008-01-14
type: Property

Curation graph
different from: Vocabulary graph
different from: Constraints graph
different from: Link Set graph
different from: Script graph
different from: Data graph
different from: Functions graph
different from: Controllers graph
different from: Transforms graph
different from: View graph
type: Thing
different from: Schema graph
type: Graph role
different from: Collection graph
different from: Proxy graph
file prefix: CURATION
different from: Mapping graph
different from: Documentation graph
different from: Rules Graph
description: A "vaem:CurationGraph" is a graph to hold metadata that is needed to describe, govern and provision another graph. A curation graph will likely use VOAG and VAEM for this purpose. The property "vaem:curationGraph" is used to link to the graph (or graphs) being curated

Frequency
subclass of: Thing
disjoint with: Nothing
type: Class
Relation: Frequency-001
relation: Frequency-001
type: Thing
date: 2008-01-14
Has Version: Frequency-001
issued: 2008-01-14
comment: A rate at which something recurs.

Is Referenced By
type: ObjectProperty
property disjoint with: bottomObjectProperty
date: 2000-07-11
sub property of: topObjectProperty
issued: 2000-07-11
sub property of: relation
type: Thing
note: This term is intended to be used with non-literal values as defined in the DCMI Abstract Model (http://dublincore.org/documents/abstract-model/). As of December 2007, the DCMI Usage Board is seeking a way to express this intention with a formal range declaration.
Relation: isReferencedBy-003
sub property of: Relation
relation: isReferencedBy-003
Has Version: isReferencedBy-003
modified: 2008-01-14
comment: A related resource that references, cites, or otherwise points to the described resource.
type: Property

Collection graph
file prefix: COLLECTION
different from: Constraints graph
different from: Proxy graph
different from: Vocabulary graph
different from: View graph
different from: Documentation graph
type: Thing
different from: Link Set graph
different from: Mapping graph
different from: Rules Graph
different from: Data graph
different from: Script graph
different from: Curation graph
different from: Controllers graph
different from: Schema graph
different from: Transforms graph
different from: Functions graph
type: Graph role
description: A "vaem:CollectionGraph" is a graph that aggregates other graphs using "owl:imports" statements

date
sub property of: topDataProperty
property disjoint with: bottomDataProperty
type: DatatypeProperty
description: The property "vaem:date" is intended for general use as the name implies. The range of the property is set as "vaem:dateUnion" so as to allow a value to have a number of forms from a year only to a full timestamp. The property is also the parent of all dates so that queries can be made for any date on an ontology

Constraints graph
file prefix: CONSTRAINTS
type: Graph role
different from: View graph
different from: Link Set graph
different from: Curation graph
different from: Vocabulary graph
different from: Transforms graph
different from: Documentation graph
different from: Functions graph
different from: Script graph
different from: Controllers graph
different from: Collection graph
different from: Data graph
different from: Schema graph
different from: Mapping graph
type: Thing
different from: Proxy graph
different from: Rules Graph
description: A "vaem:ConstraintsGraph" is a graph that holds SPIN constraints

acronym
sub property of: topDataProperty
property disjoint with: bottomDataProperty
type: DatatypeProperty
description: The property "vaem:acronym" provides a common way to define a commonly used abbreviation on a resource

namespace
property disjoint with: name
property disjoint with: description
property disjoint with: revision
property disjoint with: file prefix
sub property of: topDataProperty
property disjoint with: specificity
property disjoint with: bottomDataProperty
property disjoint with: owner
type: DatatypeProperty
property disjoint with: title
property disjoint with: rationale
property disjoint with: intent
property disjoint with: namespace prefix
description: The property "vaem:namespace" is the onotlogy URI with which a graph is primarily associated. The intent is to allow multiple graphs to define statements for resources in the same Ontology namespace. For example, a foundation level graph with the base URI of "http://www.somesite.com/1.0/schema/OurOntology" may define general concepts for "OurOntology". Another graph with the base URI "http://www.somesite.com/1.0/schema/level2/OurOntology" may add more specific details to the same "OurOntology". Each of these two graphs would carry the same value for "vaem:namespace", that is, "http://www.somesite.com/schema/OurOntology". In other words, an ontology URI is the URI associated with the resources of a controlled namespace. On the other hand the graph URIs (the base URIs) identify the graphs that hold resources that make up an ontology
range: anyURI

definition
description: An annotation property that can be freely used on any kind of resource. The range of the property is "xsd:string"
type: AnnotationProperty
range: string

http://lodlaundromat.org/.well-known/genid/35bcc76a9fca5c0a276e1f35afed697d#23
type: Restriction
max cardinality: 1
on property: latest published version

http://lodlaundromat.org/.well-known/genid/35bcc76a9fca5c0a276e1f35afed697d#2
type: Restriction
cardinality: 1
on property: name

todo
description: As it name implies, a way to attach an annotation about a "todo" task
type: AnnotationProperty
range: string

http://lodlaundromat.org/.well-known/genid/samples/pellet///predicate//35bcc76a9fca5c0a276e1f35afed697d/35bcc76a9fca5c0a276e1f35afed697d#7
type: Restriction
on property: namespace prefix
max cardinality: 1

dateCreated
description: The property "vaem:dateCreated" is intended for general use as the name implies. The range of the property is set as "vaem:dateUnion" so as to allow a value to have a number of forms from a year only to a full timestamp

http://lodlaundromat.org/.well-known/genid/samples/pellet///predicate//35bcc76a9fca5c0a276e1f35afed697d/35bcc76a9fca5c0a276e1f35afed697d#25
type: Restriction
on property: url
max cardinality: 1

http://lodlaundromat.org/.well-known/genid/35bcc76a9fca5c0a276e1f35afed697d#18
type: Restriction
max cardinality: 1
on property: namespace

http://lodlaundromat.org/.well-known/genid/35bcc76a9fca5c0a276e1f35afed697d#26
type: Restriction
max cardinality: 1
on property: id

http://lodlaundromat.org/.well-known/genid/samples/pellet///predicate//35bcc76a9fca5c0a276e1f35afed697d/35bcc76a9fca5c0a276e1f35afed697d#2
type: Restriction
on property: name
cardinality: 1

idString
description: The property "vaem:idString" is intended for general use as a means to specifiy a unique reference to something. This is a data property with a string range and is a sub-property of "vame:id"

http://lodlaundromat.org/.well-known/genid/samples/pellet///predicate//35bcc76a9fca5c0a276e1f35afed697d/35bcc76a9fca5c0a276e1f35afed697d#20
type: Restriction
on property: has license type
max cardinality: 1

http://lodlaundromat.org/.well-known/genid/35bcc76a9fca5c0a276e1f35afed697d#5
type: Restriction
max cardinality: 1
on property: turtle file URL

http://lodlaundromat.org/.well-known/genid/35bcc76a9fca5c0a276e1f35afed697d#13
type: Restriction
max cardinality: 1
on property: has identifier

ownedBy
description: The property "vaem:ownedBy" is a general property that in some cases could have scalar values or may refer to some concept of "Party". For this reason, the type of this property is set as "rdf:Property" and the property is rangeless. There are two sub-properties of "vaem:ownedBy", namely "vaem:owner" for string values and "vaem:owningParty" for referencing a party. Ownership applies to those ontologies that are proprietary

http://lodlaundromat.org/.well-known/genid/samples/pellet///predicate//35bcc76a9fca5c0a276e1f35afed697d/35bcc76a9fca5c0a276e1f35afed697d#28
type: Restriction
on property: file prefix
max cardinality: 1

logo
description: The property "vaem:logo" is a reference to an image that is used for publishing the ontology"
type: AnnotationProperty
range: anyURI

http://lodlaundromat.org/.well-known/genid/35bcc76a9fca5c0a276e1f35afed697d#29
type: Restriction
max cardinality: 1
on property: description

http://lodlaundromat.org/.well-known/genid/samples/pellet///predicate//35bcc76a9fca5c0a276e1f35afed697d/35bcc76a9fca5c0a276e1f35afed697d#5
type: Restriction
on property: turtle file URL
max cardinality: 1

http://lodlaundromat.org/.well-known/genid/samples/pellet///predicate//35bcc76a9fca5c0a276e1f35afed697d/35bcc76a9fca5c0a276e1f35afed697d#23
type: Restriction
on property: latest published version
max cardinality: 1

http://lodlaundromat.org/.well-known/genid/35bcc76a9fca5c0a276e1f35afed697d#8
type: Restriction
max cardinality: 1
on property: owner

http://lodlaundromat.org/.well-known/genid/35bcc76a9fca5c0a276e1f35afed697d#24
type: Restriction
max cardinality: 1
on property: intent

http://lodlaundromat.org/.well-known/genid/samples/pellet///predicate//35bcc76a9fca5c0a276e1f35afed697d/35bcc76a9fca5c0a276e1f35afed697d#18
type: Restriction
on property: namespace
max cardinality: 1

http://lodlaundromat.org/.well-known/genid/35bcc76a9fca5c0a276e1f35afed697d#11
type: Restriction
max cardinality: 1
on property: previous published version

http://lodlaundromat.org/.well-known/genid/samples/pellet///predicate//35bcc76a9fca5c0a276e1f35afed697d/35bcc76a9fca5c0a276e1f35afed697d#8
type: Restriction
on property: owner
max cardinality: 1

http://lodlaundromat.org/.well-known/genid/samples/pellet///predicate//35bcc76a9fca5c0a276e1f35afed697d/35bcc76a9fca5c0a276e1f35afed697d#26
type: Restriction
on property: id
max cardinality: 1

http://lodlaundromat.org/.well-known/genid/35bcc76a9fca5c0a276e1f35afed697d#19
type: Restriction
max cardinality: 1
on property: RDF/XML file URL

http://lodlaundromat.org/.well-known/genid/samples/pellet///predicate//35bcc76a9fca5c0a276e1f35afed697d/35bcc76a9fca5c0a276e1f35afed697d#13
type: Restriction
on property: has identifier
max cardinality: 1

lastUpdated
description: The property "vaem:lastUpdated" is intended for general use as the name implies. The range of the property is set as "vaem:dateUnion" so as to allow a value to have a number of forms from a year only to a full timestamp

http://lodlaundromat.org/.well-known/genid/35bcc76a9fca5c0a276e1f35afed697d#27
type: Restriction
cardinality: 1
on property: name

http://lodlaundromat.org/.well-known/genid/35bcc76a9fca5c0a276e1f35afed697d#14
type: Restriction
max cardinality: 1
on property: specificity

http://lodlaundromat.org/.well-known/genid/samples/pellet///predicate//35bcc76a9fca5c0a276e1f35afed697d/35bcc76a9fca5c0a276e1f35afed697d#29
type: Restriction
on property: description
max cardinality: 1

http://lodlaundromat.org/.well-known/genid/35bcc76a9fca5c0a276e1f35afed697d#22
type: Restriction
max cardinality: 1
on property: has steward

owningParty
description: The property "vaem:owningParty" is used to refer to some concept of "Party" and is a sub-property of "vaem:ownedBy"

http://lodlaundromat.org/.well-known/genid/35bcc76a9fca5c0a276e1f35afed697d#1
type: Restriction
max cardinality: 1
on property: revision

http://lodlaundromat.org/.well-known/genid/samples/pellet///predicate//35bcc76a9fca5c0a276e1f35afed697d/35bcc76a9fca5c0a276e1f35afed697d#24
type: Restriction
on property: intent
max cardinality: 1

http://lodlaundromat.org/.well-known/genid/35bcc76a9fca5c0a276e1f35afed697d#9
type: Restriction
max cardinality: 1
on property: has metadata

http://lodlaundromat.org/.well-known/genid/samples/pellet///predicate//35bcc76a9fca5c0a276e1f35afed697d/35bcc76a9fca5c0a276e1f35afed697d#11
type: Restriction
on property: previous published version
max cardinality: 1

uses non-imported resource
description: The property "vaem:usesNonImportedResource" is used to express dependencies on resources from graphs that are not imported
type: AnnotationProperty
range: Resource

http://lodlaundromat.org/.well-known/genid/35bcc76a9fca5c0a276e1f35afed697d#25
type: Restriction
max cardinality: 1
on property: url

http://lodlaundromat.org/.well-known/genid/samples/pellet///predicate//35bcc76a9fca5c0a276e1f35afed697d/35bcc76a9fca5c0a276e1f35afed697d#19
type: Restriction
on property: RDF/XML file URL
max cardinality: 1

http://lodlaundromat.org/.well-known/genid/samples/pellet///predicate//35bcc76a9fca5c0a276e1f35afed697d/35bcc76a9fca5c0a276e1f35afed697d#1
type: Restriction
on property: revision
max cardinality: 1

CatalogEntry
description: VAEM Governed Object class is a placeholder for concepts that are fully defined by the voag:GovernedObject concept hierarchy for building a catalog of ontologies and graphs

with attribution to
description: The property "vaem:withAttributionTo" is an annotation property that is either used to hold either a string or a reference to an instance of "voag:Attribution", from the VOAG ontology
type: AnnotationProperty

http://lodlaundromat.org/.well-known/genid/samples/pellet///predicate//35bcc76a9fca5c0a276e1f35afed697d/35bcc76a9fca5c0a276e1f35afed697d#9
type: Restriction
on property: has metadata
max cardinality: 1

http://lodlaundromat.org/.well-known/genid/samples/pellet///predicate//35bcc76a9fca5c0a276e1f35afed697d/35bcc76a9fca5c0a276e1f35afed697d#27
type: Restriction
on property: name
cardinality: 1

http://lodlaundromat.org/.well-known/genid/35bcc76a9fca5c0a276e1f35afed697d#20
type: Restriction
max cardinality: 1
on property: has license type

http://lodlaundromat.org/.well-known/genid/samples/pellet///predicate//35bcc76a9fca5c0a276e1f35afed697d/35bcc76a9fca5c0a276e1f35afed697d#14
type: Restriction
on property: specificity
max cardinality: 1

http://lodlaundromat.org/.well-known/genid/35bcc76a9fca5c0a276e1f35afed697d#28
type: Restriction
max cardinality: 1
on property: file prefix

http://lodlaundromat.org/.well-known/genid/samples/pellet///predicate//35bcc76a9fca5c0a276e1f35afed697d/35bcc76a9fca5c0a276e1f35afed697d#22
type: Restriction
on property: has steward
max cardinality: 1

author
type: AnnotationProperty
range: string

http://lodlaundromat.org/.well-known/genid/35bcc76a9fca5c0a276e1f35afed697d#7
type: Restriction
max cardinality: 1
on property: namespace prefix

isDefinedBy
description: An annotation used to reference a graph that elaborates (adds properties and axioms to) a resource
type: AnnotationProperty
range: anyURI
sub property of: isDefinedBy