Graph Metadata
type: Class
subclass of: http://lodlaundromat.org/.well-known/genid/samples/pellet///predicate//35bcc76a9fca5c0a276e1f35afed697d/35bcc76a9fca5c0a276e1f35afed697d#1
subclass of: http://lodlaundromat.org/.well-known/genid/samples/pellet///predicate//35bcc76a9fca5c0a276e1f35afed697d/35bcc76a9fca5c0a276e1f35afed697d#2
subclass of: http://lodlaundromat.org/.well-known/genid/samples/pellet///predicate//35bcc76a9fca5c0a276e1f35afed697d/35bcc76a9fca5c0a276e1f35afed697d#3
subclass of: http://lodlaundromat.org/.well-known/genid/samples/pellet///predicate//35bcc76a9fca5c0a276e1f35afed697d/35bcc76a9fca5c0a276e1f35afed697d#4
description: "vaem:GraphMetaData" defines basic metadata for the registration and publishing of a graph. For specificaiton of governance the vocabulary "VOAG" may be used.
subclass of: http://lodlaundromat.org/.well-known/genid/samples/pellet///predicate//35bcc76a9fca5c0a276e1f35afed697d/35bcc76a9fca5c0a276e1f35afed697d#5
subclass of: http://lodlaundromat.org/.well-known/genid/samples/pellet///predicate//35bcc76a9fca5c0a276e1f35afed697d/35bcc76a9fca5c0a276e1f35afed697d#6
subclass of: http://lodlaundromat.org/.well-known/genid/samples/pellet///predicate//35bcc76a9fca5c0a276e1f35afed697d/35bcc76a9fca5c0a276e1f35afed697d#7
subclass of: http://lodlaundromat.org/.well-known/genid/samples/pellet///predicate//35bcc76a9fca5c0a276e1f35afed697d/35bcc76a9fca5c0a276e1f35afed697d#8
subclass of: http://lodlaundromat.org/.well-known/genid/samples/pellet///predicate//35bcc76a9fca5c0a276e1f35afed697d/35bcc76a9fca5c0a276e1f35afed697d#9
subclass of: http://lodlaundromat.org/.well-known/genid/samples/pellet///predicate//35bcc76a9fca5c0a276e1f35afed697d/35bcc76a9fca5c0a276e1f35afed697d#10
subclass of: Thing
subclass of: http://lodlaundromat.org/.well-known/genid/samples/pellet///predicate//35bcc76a9fca5c0a276e1f35afed697d/35bcc76a9fca5c0a276e1f35afed697d#11
subclass of: http://lodlaundromat.org/.well-known/genid/samples/pellet///predicate//35bcc76a9fca5c0a276e1f35afed697d/35bcc76a9fca5c0a276e1f35afed697d#12
subclass of: http://lodlaundromat.org/.well-known/genid/samples/pellet///predicate//35bcc76a9fca5c0a276e1f35afed697d/35bcc76a9fca5c0a276e1f35afed697d#13
subclass of: http://lodlaundromat.org/.well-known/genid/samples/pellet///predicate//35bcc76a9fca5c0a276e1f35afed697d/35bcc76a9fca5c0a276e1f35afed697d#14
subclass of: http://lodlaundromat.org/.well-known/genid/samples/pellet///predicate//35bcc76a9fca5c0a276e1f35afed697d/35bcc76a9fca5c0a276e1f35afed697d#15
subclass of: http://lodlaundromat.org/.well-known/genid/samples/pellet///predicate//35bcc76a9fca5c0a276e1f35afed697d/35bcc76a9fca5c0a276e1f35afed697d#16
subclass of: http://lodlaundromat.org/.well-known/genid/samples/pellet///predicate//35bcc76a9fca5c0a276e1f35afed697d/35bcc76a9fca5c0a276e1f35afed697d#17
subclass of: http://lodlaundromat.org/.well-known/genid/samples/pellet///predicate//35bcc76a9fca5c0a276e1f35afed697d/35bcc76a9fca5c0a276e1f35afed697d#18
subclass of: http://lodlaundromat.org/.well-known/genid/samples/pellet///predicate//35bcc76a9fca5c0a276e1f35afed697d/35bcc76a9fca5c0a276e1f35afed697d#19
subclass of: http://lodlaundromat.org/.well-known/genid/samples/pellet///predicate//35bcc76a9fca5c0a276e1f35afed697d/35bcc76a9fca5c0a276e1f35afed697d#20
subclass of: http://lodlaundromat.org/.well-known/genid/samples/pellet///predicate//35bcc76a9fca5c0a276e1f35afed697d/35bcc76a9fca5c0a276e1f35afed697d#21
subclass of: http://lodlaundromat.org/.well-known/genid/samples/pellet///predicate//35bcc76a9fca5c0a276e1f35afed697d/35bcc76a9fca5c0a276e1f35afed697d#22
subclass of: http://lodlaundromat.org/.well-known/genid/samples/pellet///predicate//35bcc76a9fca5c0a276e1f35afed697d/35bcc76a9fca5c0a276e1f35afed697d#23
subclass of: http://lodlaundromat.org/.well-known/genid/samples/pellet///predicate//35bcc76a9fca5c0a276e1f35afed697d/35bcc76a9fca5c0a276e1f35afed697d#24

http://lodlaundromat.org/.well-known/genid/samples/pellet///predicate//35bcc76a9fca5c0a276e1f35afed697d/35bcc76a9fca5c0a276e1f35afed697d#1
type: Restriction
on property: revision
max cardinality: 1

revision
type: DatatypeProperty
range: string
description: The property "vaem:revision" is a property intended for general use as the name implies.

http://lodlaundromat.org/.well-known/genid/samples/pellet///predicate//35bcc76a9fca5c0a276e1f35afed697d/35bcc76a9fca5c0a276e1f35afed697d#2
type: Restriction
on property: name
cardinality: 1

name
type: DatatypeProperty
range: string
description: The property "vaem:name" is intended for general use. In many cases "rdfs:label" could be used give names to resources. In the case where compliance with a specific naming rule is needed, "vaem:name" allows a resource to carry a name that is used in more specific contexts.

has viewpoint
type: ObjectProperty
sub property of: has dimension
description: The property "vaem:hasViewpoint" is used to denote how a set of resources, or an individual resource, is relevant to a context of use. The term "viewpoint" is adopted from the ISO RM-ODP specifications and its more recent use in enterprise architecture descriptions. In VAEM, the property is used as a dimension for characterizing an ontology graph. The property is an "rdf:Property" to allow both scalar and object values

ViewpointDimension
type: Class
subclass of: Domain
description: Viewpoint is used to denote how a set of resources, or an individual resource, is relevant to a context of use. The term "viewpoint" is adopted from the ISO RM-ODP specifications and its more recent use in enterprise architecture descriptions. The RM-ODP introducesd the concept of viewpoint to describe a system from a particular set of concerns. RM-ODP defines five viewpoints. Together they provide a complete description of a system: enterprise viewpoint, information viewpoint, computational viewpoint, engineering viewpoint, and technology viewpoint. In VAEM, "Viewpoint" is used as a dimension for characterizing an ontology graph. The viewpoints of an ontology may not always correpsond directly to those of a system but the idea of describing a subject area of interest from distinct viewpoints is still relevant. A viewpoint can be further distinguished by "aspects". For example the "information viewpoint" of an application can be partitioned into separate graphs for the "security", "operational" and"data retention" aspects.

has steward
type: ObjectProperty
description: A property that is used to refer to a "Steward", that is, the party or role that is responsible for maintaining an asset, in the case of VAEM, an ontology graph.

Party
type: Class
subclass of: http://lodlaundromat.org/.well-known/genid/samples/pellet///predicate//35bcc76a9fca5c0a276e1f35afed697d/35bcc76a9fca5c0a276e1f35afed697d#25
subclass of: http://lodlaundromat.org/.well-known/genid/samples/pellet///predicate//35bcc76a9fca5c0a276e1f35afed697d/35bcc76a9fca5c0a276e1f35afed697d#26
subclass of: http://lodlaundromat.org/.well-known/genid/samples/pellet///predicate//35bcc76a9fca5c0a276e1f35afed697d/35bcc76a9fca5c0a276e1f35afed697d#27
subclass of: Thing
description: A "Party" is a generalization for an actor that may be realized as a person, organizaiton or named role.

http://lodlaundromat.org/.well-known/genid/samples/pellet///predicate//35bcc76a9fca5c0a276e1f35afed697d/35bcc76a9fca5c0a276e1f35afed697d#5
type: Restriction
on property: turtle file URL
max cardinality: 1

turtle file URL
type: DatatypeProperty
range: anyURI
description: The property "vaem:turtleFileURL" is used to provide a link to the location of the ontology's turtle file

has aspect
type: ObjectProperty
sub property of: has dimension
description: The property "vaem:hasAspect" is used to distinguish among sets of features of a domain or subject area. The term is borrowed from "aspect-oriented" programming, where it is used to separate concerns. An ontology may be characterized by this dimension so as to parition features that are orthogonal. For example, in a systems ontology we can distinguish aspects for "structure", "function", "behavior" and "interface". The property is an "rdf:Property" to allow both scalar and object values

Aspect Dimension
type: Class
subclass of: Domain
description: Aspect is used to distinguish among sets of features of a domain or subject area. The term is borrowed from "aspect-oriented" programming, where it is used to separate concerns. An ontology may be characterized by this dimension so as to parition features that are orthogonal. For example, in a systems ontology there may be aspects for "structure", "function", "behavior" and "interface" or "interoperability". A viewpoint can be distinguished by "aspects". For example the "information viewpoint" of an application can be partitioned into separate graphs for the "security", "operational" and"data retention" aspects.

http://lodlaundromat.org/.well-known/genid/samples/pellet///predicate//35bcc76a9fca5c0a276e1f35afed697d/35bcc76a9fca5c0a276e1f35afed697d#7
type: Restriction
on property: namespace prefix
max cardinality: 1

namespace prefix
type: DatatypeProperty
range: string
description: The property "vaem:namespacePrefix" specifes a short handle or label for the URI of an Ontology. Multiple graphs can define statements for resources in the same Ontololgy namespace. For example, a foundation level graph with the base URI of "http://www.somesite.com/1.0/schema/OurOntology" may define general concepts for "OurOntology". Another graph with the base URI "http://www.somesite.com/1.0/schema/level2/OurOntology" may add more specific details to the same "OurOntology". Each of these two graphs would carry the same value for "vaem:namespacePrefix", for this example, perhaps, "ourOntology"

http://lodlaundromat.org/.well-known/genid/samples/pellet///predicate//35bcc76a9fca5c0a276e1f35afed697d/35bcc76a9fca5c0a276e1f35afed697d#8
type: Restriction
on property: owner
max cardinality: 1

owner
type: DatatypeProperty
range: string

http://lodlaundromat.org/.well-known/genid/samples/pellet///predicate//35bcc76a9fca5c0a276e1f35afed697d/35bcc76a9fca5c0a276e1f35afed697d#9
type: Restriction
on property: has metadata
max cardinality: 1

has metadata
type: ObjectProperty
description: The property "hasMetadata" is used to reference a metadata information structure.

description
type: DatatypeProperty
range: string

http://lodlaundromat.org/.well-known/genid/samples/pellet///predicate//35bcc76a9fca5c0a276e1f35afed697d/35bcc76a9fca5c0a276e1f35afed697d#11
type: Restriction
on property: previous published version
max cardinality: 1

previous published version
type: DatatypeProperty
range: anyURI
description: The property "vaem:previousPublishedVersion"is a URL to documentation for the previous version of a graph.

has discipline
type: ObjectProperty
sub property of: has dimension
description: The property "vaem:hasDiscipline" is used to indicate relevance of a set of resources, or a resource itself, to a specific discipline of work or study. Examples of disciplines in the engineering domain are electrical engineering, mechanical engineering and, in the financial domain, risk assessment, investment analysis. In VAEM, the property is used as a dimension for characterizing an ontology graph. The property is an "rdf:Property" to allow both scalar and object values

Discipline Dimension
type: Class
subclass of: Domain
description: A discipline is a specific area of work or study. Examples of disciplines in the engineering domain are electrical engineering, mechanical engineering and, in the financial domain, risk assessment, investment analysis. In VAEM, discipline is used as a dimension for characterizing an ontology graph

http://lodlaundromat.org/.well-known/genid/samples/pellet///predicate//35bcc76a9fca5c0a276e1f35afed697d/35bcc76a9fca5c0a276e1f35afed697d#13
type: Restriction
on property: has identifier
max cardinality: 1

has identifier
type: ObjectProperty
description: The property "vaemhasIdentifier" is intended for general use as a means to specifiy a unique reference to something. This is an object property that is a sub-property of "vame:id"

http://lodlaundromat.org/.well-known/genid/samples/pellet///predicate//35bcc76a9fca5c0a276e1f35afed697d/35bcc76a9fca5c0a276e1f35afed697d#14
type: Restriction
on property: specificity
max cardinality: 1

specificity
type: DatatypeProperty
range: nonNegativeInteger
description: The property "vaem:specificity" is intended to specify the level of detail of an ontology. The values that can be set for this property are restriced to an integer from 1 to 5. An ontology at level 1 has concepts of more general applicability than one at level 5. By having graphs at different levels of specificity it is possible to support greater modularity for selective imports

VAEM Schema Version 2.0 Metadata
type: Graph Metadata
name: VAEM
uses non-imported resource: modified
owner: TopQuadrant, Inc.
uses non-imported resource: abstract
created: 2011-04-20
description: VAEM stands for "Vocabulary for Attaching Essential Metadata". What VAEM regards as essential metadata is data about dates and times, confidentiality, and other characterisitic qualifiers of the ontology, but also references to where a ontology is documented and where to find ontology registration for governance, attribution and provenance. VAEM makes use of some properties from the DC terms vocabulary using the namespace prefix "dct". VAEM is OWL-DL compliant.
uses non-imported resource: created
latest published version: http://www.linkedmodel.org/doc/2014/SCHEMA_vaem-v2.0
has graph role: Schema graph
has steward: TopQuadrant
uses non-imported resource: CC-SHAREALIKE 3PT0-US
intent: The purpose of VAEM is to provide, by import, a foundation for commonly needed resources for metadata on an ontology.
has owner: TopQuadrant
with attribution to: VAEM is issued under a Creative Commons Attribution Share Alike 3.0 United States License. Attribution should be made to TopQuadrant, Inc.
turtle file URL: http://www.linkedmodel.org/2.0/schema/SCHEMA_vaem-v2.0.ttl
revision: 2.0
uses non-imported resource: title
previous published version: http://linkedmodel.org/doc/vaem/1.2/
namespace prefix: vaem
uses non-imported resource: author
title: VAEM Version 2.0 Metadata
modified: 2014-07-26
RDF/XML file URL: http://www.linkedmodel.org/2.0/schema/SCHEMA_vaem-v2.0.rdf
abstract: VAEM stands for "Vocabulary for Attaching Essential Metadata". What VAEM regards as essential metadata is data about dates and times, confidentiality, and other characterisitic qualifiers of the ontology, but also references to where a ontology is documented and where to find ontology registration for governance, attribution and provenance. VAEM makes use of some properties from the DC terms vocabulary using the namespace prefix "dct". VAEM is OWL-DL compliant.
namespace: http://www.linkedmodel.org/schema/vaem#
title: Vocabulary for Attaching Essential Metadata (VAEM) - Version 2.0

modified
type: AnnotationProperty
range: date

abstract
type: AnnotationProperty
range: string

created
type: AnnotationProperty
range: date

Schema graph
type: Graph role
file prefix: SCHEMA

TopQuadrant
type: Party
url: http:/www.topquadrant.com
name: TopQuadrant, Inc.

title
type: AnnotationProperty
range: string

author
type: AnnotationProperty
range: string

has graph role
type: ObjectProperty
range: Graph role
description: The property "lms:hasGraphRole" is used to characterize how a resource participates in an ontology set. The property is used to specify the role that a graph plays, for example, an ontology graph can be a schema, vocabulary, dataset, script, or ruleset

Graph role
type: Class
subclass of: http://lodlaundromat.org/.well-known/genid/samples/pellet///predicate//35bcc76a9fca5c0a276e1f35afed697d/35bcc76a9fca5c0a276e1f35afed697d#28
subclass of: http://lodlaundromat.org/.well-known/genid/samples/pellet///predicate//35bcc76a9fca5c0a276e1f35afed697d/35bcc76a9fca5c0a276e1f35afed697d#29
subclass of: Thing
description: GraphRole is used to characterize how a graph of resources participates in an ontology set. For example, a graph can be a schema, vocabulary, dataset, script, or ruleset

has owner
type: ObjectProperty

has domain
type: ObjectProperty
sub property of: has dimension
description: The property "vaem:hasDomain" is used to specify how a set of resources, or an individual resource is grounded in a domain, that is, a subject area of interest. Examples of domains are "enterprise", "process", "organization" and "system". In VAEM, the property is used as a dimension for characterizing an ontology graph. The property is an "rdf:Property" to allow both scalar and object values

Domain Dimension
type: Class
subclass of: Domain
description: A domain is a subject area of interest. Examples of domains are "enterprise", "process", "organization" and "system". In VAEM, "Domain" is used as a dimension for characterizing an ontology graph

http://lodlaundromat.org/.well-known/genid/samples/pellet///predicate//35bcc76a9fca5c0a276e1f35afed697d/35bcc76a9fca5c0a276e1f35afed697d#18
type: Restriction
on property: namespace
max cardinality: 1

namespace
type: DatatypeProperty
range: anyURI
description: The property "vaem:namespace" is the onotlogy URI with which a graph is primarily associated. The intent is to allow multiple graphs to define statements for resources in the same Ontology namespace. For example, a foundation level graph with the base URI of "http://www.somesite.com/1.0/schema/OurOntology" may define general concepts for "OurOntology". Another graph with the base URI "http://www.somesite.com/1.0/schema/level2/OurOntology" may add more specific details to the same "OurOntology". Each of these two graphs would carry the same value for "vaem:namespace", that is, "http://www.somesite.com/schema/OurOntology". In other words, an ontology URI is the URI associated with the resources of a controlled namespace. On the other hand the graph URIs (the base URIs) identify the graphs that hold resources that make up an ontology

http://lodlaundromat.org/.well-known/genid/samples/pellet///predicate//35bcc76a9fca5c0a276e1f35afed697d/35bcc76a9fca5c0a276e1f35afed697d#19
type: Restriction
on property: RDF/XML file URL
max cardinality: 1

RDF/XML file URL
type: DatatypeProperty
range: anyURI
description: The property "vaem:rdfxmlFileURL" is used to provide a link to the location of the ontology's RDF/XML file

http://lodlaundromat.org/.well-known/genid/samples/pellet///predicate//35bcc76a9fca5c0a276e1f35afed697d/35bcc76a9fca5c0a276e1f35afed697d#20
type: Restriction
on property: has license type
max cardinality: 1

has license type
type: ObjectProperty
description: The property "vaem:hasLicenseType" points to an entry in the VOAG ontology for licenses

http://lodlaundromat.org/.well-known/genid/samples/pellet///predicate//35bcc76a9fca5c0a276e1f35afed697d/35bcc76a9fca5c0a276e1f35afed697d#22
type: Restriction
on property: has steward
max cardinality: 1

http://lodlaundromat.org/.well-known/genid/samples/pellet///predicate//35bcc76a9fca5c0a276e1f35afed697d/35bcc76a9fca5c0a276e1f35afed697d#23
type: Restriction
on property: latest published version
max cardinality: 1

latest published version
type: DatatypeProperty
range: anyURI
description: The property "vaem:latestPublishedVersion"is a URL to documentation for the latest version of a graph.

http://lodlaundromat.org/.well-known/genid/samples/pellet///predicate//35bcc76a9fca5c0a276e1f35afed697d/35bcc76a9fca5c0a276e1f35afed697d#24
type: Restriction
on property: intent
max cardinality: 1

intent
type: DatatypeProperty
range: string
description: The property "vaem:intent" is used to outline a statement of purpose. This typically expresses one or more desired outcomes

Domain
type: Class
subclass of: Thing
description: A dimension identifies a separation of concens that serves as a way to categorize an ontology graph. In VAEM, the notion of "Dimension" is partitioned into "Aspect", "Discipline", "Domain" and "Viewpoint".

http://lodlaundromat.org/.well-known/genid/samples/pellet///predicate//35bcc76a9fca5c0a276e1f35afed697d/35bcc76a9fca5c0a276e1f35afed697d#25
type: Restriction
on property: url
max cardinality: 1

url
type: DatatypeProperty
range: anyURI
description: The property "vaem:url" is intended for general use as the name implies. The range of the property is set as an XSD URI

http://lodlaundromat.org/.well-known/genid/samples/pellet///predicate//35bcc76a9fca5c0a276e1f35afed697d/35bcc76a9fca5c0a276e1f35afed697d#26
type: Restriction
on property: id
max cardinality: 1

id
type: DatatypeProperty
description: The property "vaem:id" is intended for general use as a means to specifiy an identifier. The type of this property is intentionally set to "rdf:Property" so that use of the property can allow both object and scaler values. For this reason, the property is rangeless

http://lodlaundromat.org/.well-known/genid/samples/pellet///predicate//35bcc76a9fca5c0a276e1f35afed697d/35bcc76a9fca5c0a276e1f35afed697d#27
type: Restriction
on property: name
cardinality: 1

http://lodlaundromat.org/.well-known/genid/samples/pellet///predicate//35bcc76a9fca5c0a276e1f35afed697d/35bcc76a9fca5c0a276e1f35afed697d#28
type: Restriction
on property: file prefix
max cardinality: 1

file prefix
type: DatatypeProperty
range: string
description: The property "vaem:filePrefix" is for specifying a preferred file prefix for a graph. For example a schema graph may be given the file prefix "SCHEMA" followed by an underscore "_".

http://lodlaundromat.org/.well-known/genid/samples/pellet///predicate//35bcc76a9fca5c0a276e1f35afed697d/35bcc76a9fca5c0a276e1f35afed697d#29
type: Restriction
on property: description
max cardinality: 1

reifiable by
type: ObjectProperty
description: To express how statements in a model can be reifiable, this property is used to explicitly associate a property with a user-defined sub-class of "rdf:Statement". A recommended way of using this is to declare the properties that share the same reification constructs as sub-properties of a parent property that carries the "vaem:reifiableBy" property. The parent property should be of type "rdf:Property" so that it can have both datatype and object properties as sub-properties. By this means use and transformations of a model can be understood through a fully specified metamodel. "vaem:reifiableBy" is rangeless in order to comply with OWL DL semantics. Its range would have been rdfs:Class in order to refer to "rdf:Statement" sub-classes

has dimension
type: ObjectProperty
description: The property "vaem:hasDimension" is used categorize an ontology. In VAEM, the property is used to characterize an ontology graph.

acronym
type: DatatypeProperty
description: The property "vaem:acronym" provides a common way to define a commonly used abbreviation on a resource

title
type: DatatypeProperty
range: string

abbreviation
type: DatatypeProperty
description: The property "vaem:abbreviation" provides a common way to define a commonly used abbreviation on a resource

release date
type: DatatypeProperty
sub property of: date
description: The property "vaem:releaseDate" is intended for general use as the name implies. The range of the property is set as "vaem:dateUnion" so as to allow a value to have a number of forms from a year only to a full timestamp

date
type: DatatypeProperty
description: The property "vaem:date" is intended for general use as the name implies. The range of the property is set as "vaem:dateUnion" so as to allow a value to have a number of forms from a year only to a full timestamp. The property is also the parent of all dates so that queries can be made for any date on an ontology

rationale
type: DatatypeProperty
range: string
description: A description of a justification for some other assertion or value

logo
type: AnnotationProperty
range: anyURI
description: The property "vaem:logo" is a reference to an image that is used for publishing the ontology"

Link Set graph
type: Graph role
file prefix: LINKSET
description: A "vaem:LinkSetGraph" is a graph that holds statements that specify links between resources

rights
type: AnnotationProperty
range: string

Mapping graph
type: Graph role
file prefix: MAPPINGS
description: A graph that specifies a transformation of a graph into another graph or graphs. Invariably this is a SPINMap graph using SPARQL Rules (SPIN) to express the transforms.

View graph
type: Graph role
file prefix: VIEWS

creator
type: AnnotationProperty
range: string

Controllers graph
type: Graph role
file prefix: CONTROLLERS

description
type: AnnotationProperty
range: string

ownedBy
description: The property "vaem:ownedBy" is a general property that in some cases could have scalar values or may refer to some concept of "Party". For this reason, the type of this property is set as "rdf:Property" and the property is rangeless. There are two sub-properties of "vaem:ownedBy", namely "vaem:owner" for string values and "vaem:owningParty" for referencing a party. Ownership applies to those ontologies that are proprietary

Transforms graph
type: Graph role
file prefix: TRANSFORMS

owningParty
description: The property "vaem:owningParty" is used to refer to some concept of "Party" and is a sub-property of "vaem:ownedBy"

subject
type: AnnotationProperty
range: string

Data graph
type: Graph role
file prefix: DATA

lastUpdated
description: The property "vaem:lastUpdated" is intended for general use as the name implies. The range of the property is set as "vaem:dateUnion" so as to allow a value to have a number of forms from a year only to a full timestamp

Functions graph
type: Graph role
file prefix: FUNCTIONS

Rules Graph
type: Graph role
file prefix: RULES

with attribution to
type: AnnotationProperty
description: The property "vaem:withAttributionTo" is an annotation property that is either used to hold either a string or a reference to an instance of "voag:Attribution", from the VOAG ontology

definition
type: AnnotationProperty
range: string
description: An annotation property that can be freely used on any kind of resource. The range of the property is "xsd:string"

idString
description: The property "vaem:idString" is intended for general use as a means to specifiy a unique reference to something. This is a data property with a string range and is a sub-property of "vame:id"

Proxy graph
type: Graph role
file prefix: PROXY

Documentation graph
type: Graph role
file prefix: DOC

todo
type: AnnotationProperty
range: string
description: As it name implies, a way to attach an annotation about a "todo" task

dateCreated
description: The property "vaem:dateCreated" is intended for general use as the name implies. The range of the property is set as "vaem:dateUnion" so as to allow a value to have a number of forms from a year only to a full timestamp

Collection graph
type: Graph role
file prefix: COLLECTION
description: A "vaem:CollectionGraph" is a graph that aggregates other graphs using "owl:imports" statements

replaces
type: AnnotationProperty
range: Resource

CatalogEntry
description: VAEM Governed Object class is a placeholder for concepts that are fully defined by the voag:GovernedObject concept hierarchy for building a catalog of ontologies and graphs

Script graph
type: Graph role
file prefix: SCRIPT

uses non-imported resource
type: AnnotationProperty
range: Resource
description: The property "vaem:usesNonImportedResource" is used to express dependencies on resources from graphs that are not imported

Vocabulary graph
type: Graph role
file prefix: VOCAB
description: An RDF/OWL Graph that is a controlled set of instances.

isDefinedBy
type: AnnotationProperty
sub property of: isDefinedBy
range: anyURI
description: An annotation used to reference a graph that elaborates (adds properties and axioms to) a resource

contributor
type: AnnotationProperty
range: string

Curation graph
type: Graph role
file prefix: CURATION
description: A "vaem:CurationGraph" is a graph to hold metadata that is needed to describe, govern and provision another graph. A curation graph will likely use VOAG and VAEM for this purpose. The property "vaem:curationGraph" is used to link to the graph (or graphs) being curated

Constraints graph
type: Graph role
file prefix: CONSTRAINTS
description: A "vaem:ConstraintsGraph" is a graph that holds SPIN constraints