File Extension
definition: The :fileExtension property specifies the extension part of the filename of an asset.
type: Thing
sub property of: topDataProperty
property disjoint with: bottomDataProperty
type: DatatypeProperty
domain: Asset
range: Literal

Has Image
property disjoint with: Has Serial
definition: The :hasImage property relates a publication to an image.
property disjoint with: Has Previous Issue
property disjoint with: Has Next Issue
type: ObjectProperty
property disjoint with: Has Journal
type: Thing
property disjoint with: Has Issue
sub property of: topObjectProperty
property disjoint with: bottomObjectProperty
property disjoint with: Has Graph
property disjoint with: Has External Article
property disjoint with: Has Blog
property disjoint with: Has Article
property disjoint with: Has Current Issue
property disjoint with: Has Collection
domain: Publication
range: Image

Publish Event
type: Class
subclass of: Event
subclass of: Publication Event
subclass of: E12 Production
subclass of: Thing
type: Thing
disjoint with: Nothing
note: In order to differentiate these events further, the :PublishState vocabulary is used.
definition: The :PublishEvent class represents events related to the publication of a document. This is intended in a strict sense, i.e. the time when a publication is made 'public'.

Publication Name
definition: The :publicationName property specifies a string name for an external publication.
type: Thing
sub property of: topDataProperty
property disjoint with: bottomDataProperty
type: DatatypeProperty
domain: Publication
range: Literal

External Contributor
type: Thing
disjoint with: Dataset
definition: The :ExternalContributor class represents a contributor from an article which is externally published.
disjoint with: Document
disjoint with: Blog
disjoint with: Nothing
disjoint with: Blog Post
note: The :ExternalContributor class subclasses the :Contributor class.
disjoint with: Serial
subclass of: Component
subclass of: Contributor
subclass of: Concept
disjoint with: KnowledgeBase
disjoint with: Journal
subclass of: Thing
disjoint with: Collection
type: Class
subclass of: Publication
disjoint with: Issue
disjoint with: Article
disjoint with: Graph
disjoint with: External Article

Has Next Issue
property disjoint with: bottomObjectProperty
property disjoint with: Has Corresponding Contributor
definition: The :hasNextIssue property relates a publication to the next issue.
property disjoint with: Has Illustration
property disjoint with: Has Blog
property disjoint with: Has External Contributor
type: ObjectProperty
property disjoint with: Has Article
property disjoint with: Has Abstract
sub property of: topObjectProperty
sub property of: Has Issue
property disjoint with: Has Image
property disjoint with: Has Journal
property disjoint with: Has External Article
type: Thing
property disjoint with: Has Section
property disjoint with: Has Figure
property disjoint with: Has Contributor
property disjoint with: Has Serial
property disjoint with: Has Summary
domain: Publication
range: Issue

Type
subclass of: Thing
type: Class
type: Thing
definition: The :Type class groups together all domain-specific categorisations relevant to the NPG publishing world.
subclass of: Concept
disjoint with: Nothing
note: All of the :Type categorisations are implemented as self-contained reusable SKOS vocabularies (although not all of them are taxonomies in the strict sense of hierarchical vocabularies).

Citation (Data)
sub property of: topDataProperty
note: This is an alternative representation of the :citation property.
property disjoint with: bottomDataProperty
type: DatatypeProperty
type: Thing
definition: The :citationData property specifies the full citation of a publication as a single string for machine use.
domain: Publication
range: Literal

Has Publish Event
definition: The :hasPublishEvent property relates a publication to a publish-event that describes some recognized change in the status of a publication's publish history.
type: Thing
sub property of: topObjectProperty
property disjoint with: bottomObjectProperty
type: ObjectProperty
domain: Publication
range: Publish Event

Volume Start
property disjoint with: Given Name
property disjoint with: Section Level
property disjoint with: Is Corresponding
property disjoint with: Number
sub property of: topDataProperty
property disjoint with: Caption
property disjoint with: bottomDataProperty
type: DatatypeProperty
type: Thing
property disjoint with: Family Name
property disjoint with: Name
property disjoint with: Is Curated
property disjoint with: Page Start
property disjoint with: Pages
property disjoint with: Credit
property disjoint with: Page End
property disjoint with: Is Group
definition: The :volumeStart property specifies the start volume for a serial publication. Note that this :volumeStart property relates to the publisher holdings which may not be the same as the actual publication volume start.
property disjoint with: Caption (XML)
domain: Serial
range: Literal

Is Named Resource
definition: The :isNamedResource property marks whether an object resource is named or is unnamed (i.e. a blank node).
type: Thing
type: AnnotationProperty

Person
type: Class
subclass of: Thing
subclass of: Agent
definition: The :Person class represents a single person entity.
type: Thing
disjoint with: Nothing

Has Figure
type: Thing
property disjoint with: Has Collection
property disjoint with: Has Serial
definition: The :hasFigure property relates a publication to a figure.
property disjoint with: Has Illustration
property disjoint with: Has Journal
property disjoint with: Has Previous Issue
type: ObjectProperty
sub property of: topObjectProperty
property disjoint with: bottomObjectProperty
property disjoint with: Has Issue
property disjoint with: Has Article
property disjoint with: Has External Article
property disjoint with: Has Current Issue
property disjoint with: Has Blog
property disjoint with: Has Next Issue
property disjoint with: Has Graph
domain: Publication
range: Figure

Issue End
property disjoint with: Given Name
sub property of: topDataProperty
property disjoint with: Credit
property disjoint with: Family Name
type: DatatypeProperty
property disjoint with: Page Start
property disjoint with: Page End
property disjoint with: Name
definition: The :issueEnd property specifies the end issue for a serial publication. Note that this :issueEnd property relates to the publisher holdings which may not be the same as the actual publication issue end.
property disjoint with: Caption
property disjoint with: Caption (XML)
property disjoint with: Is Corresponding
property disjoint with: Section Level
type: Thing
property disjoint with: Is Curated
property disjoint with: bottomDataProperty
property disjoint with: Number
property disjoint with: Is Group
property disjoint with: Pages
domain: Serial
range: Literal

Publication End YearMonth
property disjoint with: Publication Start Year
property disjoint with: Is Curated
property disjoint with: Is Event Workflow
property disjoint with: Sort Number
property disjoint with: Number
type: Thing
property disjoint with: Is Group
property disjoint with: Year
property disjoint with: Section Level
property disjoint with: Cover Date
property disjoint with: Tree Depth
property disjoint with: Publication Date
property disjoint with: Is Corresponding
property disjoint with: Is Issue Based
property disjoint with: Code
property disjoint with: Publication DateTime
property disjoint with: DateTime
definition: The :publicationEndYearMonth property specifies the year and month date of a publication's end as a string. Note that this date relates to the publisher holdings which may not be the same as the actual publication end date.
property disjoint with: Is Root
property disjoint with: Publication Year
property disjoint with: Is PrimaryArticleType
property disjoint with: Is Publish Ready
property disjoint with: Date
property disjoint with: bottomDataProperty
property disjoint with: Item Number
type: DatatypeProperty
sub property of: topDataProperty
property disjoint with: Is Test Instance
property disjoint with: Cover Year
property disjoint with: Is Leaf
domain: Publication
range: gYearMonth

Item
subclass of: Thing
type: Class
subclass of: Event
type: Thing
subclass of: Aggregation Event
disjoint with: Nothing
definition: The :Item class represents the state of a document after this has been added to a :Collection by someone, at a specific time, and within a specific sequence.

Publish State
type: Thing
subclass of: Type
disjoint with: Nothing
type: Class
subclass of: Thing
definition: The :PublishState class provides a categorisation of the possible states a document may have after it has been published. For example, whether it’s an 'Advanced online publication' or an 'Issue publication'. This categorisation is implemented as a SKOS vocabulary.
subclass of: Concept
subclass of: Publication State

Sort Letter
sub property of: topDataProperty
definition: The :sortLetter property specifies the initial letter of an entity name to facilitate sort operations.
note: This property is generally computed from a build-time rule.
type: Thing
type: DatatypeProperty
property disjoint with: bottomDataProperty
domain: Type
range: Literal

Has External Article
property disjoint with: Has Contributor
property disjoint with: Has Summary
definition: The :hasExternalArticle property relates an article to an external article.
property disjoint with: Has Current Issue
property disjoint with: Has Issue
property disjoint with: Has Blog
property disjoint with: Item List
property disjoint with: Has Next Issue
property disjoint with: Has Abstract
property disjoint with: Has Summary Type
type: Thing
property disjoint with: Has Journal
property disjoint with: Item Reference List
property disjoint with: Has Figure
property disjoint with: Has Section
property disjoint with: Has Image Asset
property disjoint with: Has External Contributor
property disjoint with: Has Corresponding Contributor
property disjoint with: Has Collection
sub property of: topObjectProperty
property disjoint with: Has Serial
property disjoint with: Has Image
type: ObjectProperty
property disjoint with: bottomObjectProperty
property disjoint with: Has Illustration
property disjoint with: Has Previous Issue
domain: Article
range: External Article

Volume
property disjoint with: Caption (XML)
property disjoint with: Name
property disjoint with: Credit
property disjoint with: Page Start
property disjoint with: Number
sub property of: topDataProperty
property disjoint with: Page End
type: DatatypeProperty
definition: The :volume property specifies a volume label for a journal.
property disjoint with: Caption
property disjoint with: Family Name
property disjoint with: Section Level
type: Thing
property disjoint with: Is Corresponding
property disjoint with: Is Group
property disjoint with: Given Name
property disjoint with: bottomDataProperty
property disjoint with: Is Curated
property disjoint with: Pages
domain: Journal
range: Literal

Cover YearMonth
property disjoint with: Code
property disjoint with: Number
property disjoint with: Year
property disjoint with: Is Corresponding
property disjoint with: Publication Start Year
type: DatatypeProperty
property disjoint with: Is Issue Based
property disjoint with: Publication DateTime
property disjoint with: Is Publish Ready
definition: The :coverDate property specifies the year and month date of a publication as it is displayed on its cover.
property disjoint with: Publication Date
note: This is not necessarily the actual date of publication.
sub property of: topDataProperty
property disjoint with: Is Root
property disjoint with: Tree Depth
property disjoint with: Publication Year
property disjoint with: Is Leaf
property disjoint with: Is Test Instance
property disjoint with: DateTime
type: Thing
property disjoint with: Cover Year
property disjoint with: Cover Date
property disjoint with: Is Curated
property disjoint with: bottomDataProperty
property disjoint with: Is Event Workflow
property disjoint with: Is PrimaryArticleType
property disjoint with: Item Number
property disjoint with: Is Group
property disjoint with: Date
property disjoint with: Section Level
property disjoint with: Sort Number
domain: Publication
range: gYearMonth

Serial
subclass of: Publication
disjoint with: Collection
disjoint with: Article
disjoint with: Abstract
disjoint with: Nothing
disjoint with: Section
disjoint with: Contributor
disjoint with: Image
disjoint with: Illustration
disjoint with: External Contributor
disjoint with: External Article
subclass of: Concept
type: Thing
definition: The :Serial class represents publications which appear in a new edition on a regular schedule. For example, a journal, a magazine or a blog. The :PublishEvent class is used to provide more details about the time, place and other contextual information relevant to when a new edition gets published.
disjoint with: Component
disjoint with: Issue
disjoint with: Graph
subclass of: Thing
disjoint with: Dataset
disjoint with: Blog Post
disjoint with: Summary
type: Class
disjoint with: Document
disjoint with: Figure
disjoint with: KnowledgeBase

Example
note: This property is similar to void:exampleResource. But see also skos:example.
definition: The :example property specifies an example of an entity.
type: Thing
type: AnnotationProperty

Has External Contributor
property disjoint with: Has Article
sub property of: topObjectProperty
property disjoint with: Has Image Asset
type: ObjectProperty
property disjoint with: Has Graph
property disjoint with: Has Serial
property disjoint with: Item List
property disjoint with: Has Collection
definition: The :hasExternalArticle property relates an article to an external contributor.
property disjoint with: Has Next Issue
property disjoint with: Has Issue
property disjoint with: Has Blog
property disjoint with: Has External Article
property disjoint with: Has Current Issue
property disjoint with: Has Summary Type
property disjoint with: bottomObjectProperty
property disjoint with: Has Previous Issue
property disjoint with: Has Journal
property disjoint with: Item Reference List
type: Thing
domain: Article
range: External Contributor

Has Publish State
definition: The :hasPublishState property relates a publish-event to a publish-state that describes some recognized change in the status of a publication's publish history.
type: Thing
sub property of: topObjectProperty
property disjoint with: bottomObjectProperty
type: ObjectProperty
domain: Publish Event
range: Publish State

Has Section
property disjoint with: Has Blog
property disjoint with: Has Issue
property disjoint with: Has Graph
property disjoint with: Has Previous Issue
property disjoint with: Has Article
property disjoint with: Has Serial
type: ObjectProperty
property disjoint with: Has External Article
type: Thing
property disjoint with: Has Collection
definition: The :hasSection property relates an item to a section component.
sub property of: topObjectProperty
property disjoint with: Has Current Issue
property disjoint with: Has Journal
property disjoint with: Has Next Issue
property disjoint with: bottomObjectProperty
domain: Item
range: Section

Volume End
property disjoint with: Caption (XML)
property disjoint with: Is Group
property disjoint with: Page End
type: DatatypeProperty
definition: The :volumeEnd property specifies the end volume for a serial publication. Note that this :volumeEnd property relates to the publisher holdings which may not be the same as the actual publication volume end.
property disjoint with: Number
property disjoint with: Given Name
property disjoint with: bottomDataProperty
property disjoint with: Is Corresponding
type: Thing
property disjoint with: Section Level
property disjoint with: Is Curated
property disjoint with: Family Name
property disjoint with: Caption
property disjoint with: Page Start
property disjoint with: Pages
property disjoint with: Name
sub property of: topDataProperty
property disjoint with: Credit
domain: Serial
range: Literal

Has Broader Subject
type: Thing
definition: The :hasBroaderSubject property relates a publication to a broader subject term than it is actually classified with.
type: ObjectProperty
property disjoint with: bottomObjectProperty
sub property of: Has Subject
sub property of: topObjectProperty
domain: Publication
range: Subject

Caption (XML)
property disjoint with: Date Start
property disjoint with: Issue
property disjoint with: Page Start
property disjoint with: Issue Start
type: Thing
type: DatatypeProperty
property disjoint with: Subject Path
property disjoint with: bottomDataProperty
property disjoint with: Volume
property disjoint with: Volume Start
property disjoint with: Asset Folder Name
property disjoint with: Volume End
property disjoint with: E-ISSN
sub property of: topDataProperty
property disjoint with: Issue End
property disjoint with: Is Issue Based
property disjoint with: Pages
definition: The :captionXml property specifies the caption of a figure or illustration as an XML string.
property disjoint with: Date End
property disjoint with: ISSN
property disjoint with: Page End
domain: Image
range: Literal

Summary
disjoint with: Graph
disjoint with: Serial
subclass of: Component
disjoint with: Dataset
disjoint with: Blog Post
type: Class
disjoint with: Article
disjoint with: KnowledgeBase
definition: The :Summary class represents a brief description of a scholarly work, usually editorially generated.
disjoint with: External Article
disjoint with: Blog
disjoint with: Document
disjoint with: Nothing
subclass of: Publication
subclass of: Concept
disjoint with: Collection
disjoint with: Issue
subclass of: Thing
disjoint with: Journal
type: Thing

Core Ontology
rights: This work is distributed under a Creative Commons Attribution 4.0 (CC BY 4.0) License <http://creativecommons.org/licenses/by/4.0/>.
creator: Michele Pasin <mailto:michele.pasin@macmillan.com>
type: Publication
preferred namespace prefix: npg
publisher: Macmillan Publishers Limited
definition: The Core Ontology is a formal model providing definitions for the key concepts of interest to content publishing at Macmillan Science and Education.
type: Thing
type: Concept
Web Page: core
date: 2015-06-18T09:48:19Z
license: http://creativecommons.org/licenses/by/4.0/
note: For further information about this ontology or for any queries please use the contact address <mailto:developers@nature.com>.
creator: Tony Hammond <mailto:tony.hammond@macmillan.com>
imports: core
type: Ontology
version info: 1.0.44-SNAPSHOT

Publication State
subclass of: Concept
type: Thing
subclass of: Thing
disjoint with: Nothing
definition: The :PublicationState class groups together publish-state and review-state individuals.
type: Class
subclass of: Type

Has Publication
definition: The :hasPublication property relates a publication-event to a publication.
type: Thing
sub property of: topObjectProperty
property disjoint with: bottomObjectProperty
type: ObjectProperty
domain: Publication Event
range: Publication

Tree Depth
property disjoint with: Is Corresponding
property disjoint with: DateTime
property disjoint with: Publication Start YearMonth
property disjoint with: Is Issue Based
property disjoint with: Cover YearMonth
sub property of: topDataProperty
property disjoint with: YearMonth
property disjoint with: Is Test Instance
property disjoint with: Is Leaf
property disjoint with: Publication Start Year
property disjoint with: Publication End YearMonth
type: Thing
property disjoint with: Is Publish Ready
property disjoint with: Year
property disjoint with: bottomDataProperty
property disjoint with: Publication DateTime
property disjoint with: Date
property disjoint with: Is Curated
definition: The :treeDepth property specifies the depth of a term within a taxonomy tree.
property disjoint with: Is Group
property disjoint with: Publication Date
property disjoint with: Publication YearMonth
property disjoint with: Is Root
property disjoint with: Is PrimaryArticleType
property disjoint with: Cover Date
note: This property is generally computed by a build-time rule
property disjoint with: Publication Year
property disjoint with: Is Event Workflow
type: DatatypeProperty
property disjoint with: Cover Year
domain: Type
range: integer

Has Graph
type: ObjectProperty
property disjoint with: Has External Contributor
type: Thing
property disjoint with: Has Journal
property disjoint with: Has Image
property disjoint with: Has Blog
property disjoint with: Has Corresponding Contributor
property disjoint with: Has Figure
property disjoint with: Has Abstract
property disjoint with: Has Serial
definition: The :hasGraph property relates an entity to the RDF named graph associated with it.
property disjoint with: Has Contributor
property disjoint with: bottomObjectProperty
property disjoint with: Has Section
property disjoint with: Has Illustration
property disjoint with: Has Summary
sub property of: topObjectProperty
range: Graph

Is Event Workflow
property disjoint with: Publication Start Year
definition: The :isEventWorkflow property marks whether a publication is in the new metadata-based (event) workflow.
property disjoint with: YearMonth
property disjoint with: Publication YearMonth
property disjoint with: Publication Year
property disjoint with: DateTime
type: DatatypeProperty
property disjoint with: Cover YearMonth
property disjoint with: Cover Date
property disjoint with: Item Number
property disjoint with: Tree Depth
property disjoint with: Year
property disjoint with: Publication DateTime
property disjoint with: Publication End YearMonth
property disjoint with: Publication Start YearMonth
property disjoint with: Cover Year
property disjoint with: Date
property disjoint with: Number
property disjoint with: Code
property disjoint with: Publication Date
property disjoint with: bottomDataProperty
property disjoint with: Section Level
type: Thing
property disjoint with: Sort Number
sub property of: topDataProperty
domain: Publication
range: boolean

ID Hash
definition: The :idHash property specifies a string hash value for an ID.
type: Thing
sub property of: topDataProperty
property disjoint with: bottomDataProperty
type: DatatypeProperty
range: Literal
deprecated: true

Summary Type
disjoint with: Nothing
subclass of: Concept
subclass of: Thing
subclass of: Type
type: Thing
definition: The :SummaryType class represents an instance from a categorisation of types of :Summary. For example, 'Long Summary', 'Short Summary', etc. This categorisation is implemented as a SKOS concept scheme.
type: Class

Number
property disjoint with: Page Start
property disjoint with: Pages
property disjoint with: Publication DateTime
property disjoint with: Is Corresponding
property disjoint with: Date Start
property disjoint with: Publication Start Year
property disjoint with: Volume End
property disjoint with: Publication End YearMonth
property disjoint with: Cover YearMonth
property disjoint with: Is PrimaryArticleType
property disjoint with: Date End
property disjoint with: Is Event Workflow
property disjoint with: Subject Path
property disjoint with: Issue Start
property disjoint with: Is Curated
property disjoint with: Year
property disjoint with: YearMonth
property disjoint with: Publication Year
property disjoint with: Publication YearMonth
definition: The :number property specifies a sequence number for a component such as a figure.
property disjoint with: Cover Year
property disjoint with: DateTime
property disjoint with: Is Group
property disjoint with: Is Issue Based
property disjoint with: Issue End
property disjoint with: Is Test Instance
property disjoint with: Is Root
property disjoint with: Page End
property disjoint with: Volume
property disjoint with: Date
property disjoint with: Publication Start YearMonth
property disjoint with: Issue
property disjoint with: E-ISSN
property disjoint with: ISSN
property disjoint with: Is Leaf
type: Thing
property disjoint with: Publication Date
property disjoint with: Asset Folder Name
property disjoint with: Cover Date
property disjoint with: Is Publish Ready
property disjoint with: bottomDataProperty
property disjoint with: Volume Start
sub property of: topDataProperty
type: DatatypeProperty
domain: Component
range: integer

Has Review Event
definition: The :hasReviewEvent property relates a publication to a review-event that describes some recognized change in the status of a publication's review history.
type: Thing
sub property of: topObjectProperty
property disjoint with: bottomObjectProperty
type: ObjectProperty
domain: Publication
range: Review Event

Has XML Asset
definition: The :hasXmlAsset property relates a publication to an xml-asset.
type: Thing
sub property of: topObjectProperty
property disjoint with: bottomObjectProperty
type: ObjectProperty
domain: Publication
range: Xml Asset

Has Item
definition: The :hasItem property relates a publication to an item.
type: Thing
sub property of: topObjectProperty
property disjoint with: bottomObjectProperty
type: ObjectProperty
domain: Publication
range: Item

Given Name
property disjoint with: Is Issue Based
property disjoint with: Page Start
property disjoint with: Subject Path
property disjoint with: Date Start
property disjoint with: bottomDataProperty
property disjoint with: ISSN
property disjoint with: Date End
property disjoint with: Pages
property disjoint with: Volume
property disjoint with: Issue Start
property disjoint with: Page End
property disjoint with: Asset Folder Name
type: DatatypeProperty
type: Thing
property disjoint with: Issue End
property disjoint with: E-ISSN
sub property of: topDataProperty
property disjoint with: Issue
definition: The :givenName property specifies the given name of a person.
property disjoint with: Volume Start
property disjoint with: Volume End
domain: Contributor
range: Literal

Has Primary Article Type
sub property of: Has Article Type
property disjoint with: bottomObjectProperty
definition: The :hasPrimaryArticleType property relates an article to an article-type that can be used for grouping purposes.
sub property of: topObjectProperty
property disjoint with: Item List
property disjoint with: Item Reference List
property disjoint with: Has Image Asset
property disjoint with: Has Summary Type
type: ObjectProperty
type: Thing
domain: Article
range: Article Type

Count
definition: The :count property specifies a map which records the number of instances of an entity.
type: Thing
sub property of: topObjectProperty
property disjoint with: bottomObjectProperty
type: ObjectProperty

Illustration
subclass of: Thing
disjoint with: External Article
definition: The :Illustration class represents a numbered and captioned image within a publication. This image typically illustrates a point about the work described in the publication.
type: Class
subclass of: Component
disjoint with: Blog Post
disjoint with: Journal
type: Thing
disjoint with: Figure
disjoint with: Document
subclass of: Image
subclass of: Publication
disjoint with: Nothing
disjoint with: Serial
disjoint with: Dataset
disjoint with: Issue
subclass of: Concept
disjoint with: Collection
disjoint with: Article
disjoint with: KnowledgeBase
disjoint with: Blog
disjoint with: Graph

Publication Date
sub property of: topDataProperty
property disjoint with: Year
property disjoint with: Is Test Instance
property disjoint with: Publication YearMonth
property disjoint with: Publication End YearMonth
property disjoint with: Is Root
definition: The :publicationDate property specifies the full date of a publication as a string.
property disjoint with: Cover Year
property disjoint with: Publication Start Year
property disjoint with: Tree Depth
property disjoint with: Code
property disjoint with: Publication DateTime
property disjoint with: Publication Start YearMonth
property disjoint with: Is Event Workflow
property disjoint with: Section Level
type: DatatypeProperty
property disjoint with: DateTime
property disjoint with: YearMonth
property disjoint with: Is Publish Ready
property disjoint with: Cover YearMonth
property disjoint with: Is Issue Based
property disjoint with: bottomDataProperty
property disjoint with: Is Leaf
property disjoint with: Is PrimaryArticleType
property disjoint with: Is Group
property disjoint with: Number
type: Thing
property disjoint with: Publication Year
property disjoint with: Item Number
property disjoint with: Sort Number
property disjoint with: Is Corresponding
property disjoint with: Is Curated
domain: Publication
range: date

Asset Folder Name
property disjoint with: Is Corresponding
property disjoint with: Section Level
sub property of: topDataProperty
type: DatatypeProperty
property disjoint with: Caption (XML)
property disjoint with: Page End
property disjoint with: Family Name
property disjoint with: Pages
type: Thing
property disjoint with: bottomDataProperty
property disjoint with: Name
property disjoint with: Page Start
property disjoint with: Given Name
definition: The :assetFolderName property specifies a folder name for file storage assets.
property disjoint with: Is Group
property disjoint with: Caption
property disjoint with: Credit
property disjoint with: Number
property disjoint with: Is Curated
domain: Journal
range: Literal

Timestamp
definition: The :timestamp property specifies a generic timestamp for an object.
type: Thing
sub property of: topDataProperty
property disjoint with: bottomDataProperty
type: DatatypeProperty
range: Literal

Has Illustration
type: Thing
property disjoint with: Has Article
sub property of: topObjectProperty
property disjoint with: Has Current Issue
property disjoint with: Has Graph
property disjoint with: Has Blog
property disjoint with: Has Journal
definition: The :hasIllustration property relates a publication to an illustration.
property disjoint with: bottomObjectProperty
property disjoint with: Has External Article
property disjoint with: Has Collection
property disjoint with: Has Issue
type: ObjectProperty
property disjoint with: Has Serial
property disjoint with: Has Next Issue
property disjoint with: Has Figure
property disjoint with: Has Previous Issue
domain: Publication
range: Illustration

Is Curated
property disjoint with: Cover Date
property disjoint with: Publication DateTime
property disjoint with: Publication End YearMonth
property disjoint with: Date End
property disjoint with: Volume
property disjoint with: bottomDataProperty
property disjoint with: Is Issue Based
type: DatatypeProperty
property disjoint with: Publication Start YearMonth
property disjoint with: Year
property disjoint with: Issue
property disjoint with: Issue End
sub property of: topDataProperty
property disjoint with: YearMonth
property disjoint with: Volume End
property disjoint with: Section Level
property disjoint with: Publication Year
property disjoint with: Page End
property disjoint with: ISSN
type: Thing
property disjoint with: Page Start
property disjoint with: Code
property disjoint with: Date Start
property disjoint with: Publication Start Year
property disjoint with: Publication Date
definition: The :isCurated property marks whether an image is editiorially managed.
property disjoint with: Cover Year
property disjoint with: Date
property disjoint with: Publication YearMonth
property disjoint with: Cover YearMonth
property disjoint with: E-ISSN
property disjoint with: Asset Folder Name
property disjoint with: Number
property disjoint with: Pages
property disjoint with: Item Number
property disjoint with: Subject Path
property disjoint with: Tree Depth
property disjoint with: DateTime
property disjoint with: Sort Number
property disjoint with: Volume Start
property disjoint with: Issue Start
domain: Image
range: boolean

Date Start
property disjoint with: Is Group
sub property of: topDataProperty
property disjoint with: Given Name
type: Thing
property disjoint with: Caption (XML)
property disjoint with: Is Corresponding
property disjoint with: Caption
definition: The :dateStart property specifies the start date for a serial publication. Note that this date relates to the publisher holdings which may not be the same as the actual publication start date.
property disjoint with: Number
property disjoint with: Credit
property disjoint with: Name
property disjoint with: Is Curated
property disjoint with: Page End
type: DatatypeProperty
property disjoint with: Family Name
property disjoint with: bottomDataProperty
property disjoint with: Section Level
property disjoint with: Pages
property disjoint with: Page Start
domain: Serial
range: Literal

Is Leaf
property disjoint with: Cover YearMonth
property disjoint with: bottomDataProperty
property disjoint with: Publication Year
property disjoint with: Item Number
property disjoint with: DateTime
sub property of: topDataProperty
type: DatatypeProperty
property disjoint with: Publication End YearMonth
property disjoint with: Publication DateTime
type: Thing
property disjoint with: Code
property disjoint with: Publication Start Year
property disjoint with: Publication YearMonth
property disjoint with: Tree Depth
property disjoint with: Cover Date
property disjoint with: Date
property disjoint with: YearMonth
definition: The :isLeaf property marks whether a SKOS concept is a leaf SKOS concept.
property disjoint with: Number
property disjoint with: Year
property disjoint with: Cover Year
property disjoint with: Section Level
property disjoint with: Publication Start YearMonth
property disjoint with: Sort Number
property disjoint with: Publication Date
domain: Type
range: boolean

Replaced By
sub property of: topObjectProperty
type: ObjectProperty
definition: The :replacedBy property relates a publication to another publication that replaces it.
inverse of: Replaces
type: Thing
property disjoint with: bottomObjectProperty
domain: Publication
range: Publication

Credit
property disjoint with: Page End
property disjoint with: Page Start
property disjoint with: Issue End
property disjoint with: Asset Folder Name
property disjoint with: Volume Start
property disjoint with: Issue
property disjoint with: bottomDataProperty
property disjoint with: E-ISSN
property disjoint with: Date Start
property disjoint with: Subject Path
property disjoint with: Date End
property disjoint with: ISSN
sub property of: topDataProperty
property disjoint with: Issue Start
property disjoint with: Volume End
type: Thing
property disjoint with: Pages
property disjoint with: Volume
type: DatatypeProperty
definition: The :credit property specifies the photographer, illustrator, or copyright holder for an image in a publication.
property disjoint with: Is Issue Based
domain: Image
range: Literal

Blog
disjoint with: Section
disjoint with: Graph
disjoint with: External Contributor
definition: The :Blog class represents an informal serial publication.
type: Thing
disjoint with: Summary
disjoint with: Nothing
disjoint with: Image
disjoint with: Blog Post
subclass of: Serial
disjoint with: Journal
disjoint with: Dataset
disjoint with: Component
subclass of: Concept
subclass of: Thing
disjoint with: Contributor
disjoint with: Figure
disjoint with: Illustration
disjoint with: Document
subclass of: Publication
disjoint with: Issue
disjoint with: External Article
disjoint with: Article
disjoint with: KnowledgeBase
disjoint with: Abstract
type: Class
disjoint with: Collection

Item List
type: Thing
property disjoint with: Has Article Type
property disjoint with: Has Primary Article Type
property disjoint with: Has External Contributor
property disjoint with: Has Corresponding Contributor
property disjoint with: Has Image Asset
sub property of: topObjectProperty
property disjoint with: Has Abstract
property disjoint with: bottomObjectProperty
definition: The :itemList property specifies an ordered list of items.
property disjoint with: Has Summary Type
property disjoint with: Has Summary
property disjoint with: Has External Article
type: ObjectProperty
domain: Collection
range: List

Has PDF Asset
definition: The :hasPdfAsset property relates a publication to a pdf-asset.
type: Thing
sub property of: topObjectProperty
property disjoint with: bottomObjectProperty
type: ObjectProperty
domain: Publication
range: Pdf Asset

Is Asset Of
property disjoint with: bottomObjectProperty
inverse of: Has Asset
type: ObjectProperty
type: Thing
sub property of: topObjectProperty
definition: The :isAssetOf property relates an asset to the publication it represents.
domain: Asset
range: Publication

Item Type
definition: The :itemType property specifies the type of an item.
type: Thing
sub property of: topObjectProperty
property disjoint with: bottomObjectProperty
type: ObjectProperty
domain: Item

Item Reference List
type: Thing
property disjoint with: Has External Contributor
type: ObjectProperty
property disjoint with: Has Image Asset
property disjoint with: Has Abstract
definition: The :itemReferenceList property specifies an ordered list of item references.
property disjoint with: Has Primary Article Type
sub property of: topObjectProperty
property disjoint with: Has Summary Type
property disjoint with: Has Corresponding Contributor
property disjoint with: bottomObjectProperty
property disjoint with: Has Article Type
property disjoint with: Has Summary
property disjoint with: Has External Article
domain: Collection
range: List

Has Website
sub property of: hasSerialPublication
definition: The :hasWebsite property relates a publication to a website.
type: ObjectProperty
sub property of: topObjectProperty
type: Thing
property disjoint with: bottomObjectProperty
domain: Publication
range: Website

Binary Asset
type: Class
subclass of: Blob Asset
definition: The :BinaryAsset class represents the physical rendition of a generic binary object.
type: Thing
subclass of: Thing
disjoint with: Nothing
subclass of: Asset

Web Page
definition: The :webpage property relates a publication to a page on the web that describes it.
type: Thing
sub property of: topObjectProperty
property disjoint with: bottomObjectProperty
type: ObjectProperty
domain: Publication

ID
definition: The :id property provides a unique ID for a thing.
note: The :id value forms the local part of the full URI for an entity name.
type: Thing
property disjoint with: bottomDataProperty
sub property of: topDataProperty
type: DatatypeProperty
range: Literal

Caption
type: DatatypeProperty
property disjoint with: bottomDataProperty
property disjoint with: Issue End
property disjoint with: ISSN
definition: The :caption property specifies the caption of a figure or illustration as a string.
property disjoint with: Asset Folder Name
property disjoint with: Page End
sub property of: topDataProperty
property disjoint with: Issue
property disjoint with: Page Start
type: Thing
property disjoint with: Is Issue Based
property disjoint with: Date Start
property disjoint with: Volume Start
property disjoint with: Pages
property disjoint with: Subject Path
property disjoint with: Volume
property disjoint with: Issue Start
property disjoint with: Date End
property disjoint with: E-ISSN
property disjoint with: Volume End
domain: Image
range: Literal

Publication
subclass of: Thing
subclass of: Concept
type: Class
disjoint with: Nothing
type: Thing
definition: The :Publication class groups together all individuals (or part of) created as the result of the publishing process. Note that we are not referring here to the physical artefacts, but just their abstract counterparts.

Has Abstract
property disjoint with: Has Summary Type
definition: The :hasAbstract property relates an article to the abstract for an article.
type: ObjectProperty
property disjoint with: Has Collection
property disjoint with: Has Image Asset
property disjoint with: Has Blog
property disjoint with: Item Reference List
property disjoint with: Has Next Issue
property disjoint with: Has Serial
property disjoint with: Has Current Issue
property disjoint with: Has Journal
property disjoint with: Has External Article
property disjoint with: Item List
property disjoint with: bottomObjectProperty
property disjoint with: Has Issue
type: Thing
property disjoint with: Has Article
property disjoint with: Has Previous Issue
property disjoint with: Has Graph
sub property of: topObjectProperty
domain: Article
range: Abstract

Is Issue Based
property disjoint with: Publication Start Year
property disjoint with: Page End
property disjoint with: Sort Number
type: DatatypeProperty
property disjoint with: Credit
property disjoint with: Year
property disjoint with: Cover Date
property disjoint with: Publication Year
property disjoint with: Given Name
property disjoint with: bottomDataProperty
property disjoint with: Date
property disjoint with: Is Curated
property disjoint with: Code
sub property of: topDataProperty
property disjoint with: YearMonth
definition: The :isIssueBased property marks whether a journal publishes issues.
property disjoint with: Number
property disjoint with: Section Level
type: Thing
property disjoint with: Is Group
property disjoint with: DateTime
property disjoint with: Item Number
property disjoint with: Pages
property disjoint with: Family Name
property disjoint with: Is Corresponding
property disjoint with: Publication End YearMonth
property disjoint with: Page Start
property disjoint with: Caption
property disjoint with: Publication YearMonth
property disjoint with: Tree Depth
property disjoint with: Cover YearMonth
property disjoint with: Publication Date
property disjoint with: Caption (XML)
property disjoint with: Cover Year
property disjoint with: Name
property disjoint with: Publication Start YearMonth
property disjoint with: Publication DateTime
domain: Journal
range: boolean

Thing
definition: The :Thing class groups together all individuals used by Macmillan Science and Education within the NPG publishing world.
disjoint with: Nothing
subclass of: Thing
type: Class

Aggregation Event
subclass of: Event
type: Class
subclass of: Thing
definition: The :AggregationEvent class groups together all events related to the construction of a publication.
type: Thing
disjoint with: Nothing

Has Current Issue
property disjoint with: Has Contributor
property disjoint with: Has External Contributor
property disjoint with: Has Journal
property disjoint with: Has Figure
sub property of: topObjectProperty
property disjoint with: Has Image
property disjoint with: bottomObjectProperty
sub property of: Has Issue
property disjoint with: Has Serial
property disjoint with: Has Blog
property disjoint with: Has Illustration
property disjoint with: Has Abstract
type: Thing
property disjoint with: Has Section
property disjoint with: Has Article
property disjoint with: Has Summary
property disjoint with: Has External Article
type: ObjectProperty
definition: The :hasCurrentIssue property relates a publication to the current issue.
property disjoint with: Has Corresponding Contributor
domain: Publication
range: Issue

Filename
definition: The :filename property specifies the filename of an asset.
type: Thing
sub property of: topDataProperty
property disjoint with: bottomDataProperty
type: DatatypeProperty
domain: Asset
range: Literal

Other Code
definition: The :otherCode property specifies a number or string used by external applications as an ID for an entity.
type: Thing
sub property of: topDataProperty
property disjoint with: bottomDataProperty
type: DatatypeProperty
domain: Type
range: Literal

Review Event
disjoint with: Nothing
definition: The :ReviewEvent class models events related to the reviewing of a document (before its publication). In order to differentiate these events further, the :ReviewState vocabulary is used.
subclass of: E12 Production
subclass of: Thing
subclass of: Event
type: Class
type: Thing
subclass of: Publication Event

Has Summary
sub property of: topObjectProperty
property disjoint with: Has Journal
type: ObjectProperty
property disjoint with: Has Summary Type
definition: The :hasSummary property relates an article to an article summary.
property disjoint with: Has External Article
property disjoint with: Has Previous Issue
property disjoint with: Has Image Asset
type: Thing
property disjoint with: Item Reference List
property disjoint with: Has Serial
property disjoint with: Has Blog
property disjoint with: Has Current Issue
property disjoint with: bottomObjectProperty
property disjoint with: Has Article
property disjoint with: Item List
property disjoint with: Has Issue
property disjoint with: Has Collection
property disjoint with: Has Next Issue
property disjoint with: Has Graph
domain: Article
range: Summary

Hash
definition: The :hash property specifies a hash value over an entity URI used as a data integrity check.
type: Thing
sub property of: topDataProperty
property disjoint with: bottomDataProperty
type: DatatypeProperty
range: Literal

Concept
subclass of: Thing
type: Class
type: Thing
disjoint with: Nothing
definition: The :Concept class groups together all individuals which do not exist in the physical world (i.e. have no extension in spacetime).

Publication Start Year
property disjoint with: Is Publish Ready
property disjoint with: bottomDataProperty
property disjoint with: Number
property disjoint with: Publication DateTime
property disjoint with: Is Leaf
property disjoint with: Cover Date
property disjoint with: Publication End YearMonth
property disjoint with: Date
property disjoint with: Is Corresponding
property disjoint with: Publication Date
property disjoint with: Is Test Instance
property disjoint with: Is Group
property disjoint with: YearMonth
property disjoint with: Cover YearMonth
property disjoint with: Section Level
property disjoint with: Is PrimaryArticleType
property disjoint with: Tree Depth
property disjoint with: Publication Start YearMonth
property disjoint with: DateTime
definition: The :publicationEndYear property specifies the year date of a publication's end as a string. Note that this date relates to the publisher holdings which may not be the same as the actual publication end date.
property disjoint with: Is Event Workflow
property disjoint with: Is Issue Based
property disjoint with: Item Number
property disjoint with: Code
property disjoint with: Is Curated
property disjoint with: Sort Number
type: Thing
sub property of: topDataProperty
property disjoint with: Publication YearMonth
property disjoint with: Is Root
type: DatatypeProperty
domain: Publication
range: gYear

Article
stylesheet: prettify.css
uses vocabulary: schema.org
subclass of: Thing
disjoint with: Nothing
type: Class
subclass of: CreativeWork
type: Thing
stylesheet: schemaorg.css

Has Blog
sub property of: topObjectProperty
property disjoint with: Has Issue
property disjoint with: Has Collection
property disjoint with: Has Article
property disjoint with: Has Journal
property disjoint with: Has Contributor
property disjoint with: Has External Contributor
type: Thing
property disjoint with: Has Next Issue
property disjoint with: Has Current Issue
property disjoint with: Has Graph
sub property of: Has Serial
property disjoint with: Has Previous Issue
definition: The :hasBlog property relates a serial to a blog associated with it.
property disjoint with: bottomObjectProperty
type: ObjectProperty
property disjoint with: Has Summary
property disjoint with: Has Image
property disjoint with: Has Illustration
property disjoint with: Has Figure
property disjoint with: Has Corresponding Contributor
property disjoint with: Has Abstract
property disjoint with: Has Section
property disjoint with: Has External Article
range: Blog

Organization
type: Thing
subclass of: Thing
subclass of: Agent
definition: The :Organization class represents an organised body of people normally having a legal status.
disjoint with: Nothing
type: Class

Class
definition: The :class property specifies the class a domain model refers to.
type: Thing
type: AnnotationProperty

Has Article Type
definition: The :hasArticleType relates an article to an article-type.
property disjoint with: Item Reference List
property disjoint with: Has Summary Type
property disjoint with: Item List
type: ObjectProperty
type: Thing
sub property of: topObjectProperty
property disjoint with: bottomObjectProperty
property disjoint with: Has Image Asset
domain: Article
range: Article Type

Citation (XML)
type: DatatypeProperty
type: Thing
note: This is an alternative representation of the :citation property.
definition: The :citationXML property specifies the full citation of a publication as a single string containing XML for user presentation.
property disjoint with: bottomDataProperty
sub property of: topDataProperty
domain: Publication
range: Literal

Image
disjoint with: Graph
disjoint with: Issue
type: Thing
disjoint with: Serial
disjoint with: Dataset
disjoint with: Journal
disjoint with: KnowledgeBase
subclass of: Thing
disjoint with: Blog
disjoint with: Document
disjoint with: Blog Post
disjoint with: Nothing
definition: The :Image class represents a graphical element within a publication.
disjoint with: Collection
subclass of: Component
subclass of: Concept
type: Class
disjoint with: Article
subclass of: Publication
disjoint with: External Article

Body
definition: The :body property specifies the main body content of a publication as a string.
type: Thing
sub property of: topDataProperty
property disjoint with: bottomDataProperty
type: DatatypeProperty
domain: Publication
range: Literal

XML ID
definition: The :xmlId property specifies an ID assigned to an XML element.
type: Thing
sub property of: topDataProperty
property disjoint with: bottomDataProperty
type: DatatypeProperty
range: Literal

Has Publisher
definition: The :hasPublisher property relates a publication to the organization that publishes it.
type: Thing
sub property of: topObjectProperty
property disjoint with: bottomObjectProperty
type: ObjectProperty
domain: Publication
range: Publisher

Publication Start Year
property disjoint with: Publication Start YearMonth
property disjoint with: Is Group
sub property of: topDataProperty
property disjoint with: Is PrimaryArticleType
property disjoint with: Is Test Instance
property disjoint with: Is Root
property disjoint with: Sort Number
property disjoint with: Is Publish Ready
property disjoint with: Publication End YearMonth
property disjoint with: Is Corresponding
property disjoint with: Item Number
property disjoint with: Publication YearMonth
property disjoint with: Tree Depth
type: DatatypeProperty
property disjoint with: Is Event Workflow
property disjoint with: Cover Date
definition: The :publicationStartYear property specifies the year date of a publication's start as a string. Note that this date relates to the publisher holdings which may not be the same as the actual publication start date.
property disjoint with: bottomDataProperty
property disjoint with: Code
property disjoint with: Date
property disjoint with: Number
type: Thing
property disjoint with: DateTime
property disjoint with: Publication DateTime
property disjoint with: Publication Date
property disjoint with: Is Leaf
property disjoint with: Is Curated
property disjoint with: Is Issue Based
property disjoint with: YearMonth
property disjoint with: Section Level
property disjoint with: Cover YearMonth
domain: Publication
range: gYear

Subject
subclass of: Concept
definition: The :Subject class represents a topic, field of study or research area which can be used to categorise the contents of a publication. The instances of :Subject are organised hierarchically using the SKOS vocabulary.
subclass of: Type
subclass of: Thing
disjoint with: Nothing
type: Class
type: Thing

Section Level
definition: The :sectionLevel property specifies the level number of a section.
property disjoint with: Is Issue Based
property disjoint with: Year
property disjoint with: Is Corresponding
property disjoint with: Date
property disjoint with: Publication Start Year
property disjoint with: YearMonth
property disjoint with: Publication End YearMonth
property disjoint with: DateTime
property disjoint with: Is Group
property disjoint with: Date End
property disjoint with: Volume Start
property disjoint with: Cover Date
property disjoint with: Is Publish Ready
property disjoint with: bottomDataProperty
property disjoint with: Issue
property disjoint with: Page End
type: DatatypeProperty
property disjoint with: Date Start
sub property of: topDataProperty
property disjoint with: Cover Year
property disjoint with: E-ISSN
property disjoint with: Cover YearMonth
property disjoint with: Publication Year
property disjoint with: Publication DateTime
type: Thing
property disjoint with: Pages
property disjoint with: Asset Folder Name
property disjoint with: Volume
property disjoint with: Publication Start YearMonth
property disjoint with: Volume End
property disjoint with: Publication Date
property disjoint with: Is Leaf
property disjoint with: Issue End
property disjoint with: Subject Path
property disjoint with: Issue Start
property disjoint with: Is Test Instance
property disjoint with: Is PrimaryArticleType
property disjoint with: Is Root
property disjoint with: ISSN
property disjoint with: Is Curated
property disjoint with: Is Event Workflow
property disjoint with: Publication YearMonth
property disjoint with: Page Start
domain: Section
range: integer

Type
note: This property is used as a surrogate for the class name. There is a one-to-one relation between the class name and its associated graph, e.g. instances of the class :Subject are assigned to the subjects: graph.
definition: The :type property specifies the local name of the graph namespace used for instances of a class.
type: Thing
type: AnnotationProperty

Pages
property disjoint with: Is Corresponding
property disjoint with: Name
property disjoint with: Is Issue Based
property disjoint with: bottomDataProperty
definition: The :pages property specifies a page range numbering for a document.
property disjoint with: Date End
property disjoint with: Caption
property disjoint with: Asset Folder Name
property disjoint with: Credit
property disjoint with: Is Group
type: Thing
property disjoint with: Volume End
sub property of: topDataProperty
property disjoint with: Volume
property disjoint with: Date Start
property disjoint with: Given Name
property disjoint with: Issue End
property disjoint with: Issue Start
property disjoint with: Caption (XML)
property disjoint with: Family Name
type: DatatypeProperty
property disjoint with: Number
property disjoint with: ISSN
property disjoint with: E-ISSN
property disjoint with: Is Curated
property disjoint with: Issue
property disjoint with: Subject Path
property disjoint with: Section Level
property disjoint with: Volume Start
domain: Document
range: Literal

Is Group
property disjoint with: bottomDataProperty
property disjoint with: Pages
property disjoint with: Sort Number
property disjoint with: Date End
type: DatatypeProperty
property disjoint with: Cover YearMonth
property disjoint with: Publication Year
property disjoint with: DateTime
property disjoint with: Date
property disjoint with: Volume
property disjoint with: Item Number
property disjoint with: Publication YearMonth
property disjoint with: YearMonth
property disjoint with: Publication End YearMonth
property disjoint with: Number
property disjoint with: Year
property disjoint with: ISSN
property disjoint with: Section Level
property disjoint with: Volume End
property disjoint with: E-ISSN
property disjoint with: Cover Date
property disjoint with: Issue Start
property disjoint with: Publication DateTime
property disjoint with: Tree Depth
definition: The :isGroup property marks whether a contributor name refers to a collective agent, i.e. a group of people or an institution.
property disjoint with: Asset Folder Name
property disjoint with: Publication Date
property disjoint with: Issue End
property disjoint with: Publication Start Year
property disjoint with: Date Start
property disjoint with: Is Issue Based
property disjoint with: Cover Year
type: Thing
property disjoint with: Page Start
sub property of: topDataProperty
property disjoint with: Issue
property disjoint with: Subject Path
property disjoint with: Publication Start YearMonth
property disjoint with: Page End
property disjoint with: Code
property disjoint with: Volume Start
domain: Contributor
range: boolean

Contributor List
definition: The :contributorList property specifies an ordered list of contributors.
type: Thing
sub property of: topObjectProperty
property disjoint with: bottomObjectProperty
type: ObjectProperty
domain: Publication
range: List

Status
definition: The :status property specifies a status string for an ontology term.
type: Thing
sub property of: topDataProperty
property disjoint with: bottomDataProperty
type: DatatypeProperty
range: Literal

Dataset
subclass of: Publication
disjoint with: Abstract
disjoint with: Component
disjoint with: Image
type: Thing
disjoint with: Nothing
disjoint with: Blog
disjoint with: Illustration
subclass of: Thing
disjoint with: Summary
disjoint with: Section
note: We are currently using this class for RDF datasets.
type: Class
disjoint with: Serial
disjoint with: External Contributor
subclass of: Concept
disjoint with: Journal
disjoint with: Contributor
disjoint with: Figure
definition: The :Dataset class represents a collection of related sets of information modelled in a known way and stored in a computer system.

Has Review State
definition: The :hasReviewState property relates a review-event to a review-state that describes some recognized change in the status of a publication's review history.
type: Thing
sub property of: topObjectProperty
property disjoint with: bottomObjectProperty
type: ObjectProperty
domain: Review Event
range: Review State

Cover Date
property disjoint with: DateTime
property disjoint with: Number
type: DatatypeProperty
definition: The :coverDate property specifies the full date of a publication as it is displayed on its cover.
property disjoint with: Is Leaf
property disjoint with: Item Number
property disjoint with: Code
property disjoint with: Publication End YearMonth
property disjoint with: Is Curated
property disjoint with: Cover YearMonth
note: This is not necessarily the actual date of publication.
type: Thing
property disjoint with: Publication YearMonth
property disjoint with: Publication Year
property disjoint with: Publication Start Year
property disjoint with: Publication DateTime
property disjoint with: Sort Number
property disjoint with: Is Issue Based
property disjoint with: Section Level
property disjoint with: Cover Year
property disjoint with: Is Event Workflow
property disjoint with: Is Test Instance
property disjoint with: bottomDataProperty
property disjoint with: Is Publish Ready
property disjoint with: Publication Start YearMonth
property disjoint with: Tree Depth
property disjoint with: YearMonth
property disjoint with: Is Group
sub property of: topDataProperty
property disjoint with: Is Corresponding
property disjoint with: Is PrimaryArticleType
property disjoint with: Is Root
property disjoint with: Year
domain: Publication
range: date

Collection
disjoint with: Journal
subclass of: Document
disjoint with: Blog
disjoint with: Image
subclass of: Thing
disjoint with: Article
type: Class
definition: The :Collection class represents a group of documents which are published (or republished) as part of a new composite publication. Often these documents have been published elsewhere, but since they share a common theme or belong to an identifiable narrative it is of interest to publish them again within a different container. (See also :Issue.)
disjoint with: Figure
disjoint with: Component
subclass of: Concept
disjoint with: Contributor
type: Thing
disjoint with: Summary
disjoint with: Abstract
disjoint with: External Contributor
subclass of: Publication
disjoint with: Illustration
disjoint with: Serial
disjoint with: Section
disjoint with: Nothing
disjoint with: External Article

Graph
definition: The :graph property specifies the full URI of any graph.
type: Thing
type: AnnotationProperty

Is Publish Ready
property disjoint with: Publication Year
property disjoint with: Sort Number
definition: The :isPublishReady property marks whether a type is ready for publishing.
property disjoint with: bottomDataProperty
property disjoint with: Cover Date
property disjoint with: Publication DateTime
property disjoint with: Publication Date
property disjoint with: Publication YearMonth
property disjoint with: YearMonth
property disjoint with: Section Level
property disjoint with: DateTime
property disjoint with: Date
property disjoint with: Code
sub property of: topDataProperty
property disjoint with: Publication End YearMonth
property disjoint with: Item Number
property disjoint with: Cover Year
property disjoint with: Cover YearMonth
property disjoint with: Year
property disjoint with: Number
type: Thing
property disjoint with: Publication Start Year
type: DatatypeProperty
property disjoint with: Tree Depth
property disjoint with: Publication Start YearMonth
domain: Type
range: boolean

Is Repeatable
definition: The :isRepeatable property marks whether a property can be repeated.
type: Thing
type: AnnotationProperty

Blog Post
subclass of: Document
subclass of: Publication
disjoint with: Summary
disjoint with: Serial
type: Thing
subclass of: Thing
disjoint with: Illustration
disjoint with: Image
disjoint with: Component
disjoint with: Journal
definition: The :BlogPost class represents an informal work published as an item of a :Blog.
subclass of: Concept
disjoint with: Contributor
disjoint with: External Contributor
disjoint with: Blog
type: Class
disjoint with: Figure
disjoint with: Abstract
disjoint with: Nothing
disjoint with: Section

Document
disjoint with: Abstract
type: Thing
disjoint with: Image
disjoint with: Blog
definition: The :Document class groups together all publications which were created to be distributed and consumed as individual, self-contained entities.
disjoint with: Illustration
disjoint with: External Contributor
disjoint with: Contributor
subclass of: Thing
disjoint with: Section
subclass of: Publication
disjoint with: Journal
disjoint with: Serial
disjoint with: Summary
disjoint with: Nothing
type: Class
disjoint with: Figure
subclass of: Concept
disjoint with: Component

Event
definition: The :Event class groups together events of varying granularity. Events differ from :Concept entities because they have an extension in time; they differ from :Asset entities because they do not have an extension in space.
type: Thing
subclass of: Thing
type: Class
disjoint with: Nothing

Page End
property disjoint with: Is Curated
property disjoint with: Subject Path
property disjoint with: Date End
property disjoint with: Volume
property disjoint with: Given Name
property disjoint with: Volume End
property disjoint with: Volume Start
type: Thing
property disjoint with: Is Group
property disjoint with: Section Level
property disjoint with: E-ISSN
type: DatatypeProperty
property disjoint with: Issue End
property disjoint with: Name
property disjoint with: Caption
property disjoint with: ISSN
property disjoint with: Issue Start
sub property of: topDataProperty
property disjoint with: Family Name
property disjoint with: Credit
property disjoint with: Is Corresponding
property disjoint with: Date Start
property disjoint with: Number
property disjoint with: Asset Folder Name
property disjoint with: bottomDataProperty
property disjoint with: Issue
property disjoint with: Caption (XML)
definition: The :pageEnd property specifies an ending page number for a document.
property disjoint with: Is Issue Based
domain: Document
range: Literal

Is Test Instance
property disjoint with: Publication Start YearMonth
property disjoint with: Year
property disjoint with: Cover Year
property disjoint with: Tree Depth
type: Thing
property disjoint with: Publication DateTime
type: DatatypeProperty
property disjoint with: Item Number
definition: The :isTestInstance property marks whether a resource is to be used for test purposes only.
sub property of: topDataProperty
property disjoint with: DateTime
property disjoint with: Publication Start Year
property disjoint with: Cover Date
property disjoint with: Section Level
property disjoint with: Number
property disjoint with: Publication Year
property disjoint with: Sort Number
property disjoint with: Publication End YearMonth
property disjoint with: Date
property disjoint with: Publication Date
property disjoint with: Cover YearMonth
property disjoint with: YearMonth
property disjoint with: bottomDataProperty
property disjoint with: Publication YearMonth
property disjoint with: Code
range: boolean

Date End
property disjoint with: bottomDataProperty
property disjoint with: Number
definition: The :dateEnd property specifies the end date for a serial publication. Note that this date relates to the publisher holdings which may not be the same as the actual publication end date.
sub property of: topDataProperty
property disjoint with: Pages
type: Thing
property disjoint with: Family Name
property disjoint with: Given Name
property disjoint with: Is Corresponding
property disjoint with: Section Level
type: DatatypeProperty
property disjoint with: Is Curated
property disjoint with: Caption (XML)
property disjoint with: Page Start
property disjoint with: Page End
property disjoint with: Name
property disjoint with: Credit
property disjoint with: Is Group
property disjoint with: Caption
domain: Serial
range: Literal

Has Previous Issue
property disjoint with: Has Article
property disjoint with: Has Corresponding Contributor
property disjoint with: Has Blog
property disjoint with: Has Section
property disjoint with: bottomObjectProperty
property disjoint with: Has Contributor
property disjoint with: Has Abstract
property disjoint with: Has Serial
property disjoint with: Has Figure
property disjoint with: Has Image
property disjoint with: Has Illustration
property disjoint with: Has Journal
definition: The :hasPreviousIssue property relates a publication to the previous issue.
sub property of: Has Issue
property disjoint with: Has External Contributor
property disjoint with: Has External Article
sub property of: topObjectProperty
property disjoint with: Has Summary
type: ObjectProperty
type: Thing
domain: Publication
range: Issue

Has Issue
sub property of: topObjectProperty
property disjoint with: Has Article
property disjoint with: Has Journal
type: Thing
property disjoint with: Has Serial
property disjoint with: bottomObjectProperty
type: ObjectProperty
property disjoint with: Has Contributor
property disjoint with: Has External Contributor
property disjoint with: Has Section
property disjoint with: Has Figure
property disjoint with: Has Summary
property disjoint with: Has Blog
property disjoint with: Has Corresponding Contributor
property disjoint with: Has Abstract
definition: The :hasIssue property relates a publication-event to an issue.
property disjoint with: Has Image
property disjoint with: Has Illustration
property disjoint with: Has External Article
domain: Publication Event
range: Issue

Xml Asset
disjoint with: Nothing
subclass of: Thing
subclass of: Asset
definition: The :XmlAsset class represents the physical rendition of a document asset in XML format.
type: Class
type: Thing

Has Serial
definition: The :hasSerial property relates a publication to a serial.
property disjoint with: Has Section
property disjoint with: Has Previous Issue
property disjoint with: Has Current Issue
property disjoint with: Has Image
property disjoint with: Has Corresponding Contributor
type: Thing
property disjoint with: Has Summary
property disjoint with: Has Contributor
property disjoint with: Has External Article
property disjoint with: Has Abstract
property disjoint with: Has External Contributor
property disjoint with: Has Issue
sub property of: topObjectProperty
property disjoint with: Has Illustration
property disjoint with: Has Next Issue
property disjoint with: Has Article
property disjoint with: bottomObjectProperty
property disjoint with: Has Collection
property disjoint with: Has Graph
property disjoint with: Has Figure
type: ObjectProperty
domain: Publication
range: Serial

Graph
subclass of: Thing
disjoint with: Section
disjoint with: Serial
disjoint with: Blog
disjoint with: Abstract
type: Class
disjoint with: KnowledgeBase
disjoint with: Summary
disjoint with: Illustration
disjoint with: Image
subclass of: Dataset
subclass of: Concept
disjoint with: Component
subclass of: Publication
disjoint with: Journal
disjoint with: Contributor
note: Each Graph instance is associated with instances of a particular class. For example, the 'npgg:articles' :Graph instance is a named graph which contains all the instances of the :Article class. The :Graph instances themselves are then used to describe the RDF graph, providing sometimes known as an RDF annotation. This may furnish various kinds of information about the RDF graph: provenance, rights, metrics, validation reports, etc.
type: Thing
disjoint with: Figure
disjoint with: External Contributor
definition: The :Graph class represents a collection of related sets of information modelled in RDF and organized as a named graph.
disjoint with: Nothing

Has Asset
type: Thing
property disjoint with: bottomObjectProperty
inverse of: Is Asset Of
definition: The :hasAsset property relates a publication to an asset.
type: ObjectProperty
sub property of: topObjectProperty
domain: Publication
range: Asset

Datetime
definition: The :datetime property specifies a system-generated datetime for an entity.
type: Thing
type: AnnotationProperty

Body (XML)
definition: The :bodyXml property specifies the main body content of a publication as an XML string.
type: Thing
sub property of: topDataProperty
property disjoint with: bottomDataProperty
type: DatatypeProperty
domain: Publication
range: Literal

Journal
disjoint with: Component
disjoint with: Issue
disjoint with: Dataset
type: Thing
disjoint with: Blog
subclass of: Serial
disjoint with: External Contributor
disjoint with: Image
disjoint with: Collection
subclass of: Thing
disjoint with: Contributor
disjoint with: KnowledgeBase
disjoint with: Figure
subclass of: Concept
disjoint with: Abstract
disjoint with: Illustration
disjoint with: External Article
disjoint with: Document
subclass of: Publication
disjoint with: Blog Post
disjoint with: Nothing
definition: The :Journal class represents a scholarly serial publication, considered from both the scholarly and the commercial perspectives. Thus a journal is more than the sum of its publications (i.e. the set of all the :Issue instances it has published); it is an entity characterised by many properties, e.g. its founders, its impact factor, etc.
disjoint with: Section
disjoint with: Article
disjoint with: Summary
disjoint with: Graph
type: Class

Code
property disjoint with: Publication Date
property disjoint with: Cover Year
property disjoint with: Publication End YearMonth
property disjoint with: Is Curated
note: This property is used by the doamin ontologies for managing terms.
property disjoint with: YearMonth
property disjoint with: Cover YearMonth
property disjoint with: Is Root
property disjoint with: Is Publish Ready
property disjoint with: Is Group
property disjoint with: Publication YearMonth
property disjoint with: Is Test Instance
sub property of: topDataProperty
property disjoint with: bottomDataProperty
property disjoint with: Is Corresponding
type: Thing
property disjoint with: Publication Start YearMonth
property disjoint with: Publication Start Year
property disjoint with: Cover Date
definition: The :code property specifies an integer number representing an internal ID for an object.
property disjoint with: DateTime
property disjoint with: Is Leaf
property disjoint with: Is PrimaryArticleType
property disjoint with: Publication DateTime
property disjoint with: Date
property disjoint with: Year
property disjoint with: Is Issue Based
type: DatatypeProperty
property disjoint with: Publication Year
property disjoint with: Is Event Workflow
domain: Type
range: integer

Figure
subclass of: Component
type: Class
disjoint with: Blog Post
disjoint with: Issue
disjoint with: Blog
disjoint with: External Article
disjoint with: Collection
definition: The :Figure class represents a numbered and captioned image within a publication. This image typically results as a direct outcome of the work described in the publication.
disjoint with: Illustration
subclass of: Thing
subclass of: Concept
disjoint with: KnowledgeBase
disjoint with: Serial
subclass of: Publication
disjoint with: Article
disjoint with: Journal
disjoint with: Nothing
subclass of: Image
disjoint with: Dataset
type: Thing
disjoint with: Graph
disjoint with: Document

Sort Number
property disjoint with: Is Publish Ready
property disjoint with: Publication End YearMonth
property disjoint with: Date
property disjoint with: Is Corresponding
property disjoint with: Publication Start YearMonth
property disjoint with: Is Curated
property disjoint with: Is Test Instance
property disjoint with: Publication Start Year
definition: The :sortLetter property specifies the sequence number of an entity to facilitate sort operations.
property disjoint with: Is Group
property disjoint with: DateTime
property disjoint with: Is Leaf
property disjoint with: YearMonth
property disjoint with: bottomDataProperty
property disjoint with: Cover Date
property disjoint with: Publication Date
property disjoint with: Publication Year
property disjoint with: Is Issue Based
property disjoint with: Cover YearMonth
property disjoint with: Publication DateTime
sub property of: topDataProperty
property disjoint with: Is PrimaryArticleType
property disjoint with: Year
property disjoint with: Is Root
property disjoint with: Publication YearMonth
type: Thing
property disjoint with: Cover Year
property disjoint with: Is Event Workflow
type: DatatypeProperty
domain: Type
range: integer

Article
disjoint with: Illustration
disjoint with: Image
subclass of: Thing
disjoint with: Serial
disjoint with: Section
disjoint with: Blog
definition: The :Article class represents a scholarly work normally published as an item of a serial publication. In particular, this concept refers to the abstract notion of an article, rather than any of its realisations after it becomes embodied via a physical medium.
disjoint with: Component
disjoint with: Nothing
subclass of: Document
disjoint with: Summary
type: Class
disjoint with: Collection
disjoint with: Issue
disjoint with: Abstract
disjoint with: Journal
type: Thing
disjoint with: Contributor
subclass of: Concept
subclass of: Publication
disjoint with: Figure
note: With reference to the FRBR model [http://www.ifla.org/publications/functional-requirements-for-bibliographic-records], an :Article can be mapped directly to the frbr:Expression concept. It is worth noting though that within the NPG core ontology we do not have any notion of a frbr:Work. Hence multiple versions of the same article (e.g. language translations, or revisions) are characterised as such simply by means of some relationship.
disjoint with: External Contributor

KnowledgeBase
disjoint with: Summary
definition: The :KnowledgeBase class represents a collection of related sets of information modelled in RDF and consisting of various objects, e.g. one or more graphs, other RDF datasets etc.
disjoint with: Contributor
disjoint with: Section
subclass of: Concept
disjoint with: Image
type: Class
disjoint with: Figure
disjoint with: Component
disjoint with: Blog
disjoint with: External Contributor
disjoint with: Journal
type: Thing
disjoint with: Serial
note: Differently from datasets, knowledge-bases refer to a composite dataset intended to be used as a consistent whole.
disjoint with: Graph
subclass of: Thing
subclass of: Dataset
disjoint with: Abstract
disjoint with: Nothing
disjoint with: Illustration
subclass of: Publication

Is Corresponding
property disjoint with: Volume
property disjoint with: Is Issue Based
property disjoint with: Publication Date
property disjoint with: Tree Depth
property disjoint with: Volume End
property disjoint with: bottomDataProperty
property disjoint with: Item Number
property disjoint with: ISSN
property disjoint with: Number
property disjoint with: Date
property disjoint with: Subject Path
property disjoint with: Cover Date
property disjoint with: E-ISSN
definition: The :isCorresponding property marks whether a contributor is a corresponding author.
property disjoint with: Publication Start Year
property disjoint with: Cover Year
property disjoint with: Page Start
property disjoint with: Date End
property disjoint with: Volume Start
property disjoint with: Publication Start YearMonth
property disjoint with: Publication YearMonth
property disjoint with: Issue Start
property disjoint with: YearMonth
property disjoint with: Sort Number
type: Thing
property disjoint with: Asset Folder Name
property disjoint with: Pages
property disjoint with: Issue End
property disjoint with: Cover YearMonth
property disjoint with: Year
property disjoint with: Publication Year
property disjoint with: Page End
property disjoint with: Publication DateTime
property disjoint with: Issue
sub property of: topDataProperty
property disjoint with: Publication End YearMonth
property disjoint with: DateTime
type: DatatypeProperty
property disjoint with: Section Level
property disjoint with: Code
property disjoint with: Date Start
domain: Contributor
range: boolean

Article Type
subclass of: Type
definition: The :ArticleType class represents the various kinds of publication which can be used to index and group content published by Macmillan Science and Education. The instances of :ArticleType are organised hierarchically using the SKOS vocabulary.
type: Thing
subclass of: Thing
type: Class
subclass of: Concept
disjoint with: Nothing

Relation
definition: The :relation property relates a publication to a publication.
type: Thing
sub property of: topObjectProperty
property disjoint with: bottomObjectProperty
type: ObjectProperty
domain: Publication
range: Publication

ORCID
sub property of: topObjectProperty
property disjoint with: bottomObjectProperty
note: As we currently have no persons as such registered in our data model, we use the :orcid property with the :Contributor publication component that proxies for a person.
type: Thing
type: ObjectProperty
definition: The :orcid property relates a publication to an ORCID record.
domain: Publication

Image Asset
type: Class
subclass of: Asset
disjoint with: Nothing
definition: The :ImageAsset class represents the physical rendition of an image asset in an encoded format.
type: Thing
subclass of: Thing
subclass of: Blob Asset

Is PrimaryArticleType
property disjoint with: Number
property disjoint with: Publication End YearMonth
property disjoint with: Cover Date
property disjoint with: Publication Start Year
property disjoint with: Section Level
property disjoint with: Code
property disjoint with: Publication DateTime
property disjoint with: Publication Year
type: Thing
property disjoint with: Publication YearMonth
property disjoint with: YearMonth
type: DatatypeProperty
property disjoint with: Date
property disjoint with: Tree Depth
property disjoint with: Publication Start YearMonth
property disjoint with: bottomDataProperty
property disjoint with: Item Number
property disjoint with: Sort Number
sub property of: topDataProperty
property disjoint with: Cover YearMonth
property disjoint with: Year
definition: The :isPrimaryArticleType property marks whether an article-type can be used for grouping purposes.
property disjoint with: Publication Date
property disjoint with: Cover Year
property disjoint with: DateTime
domain: Article Type
range: boolean

Has Corresponding Contributor
sub property of: Has Contributor
property disjoint with: Has Collection
property disjoint with: Has Next Issue
property disjoint with: Has External Article
property disjoint with: Has Summary Type
property disjoint with: Has Serial
property disjoint with: Has Image Asset
property disjoint with: Item List
definition: The :hasCorrespondingContributor property relates an article to the name of its corresponding author.
property disjoint with: bottomObjectProperty
property disjoint with: Has Blog
property disjoint with: Has Issue
property disjoint with: Has Current Issue
property disjoint with: Has Article
property disjoint with: Has Journal
type: ObjectProperty
property disjoint with: Has Previous Issue
sub property of: topObjectProperty
type: Thing
property disjoint with: Item Reference List
property disjoint with: Has Graph
domain: Article
range: Contributor

ISSN
sub property of: topDataProperty
property disjoint with: bottomDataProperty
property disjoint with: Caption
property disjoint with: Pages
definition: The :issn property specifies an ISSN number for a serial.
property disjoint with: Is Curated
type: DatatypeProperty
property disjoint with: Credit
property disjoint with: Page Start
property disjoint with: Page End
property disjoint with: Number
property disjoint with: Caption (XML)
property disjoint with: Section Level
type: Thing
property disjoint with: Name
property disjoint with: Is Corresponding
property disjoint with: Is Group
property disjoint with: Family Name
property disjoint with: Given Name
domain: Serial
range: Literal

Has Image Asset
property disjoint with: Has Summary
property disjoint with: Has Corresponding Contributor
property disjoint with: Has Abstract
type: ObjectProperty
property disjoint with: bottomObjectProperty
property disjoint with: Has Primary Article Type
property disjoint with: Item Reference List
property disjoint with: Has External Contributor
definition: The :hasImageAsset property relates an image to an image-asset.
property disjoint with: Item List
sub property of: topObjectProperty
property disjoint with: Has Contributor
type: Thing
property disjoint with: Has Article Type
property disjoint with: Has External Article
domain: Image
range: Image Asset

Subject Path
property disjoint with: Number
sub property of: topDataProperty
property disjoint with: Is Corresponding
property disjoint with: Given Name
property disjoint with: Page Start
definition: The :subjectPath property specifies the position of a term within the subjects taxonomy by providing a path with the IDs of its successors.
property disjoint with: Page End
property disjoint with: Section Level
property disjoint with: Is Curated
property disjoint with: Caption (XML)
type: DatatypeProperty
type: Thing
property disjoint with: Credit
property disjoint with: Pages
property disjoint with: Is Group
property disjoint with: bottomDataProperty
property disjoint with: Family Name
property disjoint with: Name
property disjoint with: Caption
domain: Journal
range: Literal

YearMonth
property disjoint with: Number
property disjoint with: Is Leaf
property disjoint with: Publication Start Year
property disjoint with: Tree Depth
sub property of: topDataProperty
property disjoint with: Sort Number
property disjoint with: Code
property disjoint with: Section Level
property disjoint with: Year
property disjoint with: Cover Date
property disjoint with: Date
type: DatatypeProperty
property disjoint with: Is PrimaryArticleType
property disjoint with: Is Group
definition: The :date property specifies the year and month date of an event as a string.
property disjoint with: Publication DateTime
property disjoint with: Is Root
property disjoint with: Is Test Instance
property disjoint with: Is Curated
property disjoint with: bottomDataProperty
property disjoint with: Publication Date
type: Thing
property disjoint with: DateTime
property disjoint with: Is Publish Ready
property disjoint with: Cover Year
property disjoint with: Is Corresponding
property disjoint with: Item Number
property disjoint with: Publication Year
property disjoint with: Is Event Workflow
property disjoint with: Is Issue Based
domain: Event
range: gYearMonth

Figure List
definition: The :figureList property specifies an ordered list of figures for a publication.
type: Thing
sub property of: topObjectProperty
property disjoint with: bottomObjectProperty
type: ObjectProperty
domain: Publication
range: List

Title (XML)
definition: The :titleXml property specifies a title to the main body content of a publication as an XML string.
type: Thing
sub property of: topDataProperty
property disjoint with: bottomDataProperty
type: DatatypeProperty
domain: Publication
range: Literal

Review State
subclass of: Thing
disjoint with: Nothing
type: Thing
subclass of: Concept
definition: The :ReviewState class provides a categorisation of the possible states a document may have as a result of a reviewing process. For example, whether it’s been 'Received' or 'Accepted'. This categorisation is implemented as a SKOS vocabulary.
subclass of: Publication State
subclass of: Type
type: Class

Has Contributor
definition: The :hasContributor property relates a publication to a string containing the name of one of the authors of that publication.
sub property of: topObjectProperty
property disjoint with: Has Journal
property disjoint with: Has Summary Type
type: Thing
property disjoint with: Has Article
property disjoint with: bottomObjectProperty
property disjoint with: Has Issue
property disjoint with: Has Image Asset
property disjoint with: Has Collection
property disjoint with: Has External Article
type: ObjectProperty
property disjoint with: Has Previous Issue
property disjoint with: Has Next Issue
property disjoint with: Has Current Issue
property disjoint with: Has Serial
property disjoint with: Has Graph
note: Normally, the contributor name is a non-disambiguated person name, meaning that several contributor instances may refer to the same person.
property disjoint with: Has Blog
domain: Document
range: Contributor

Test
definition: The :test property specifies a general string test property.
type: Thing
sub property of: topDataProperty
property disjoint with: bottomDataProperty
type: DatatypeProperty

Year
property disjoint with: Is Curated
property disjoint with: Publication End YearMonth
type: DatatypeProperty
property disjoint with: Number
property disjoint with: Date
type: Thing
property disjoint with: Is PrimaryArticleType
property disjoint with: Is Publish Ready
property disjoint with: Item Number
property disjoint with: Publication YearMonth
property disjoint with: Cover Date
property disjoint with: Publication Date
property disjoint with: Is Corresponding
property disjoint with: Tree Depth
sub property of: topDataProperty
property disjoint with: Is Group
property disjoint with: Is Event Workflow
definition: The :date property specifies the year date of an event as a string.
property disjoint with: Is Test Instance
property disjoint with: DateTime
property disjoint with: Publication Start YearMonth
property disjoint with: Sort Number
property disjoint with: Publication DateTime
property disjoint with: bottomDataProperty
property disjoint with: Code
property disjoint with: Cover YearMonth
property disjoint with: Is Root
property disjoint with: Is Issue Based
property disjoint with: Section Level
property disjoint with: YearMonth
property disjoint with: Is Leaf
domain: Event
range: gYear

Has Collection
definition: The :hasCollection property relates a publication-event to a collection.
property disjoint with: Has Serial
property disjoint with: Has Journal
property disjoint with: Has Blog
property disjoint with: bottomObjectProperty
sub property of: topObjectProperty
property disjoint with: Has Corresponding Contributor
type: ObjectProperty
property disjoint with: Has Illustration
property disjoint with: Has Image
property disjoint with: Has External Contributor
property disjoint with: Has Summary
property disjoint with: Has Abstract
property disjoint with: Has External Article
property disjoint with: Has Section
property disjoint with: Has Article
type: Thing
property disjoint with: Has Figure
property disjoint with: Has Contributor
domain: Publication Event
range: Collection

Name
property disjoint with: Issue
type: DatatypeProperty
property disjoint with: Volume
property disjoint with: Asset Folder Name
property disjoint with: Issue Start
property disjoint with: Date End
property disjoint with: Is Issue Based
property disjoint with: Pages
property disjoint with: Subject Path
property disjoint with: Date Start
sub property of: topDataProperty
property disjoint with: Issue End
type: Thing
property disjoint with: Page End
property disjoint with: Volume End
property disjoint with: E-ISSN
property disjoint with: Volume Start
property disjoint with: ISSN
property disjoint with: Page Start
property disjoint with: bottomDataProperty
definition: The :name property specifies the full name for a thing.
domain: Contributor
range: Literal

MeSH
definition: The :mesh property relates a concept to a Medical Subject Heading (MeSH) term as a resource.
type: Thing
sub property of: topObjectProperty
property disjoint with: bottomObjectProperty
type: ObjectProperty
domain: Concept

Is Root
property disjoint with: YearMonth
property disjoint with: Publication DateTime
property disjoint with: Tree Depth
property disjoint with: Publication Date
sub property of: topDataProperty
property disjoint with: bottomDataProperty
property disjoint with: Date
property disjoint with: Publication Start YearMonth
type: Thing
property disjoint with: Cover Year
property disjoint with: Cover Date
property disjoint with: Section Level
property disjoint with: Publication Start Year
type: DatatypeProperty
property disjoint with: Publication YearMonth
property disjoint with: Cover YearMonth
definition: The :isRoot property marks whether a SKOS concept is a SKOS top concept.
property disjoint with: Publication Year
property disjoint with: Number
property disjoint with: Year
property disjoint with: Publication End YearMonth
property disjoint with: DateTime
property disjoint with: Item Number
property disjoint with: Sort Number
property disjoint with: Code
domain: Type
range: boolean

Namespace
definition: The :namespace property provides the RDF namespace used in creating instances of a class.
type: Thing
sub property of: topObjectProperty
property disjoint with: bottomObjectProperty
type: ObjectProperty
domain: Class

DOI Link
definition: The :doiLink property relates a publication to the URI minted from the DOI.
type: Thing
sub property of: topObjectProperty
property disjoint with: bottomObjectProperty
type: ObjectProperty
domain: Publication

Page Start
definition: The :pageStart property specifies a starting page number for a document.
property disjoint with: Given Name
property disjoint with: E-ISSN
property disjoint with: Is Issue Based
property disjoint with: Is Corresponding
property disjoint with: Asset Folder Name
property disjoint with: Caption (XML)
property disjoint with: bottomDataProperty
property disjoint with: Name
property disjoint with: Subject Path
sub property of: topDataProperty
property disjoint with: Section Level
property disjoint with: Volume Start
property disjoint with: Issue
property disjoint with: Caption
property disjoint with: Volume
property disjoint with: Credit
property disjoint with: Family Name
property disjoint with: Date End
property disjoint with: Issue Start
property disjoint with: Is Group
property disjoint with: Issue End
property disjoint with: Is Curated
type: DatatypeProperty
type: Thing
property disjoint with: Date Start
property disjoint with: Number
property disjoint with: ISSN
property disjoint with: Volume End
domain: Document
range: Literal

Asset Version
definition: The :assetVersion property specifies the version of an :Asset associated with a :PublishEvent.
type: Thing
sub property of: topDataProperty
property disjoint with: bottomDataProperty
type: DatatypeProperty
domain: Asset
range: Literal

Website
subclass of: Thing
subclass of: Publication
type: Thing
type: Class
definition: The :Website class represents a site that maintains one or more pages on the Web.
disjoint with: Nothing
subclass of: Concept

Publication Event
subclass of: Thing
type: Class
disjoint with: Nothing
subclass of: Event
definition: The :PublicationEvent class groups together events that happen within the publishing process, broadly conceived. For example, the submission of an article, or the acceptance of a paper.
type: Thing
subclass of: E12 Production

External Article
disjoint with: Serial
disjoint with: Journal
disjoint with: Collection
disjoint with: Component
subclass of: Concept
subclass of: Publication
disjoint with: Issue
disjoint with: Summary
definition: The :ExternalArticle class represents an article which is externally published.
type: Class
subclass of: Thing
subclass of: Article
disjoint with: Image
note: The :ExternalArticle class subclasses the :Article class.
type: Thing
disjoint with: Nothing
disjoint with: External Contributor
disjoint with: Abstract
disjoint with: Figure
disjoint with: Blog
disjoint with: Section
subclass of: Document
disjoint with: Contributor
disjoint with: Illustration

Replaces
property disjoint with: bottomObjectProperty
type: Thing
definition: The :replaces property relates a publication to another publication that it replaces.
inverse of: Replaced By
type: ObjectProperty
sub property of: topObjectProperty
domain: Publication
range: Publication

Has Root
definition: The :hasRoot property relates a :Type instance to a toplevel :Type instance within the same domain model.
type: Thing
sub property of: topObjectProperty
property disjoint with: bottomObjectProperty
type: ObjectProperty
domain: Type
range: Type

Citation
definition: The :citation property specifies the full citation of a publication as a single string for reference purposes.
type: Thing
sub property of: topDataProperty
property disjoint with: bottomDataProperty
type: DatatypeProperty
domain: Publication
range: Literal

Has Journal
sub property of: topObjectProperty
property disjoint with: Has Previous Issue
property disjoint with: Has External Contributor
property disjoint with: Has Contributor
property disjoint with: Has Abstract
property disjoint with: Has Issue
sub property of: Has Serial
property disjoint with: Has Summary
property disjoint with: Has External Article
type: Thing
definition: The :hasJournal property relates a publication to a journal.
property disjoint with: Has Graph
type: ObjectProperty
property disjoint with: Has Collection
property disjoint with: Has Current Issue
property disjoint with: Has Figure
property disjoint with: Has Image
property disjoint with: Has Article
property disjoint with: Has Corresponding Contributor
property disjoint with: Has Blog
property disjoint with: Has Illustration
property disjoint with: Has Section
property disjoint with: bottomObjectProperty
property disjoint with: Has Next Issue
range: Journal

Item Number
property disjoint with: Is Event Workflow
property disjoint with: Publication Date
property disjoint with: Is Test Instance
property disjoint with: Is Corresponding
type: DatatypeProperty
property disjoint with: Is Issue Based
type: Thing
property disjoint with: Cover Year
definition: The :itemNumber property specifies the number of an item within a collection.
property disjoint with: Publication YearMonth
sub property of: topDataProperty
property disjoint with: Cover Date
property disjoint with: Is Root
property disjoint with: Publication DateTime
property disjoint with: Publication Start Year
property disjoint with: Publication Year
property disjoint with: bottomDataProperty
property disjoint with: Date
property disjoint with: Is PrimaryArticleType
property disjoint with: YearMonth
property disjoint with: Publication End YearMonth
property disjoint with: Is Curated
property disjoint with: Is Publish Ready
property disjoint with: DateTime
property disjoint with: Publication Start YearMonth
property disjoint with: Is Leaf
property disjoint with: Is Group
property disjoint with: Cover YearMonth
property disjoint with: Year
domain: Item
range: integer

Agent
definition: The :Agent class groups together all entities that can be the subject of an action. These can be single persons (:Person), or groups of people organised as a legal entity (:Organization).
disjoint with: Nothing
subclass of: Thing
type: Thing
type: Class

E-ISSN
property disjoint with: Page Start
property disjoint with: Is Curated
type: Thing
property disjoint with: Number
definition: The :eissn property specifies an E-ISSN number for a serial.
sub property of: topDataProperty
property disjoint with: Credit
property disjoint with: Is Corresponding
property disjoint with: Family Name
type: DatatypeProperty
property disjoint with: Caption
property disjoint with: Caption (XML)
property disjoint with: Is Group
property disjoint with: Name
property disjoint with: Given Name
property disjoint with: Pages
property disjoint with: Section Level
property disjoint with: bottomDataProperty
property disjoint with: Page End
domain: Serial
range: Literal

Issue Start
definition: The :issueStart property specifies the start issue for a serial publication. Note that this :issueStart property relates to the publisher holdings which may not be the same as the actual publication issue start.
property disjoint with: Page End
property disjoint with: Is Corresponding
property disjoint with: Name
property disjoint with: Is Curated
property disjoint with: Family Name
property disjoint with: Given Name
property disjoint with: Caption (XML)
property disjoint with: Pages
type: Thing
sub property of: topDataProperty
property disjoint with: Credit
property disjoint with: bottomDataProperty
property disjoint with: Section Level
property disjoint with: Number
type: DatatypeProperty
property disjoint with: Caption
property disjoint with: Is Group
property disjoint with: Page Start
domain: Serial
range: Literal

Has Article
type: ObjectProperty
definition: The :hasArticle property relates a publication-event to an article.
property disjoint with: Has Section
property disjoint with: bottomObjectProperty
property disjoint with: Has Blog
property disjoint with: Has Contributor
sub property of: topObjectProperty
property disjoint with: Has Corresponding Contributor
property disjoint with: Has Next Issue
property disjoint with: Has External Contributor
property disjoint with: Has Serial
property disjoint with: Has Journal
property disjoint with: Has Collection
property disjoint with: Has Previous Issue
property disjoint with: Has Abstract
property disjoint with: Has Current Issue
property disjoint with: Has Figure
property disjoint with: Has Issue
property disjoint with: Has Image
type: Thing
property disjoint with: Has Illustration
property disjoint with: Has Summary
domain: Publication Event
range: Article

Section
type: Thing
type: Class
disjoint with: Issue
subclass of: Thing
disjoint with: External Article
disjoint with: Serial
disjoint with: Nothing
disjoint with: Blog Post
disjoint with: Article
disjoint with: Journal
subclass of: Component
subclass of: Publication
disjoint with: Graph
disjoint with: Collection
disjoint with: KnowledgeBase
definition: The :Section class represents a part of a document.
disjoint with: Dataset
subclass of: Concept
disjoint with: Blog
disjoint with: Document

DOI
definition: The :doi property specifies a DOI number for a publication.
type: Thing
sub property of: topDataProperty
property disjoint with: bottomDataProperty
type: DatatypeProperty
domain: Publication
range: Literal

Severity Level
type: Thing
subclass of: Thing
definition: The :SeverityLevel class represents a system status. The syslog standard (RFC 5424) for computer message logging is used to provide a reference set of states. This categorisation is implemented as a SKOS concept scheme.
subclass of: Type
type: Class
disjoint with: Nothing
subclass of: Concept

Short Title
definition: The :shortTitle property specifies an abbreviated title for a publication.
type: Thing
sub property of: topDataProperty
property disjoint with: bottomDataProperty
type: DatatypeProperty
domain: Publication
range: Literal

Publication Start YearMonth
definition: The :publicationStartYearMonth property specifies the year and month date of a publication's start as a string. Note that this date relates to the publisher holdings which may not be the same as the actual publication start date.
property disjoint with: bottomDataProperty
property disjoint with: Publication Year
property disjoint with: Is Curated
property disjoint with: Is Event Workflow
property disjoint with: Number
property disjoint with: Tree Depth
property disjoint with: Date
property disjoint with: Is Leaf
property disjoint with: Is Issue Based
property disjoint with: Is Corresponding
property disjoint with: Sort Number
property disjoint with: Cover Date
property disjoint with: Section Level
type: DatatypeProperty
property disjoint with: Code
property disjoint with: Is PrimaryArticleType
property disjoint with: Is Publish Ready
property disjoint with: Cover Year
property disjoint with: Is Test Instance
property disjoint with: Is Root
property disjoint with: Publication Start Year
sub property of: topDataProperty
property disjoint with: Publication Date
property disjoint with: DateTime
property disjoint with: Year
property disjoint with: Item Number
type: Thing
property disjoint with: Publication DateTime
property disjoint with: Is Group
domain: Publication
range: gYearMonth

Contributor
definition: The :Contributor class represents a document component detailing a contributor (personal or corporate) to the work being published. This class is disjoint from the :Agent class. Hence a :Contributor instance can be described as the name used to refer to a person or organisation in the context of a publication.
disjoint with: Issue
subclass of: Thing
disjoint with: External Article
disjoint with: Graph
subclass of: Publication
disjoint with: Nothing
disjoint with: Article
disjoint with: KnowledgeBase
disjoint with: Blog Post
disjoint with: Serial
disjoint with: Blog
disjoint with: Document
disjoint with: Dataset
disjoint with: Collection
subclass of: Concept
type: Thing
subclass of: Component
disjoint with: Journal
type: Class

Issue
property disjoint with: Pages
property disjoint with: Is Group
property disjoint with: Caption
property disjoint with: Caption (XML)
property disjoint with: Name
property disjoint with: bottomDataProperty
property disjoint with: Given Name
property disjoint with: Page End
property disjoint with: Is Curated
definition: The :issue property specifies an issue label for a journal.
property disjoint with: Page Start
type: Thing
type: DatatypeProperty
property disjoint with: Number
sub property of: topDataProperty
property disjoint with: Family Name
property disjoint with: Section Level
property disjoint with: Credit
property disjoint with: Is Corresponding
domain: Journal
range: Literal

DateTime
property disjoint with: Is Leaf
property disjoint with: Publication Start YearMonth
type: DatatypeProperty
property disjoint with: Publication Start Year
property disjoint with: Publication Date
sub property of: topDataProperty
property disjoint with: Is Publish Ready
property disjoint with: Tree Depth
property disjoint with: Cover YearMonth
property disjoint with: Code
property disjoint with: Publication YearMonth
property disjoint with: Is Event Workflow
property disjoint with: Is Curated
property disjoint with: Is Issue Based
property disjoint with: Date
definition: The :dateTime property specifies the full date of an event as a string, including a time component.
type: Thing
property disjoint with: Number
property disjoint with: Sort Number
property disjoint with: Publication End YearMonth
property disjoint with: Publication Year
property disjoint with: Is Test Instance
property disjoint with: Is Root
property disjoint with: Is Group
property disjoint with: Year
property disjoint with: Cover Date
property disjoint with: Is PrimaryArticleType
property disjoint with: Item Number
property disjoint with: bottomDataProperty
property disjoint with: Is Corresponding
property disjoint with: YearMonth
property disjoint with: Section Level
property disjoint with: Cover Year
domain: Event
range: dateTime

Pdf Asset
subclass of: Blob Asset
disjoint with: Nothing
type: Class
subclass of: Thing
type: Thing
subclass of: Asset
definition: The :PdfAsset class represents the physical rendition of a document asset in PDF format.

Publication YearMonth
property disjoint with: Is Group
property disjoint with: DateTime
property disjoint with: Cover Date
property disjoint with: Publication DateTime
property disjoint with: Publication Start Year
property disjoint with: Is Leaf
type: DatatypeProperty
property disjoint with: Cover Year
property disjoint with: Number
property disjoint with: Is Publish Ready
property disjoint with: Is Corresponding
property disjoint with: Code
property disjoint with: Publication Date
property disjoint with: Publication Year
property disjoint with: Is Root
property disjoint with: Year
definition: The :publicationYearMonth property specifies the year and month date of a publication as a string.
property disjoint with: Tree Depth
property disjoint with: bottomDataProperty
property disjoint with: Item Number
property disjoint with: Section Level
property disjoint with: Sort Number
sub property of: topDataProperty
property disjoint with: Is Test Instance
property disjoint with: Is PrimaryArticleType
property disjoint with: Is Event Workflow
property disjoint with: Date
property disjoint with: Is Issue Based
type: Thing
property disjoint with: Is Curated
domain: Publication
range: gYearMonth

Base URI Template
definition: The :baseUriTemplate property specifies a string template for an asset base URI.
type: Thing
sub property of: topDataProperty
property disjoint with: bottomDataProperty
type: DatatypeProperty
range: Literal

Repository ID
definition: The :repositoryId property specifies a (local) repository ID for an asset.
type: Thing
sub property of: topDataProperty
property disjoint with: bottomDataProperty
type: DatatypeProperty
domain: Asset
range: Literal

Has Subject
definition: The :hasSubject property relates a publication to a subject term which describes one of the main topics the publication is about.
type: Thing
sub property of: topObjectProperty
property disjoint with: bottomObjectProperty
type: ObjectProperty
domain: Publication
range: Subject

Filesize
definition: The :filesize property specifies an integer value for the size (in bytes) of an asset.
type: Thing
sub property of: topDataProperty
property disjoint with: bottomDataProperty
type: DatatypeProperty
domain: Asset
range: Literal

Image List
definition: The :imageList property specifies an ordered list of images for a publication.
type: Thing
sub property of: topObjectProperty
property disjoint with: bottomObjectProperty
type: ObjectProperty
domain: Publication
range: List

Family Name
property disjoint with: bottomDataProperty
property disjoint with: E-ISSN
type: Thing
property disjoint with: Page Start
property disjoint with: Page End
property disjoint with: Date End
property disjoint with: Is Issue Based
property disjoint with: Issue End
property disjoint with: Volume End
property disjoint with: Pages
property disjoint with: Issue Start
definition: The :familyName property specifies the family name of a person.
property disjoint with: Volume Start
property disjoint with: ISSN
type: DatatypeProperty
property disjoint with: Issue
property disjoint with: Asset Folder Name
sub property of: topDataProperty
property disjoint with: Volume
property disjoint with: Subject Path
property disjoint with: Date Start
domain: Contributor
range: Literal

Publisher
subclass of: Thing
type: Thing
definition: The :Publisher class represents organizations involved in the publishing business.
disjoint with: Nothing
subclass of: Organization
subclass of: Agent
type: Class

Publication DateTime
property disjoint with: Publication Start YearMonth
type: DatatypeProperty
property disjoint with: Is Group
property disjoint with: Is Root
property disjoint with: Cover Year
property disjoint with: Publication Start Year
property disjoint with: Is Issue Based
property disjoint with: Is Test Instance
property disjoint with: Year
sub property of: topDataProperty
property disjoint with: Item Number
property disjoint with: Publication Date
property disjoint with: Is Event Workflow
property disjoint with: Is Publish Ready
property disjoint with: Tree Depth
property disjoint with: Is Curated
type: Thing
property disjoint with: Number
property disjoint with: Publication Year
property disjoint with: Date
property disjoint with: Is PrimaryArticleType
property disjoint with: Publication YearMonth
property disjoint with: bottomDataProperty
property disjoint with: Sort Number
property disjoint with: Cover Date
definition: The :publicationDateTime property specifies the full date of a publication as a string, including the time of publication.
property disjoint with: Cover YearMonth
property disjoint with: Code
property disjoint with: Publication End YearMonth
property disjoint with: Is Corresponding
property disjoint with: Is Leaf
property disjoint with: Section Level
property disjoint with: YearMonth
domain: Publication
range: dateTime

Issue
disjoint with: Journal
disjoint with: Nothing
disjoint with: Component
disjoint with: External Article
type: Thing
disjoint with: Contributor
subclass of: Publication
disjoint with: Illustration
definition: The :Issue class represents an aggregate object which is published periodically as part of a :Serial and is normally composed by one or more articles. (See also :Collection.)
disjoint with: Section
subclass of: Collection
disjoint with: Article
type: Class
disjoint with: Summary
subclass of: Concept
disjoint with: Serial
subclass of: Thing
disjoint with: Figure
disjoint with: External Contributor
disjoint with: Abstract
disjoint with: Image
subclass of: Document
disjoint with: Blog

Component
disjoint with: Serial
disjoint with: Nothing
disjoint with: Collection
type: Thing
disjoint with: Document
subclass of: Thing
disjoint with: External Article
definition: The :Component class groups together all individuals that normally come into existence as part of a :Document.
disjoint with: Blog Post
subclass of: Publication
disjoint with: Journal
type: Class
disjoint with: KnowledgeBase
subclass of: Concept
disjoint with: Blog
disjoint with: Issue
disjoint with: Graph
disjoint with: Article
disjoint with: Dataset

Abstract
disjoint with: Document
disjoint with: KnowledgeBase
subclass of: Publication
disjoint with: Nothing
type: Class
type: Thing
subclass of: Concept
disjoint with: External Article
definition: The :Abstract class represents a brief description of a scholarly work, usually author generated. Instances of :Abstract normally do not exist in isolation, but are linked to a :Document instance (of which they provide a summary).
disjoint with: Graph
disjoint with: Article
disjoint with: Collection
subclass of: Component
disjoint with: Journal
disjoint with: Serial
disjoint with: Blog Post
disjoint with: Dataset
disjoint with: Blog
subclass of: Thing
disjoint with: Issue

Publication Year
property disjoint with: Number
property disjoint with: bottomDataProperty
property disjoint with: Item Number
property disjoint with: Publication End YearMonth
property disjoint with: Sort Number
property disjoint with: Is Event Workflow
property disjoint with: Is Test Instance
property disjoint with: Is Publish Ready
type: Thing
property disjoint with: Publication DateTime
property disjoint with: Section Level
property disjoint with: Is Root
property disjoint with: Date
property disjoint with: Is Corresponding
property disjoint with: Is Group
definition: The :publicationYear property specifies the year date of a publication as a string.
property disjoint with: Is Issue Based
property disjoint with: Code
property disjoint with: Publication YearMonth
property disjoint with: Is Curated
property disjoint with: Tree Depth
type: DatatypeProperty
property disjoint with: Publication Date
sub property of: topDataProperty
property disjoint with: Cover YearMonth
property disjoint with: YearMonth
property disjoint with: Cover Date
property disjoint with: Publication Start YearMonth
property disjoint with: DateTime
property disjoint with: Is Leaf
property disjoint with: Is PrimaryArticleType
domain: Publication
range: gYear

Has Summary Type
type: ObjectProperty
property disjoint with: Has External Contributor
property disjoint with: Has Corresponding Contributor
property disjoint with: Has Contributor
property disjoint with: Item Reference List
property disjoint with: Item List
property disjoint with: Has External Article
sub property of: topObjectProperty
property disjoint with: Has Primary Article Type
property disjoint with: Has Abstract
property disjoint with: Has Summary
definition: The :hasSummaryType property relates a summary to a summary-type classification.
property disjoint with: Has Article Type
type: Thing
property disjoint with: bottomObjectProperty
domain: Summary
range: Summary Type

Cover Year
property disjoint with: Is Leaf
property disjoint with: Tree Depth
property disjoint with: Is Issue Based
property disjoint with: Publication End YearMonth
property disjoint with: Publication Date
property disjoint with: Is Test Instance
property disjoint with: YearMonth
sub property of: topDataProperty
property disjoint with: bottomDataProperty
property disjoint with: Is Group
property disjoint with: Publication YearMonth
property disjoint with: DateTime
property disjoint with: Is PrimaryArticleType
property disjoint with: Item Number
property disjoint with: Cover YearMonth
property disjoint with: Is Event Workflow
property disjoint with: Section Level
definition: The :coverDate property specifies the year date of a publication as it is displayed on its cover.
type: Thing
property disjoint with: Is Root
property disjoint with: Number
property disjoint with: Cover Date
property disjoint with: Code
note: This is not necessarily the actual date of publication.
property disjoint with: Is Publish Ready
property disjoint with: Date
property disjoint with: Sort Number
property disjoint with: Publication Start YearMonth
type: DatatypeProperty
property disjoint with: Is Curated
property disjoint with: Publication DateTime
property disjoint with: Is Corresponding
domain: Publication
range: gYear

Date
property disjoint with: Is Test Instance
property disjoint with: bottomDataProperty
type: DatatypeProperty
property disjoint with: Is PrimaryArticleType
property disjoint with: Item Number
property disjoint with: Tree Depth
property disjoint with: YearMonth
property disjoint with: Publication Start Year
property disjoint with: Publication End YearMonth
property disjoint with: Section Level
property disjoint with: Number
property disjoint with: Publication YearMonth
property disjoint with: Is Publish Ready
property disjoint with: Publication Start YearMonth
property disjoint with: Is Corresponding
property disjoint with: Is Group
property disjoint with: Publication Year
property disjoint with: Is Root
definition: The :date property specifies the full date of an event as a string.
property disjoint with: Publication DateTime
property disjoint with: Cover Year
property disjoint with: Is Event Workflow
property disjoint with: Is Leaf
property disjoint with: Cover YearMonth
property disjoint with: Sort Number
property disjoint with: Is Curated
property disjoint with: Code
property disjoint with: DateTime
property disjoint with: Year
type: Thing
sub property of: topDataProperty
property disjoint with: Is Issue Based
domain: Event
range: date

Asset
disjoint with: Nothing
subclass of: Thing
definition: The :Asset class groups together all physical entities which can be stored in digital systems.
type: Thing
type: Class

Is Vocabulary
definition: The :isVocabulary property marks whether a class is used for a controlled vocabulary.
type: Thing
type: AnnotationProperty

Title
definition: The :title property specifies a title to the main body content of a publication as a string.
type: Thing
sub property of: topDataProperty
property disjoint with: bottomDataProperty
type: DatatypeProperty
domain: Publication
range: Literal

Repository
definition: The :repository property relates an asset to a storage repository.
type: Thing
sub property of: topObjectProperty
property disjoint with: bottomObjectProperty
type: ObjectProperty
domain: Asset

Blob Asset
definition: The :BlobAsset class groups together all assets used to store blobs - i.e. documents, images, or other media objects - within digital systems.
type: Thing
subclass of: Asset
subclass of: Thing
disjoint with: Nothing
type: Class