Program
sub property of: topObjectProperty
sub property of: Event Description
property disjoint with: bottomObjectProperty
type: ObjectProperty
comment: The subject musical event presents a musical work as its program
range: Oeuvre

E-Flat major
description: E flat major
Alternative Title: E-Flat major
type: Key
type: Thing
label: Es dur
comment: Major key based on E flat, whose key signature has 3 flats.

Meter
sub property of: Description
sub property of: topDataProperty
property disjoint with: bottomDataProperty
type: DatatypeProperty
comment: The subject musical work or its movement has a time measure such as 3/4, 4/4, 6/8 etc
domain: Musical Work
range: Literal

creator
sub property of: topObjectProperty
sub property of: Creator
property disjoint with: bottomObjectProperty
type: ObjectProperty
type: Property

Pianist
subclass of: Player
subclass of: Agent
subclass of: Artist
subclass of: Musician
subclass of: Thing
type: Class
disjoint with: Nothing
comment: A Piano player
subclass of: http://lodlaundromat.org/.well-known/genid/samples/pellet///predicate//1db5ec77e444f4f38af2fda329ad1aa6/1db5ec77e444f4f38af2fda329ad1aa6#20

Premiere
sub property of: topObjectProperty
sub property of: Description
property disjoint with: bottomObjectProperty
type: ObjectProperty
comment: The subject musical work was first performed at an concert
range: Musical Event
Example: http://lodlaundromat.org/.well-known/genid/samples/pellet///predicate//1db5ec77e444f4f38af2fda329ad1aa6/1db5ec77e444f4f38af2fda329ad1aa6#24

Date Created
sub property of: Date
date: 2000-07-11
property disjoint with: bottomDataProperty
Relation: created-003
Date Modified: 2008-01-14
type: DatatypeProperty
date: 2008-01-14
sub property of: topDataProperty
issued: 2000-07-11
Has Version: created-003
type: Thing
range: Literal
comment: Date of creation of the resource.
type: Property

familyName
term status: testing
type: Thing
sub property of: topDataProperty
property disjoint with: bottomDataProperty
type: DatatypeProperty
type: Property
comment: The family name of some person.
domain: Person
range: Literal

Skype ID
term status: testing
type: Thing
sub property of: topDataProperty
sub property of: nickname
property disjoint with: bottomDataProperty
type: DatatypeProperty
type: Property
comment: A Skype ID
domain: Agent
range: Literal

Accrual Method
issued: 2005-06-13
date: 2010-10-11
Has Version: accrualMethod-003
Relation: accrualMethod-003
type: ObjectProperty
Date Modified: 2010-10-11
sub property of: topObjectProperty
date: 2005-06-13
property disjoint with: bottomObjectProperty
type: Thing
type: Property
comment: The method by which items are added to a collection.
domain: Collection
range: Method of Accrual

Recital
disjoint with: Nothing
subclass of: Musical Event
subclass of: Thing
type: Class
comment: An event of musical performance especially by soloists

Music Director
subclass of: Musician
subclass of: Thing
subclass of: Artist
subclass of: Agent
subclass of: Director
disjoint with: Nothing
type: Class
comment: The person who leads a musical group

Source
date: 1999-07-02
Relation: source-006
property disjoint with: bottomObjectProperty
issued: 1999-07-02
type: Thing
sub property of: topObjectProperty
Date Modified: 2008-01-14
date: 2008-01-14
note: A second property with the same name as this property has been declared in the dcterms: namespace (http://purl.org/dc/terms/). See the Introduction to the document "DCMI Metadata Terms" (http://dublincore.org/documents/dcmi-terms/) for an explanation.
Has Version: source-006
type: ObjectProperty
description: The described resource may be derived from the related resource in whole or in part. Recommended best practice is to identify the related resource by means of a string conforming to a formal identification system.
comment: A related resource from which the described resource is derived.
type: Property

Bibliographic Resource
Relation: BibliographicResource-001
date: 2008-01-14
subclass of: Thing
issued: 2008-01-14
type: Class
Has Version: BibliographicResource-001
type: Thing
disjoint with: Nothing
comment: A book, article, or other documentary resource.

Accrual Periodicity
Date Modified: 2010-10-11
sub property of: topObjectProperty
date: 2010-10-11
issued: 2005-06-13
date: 2005-06-13
type: Thing
Relation: accrualPeriodicity-003
property disjoint with: bottomObjectProperty
Has Version: accrualPeriodicity-003
type: ObjectProperty
type: Property
comment: The frequency with which items are added to a collection.
domain: Collection
range: Frequency

Performer
sub property of: topObjectProperty
property disjoint with: bottomObjectProperty
inverse of: Performs
type: ObjectProperty
comment: The subject has a performer (an artist, a group, a machine etc.). The preferred domain of this property is #Performance, so as to model that "a concert presents a performance (of a musical work) that is realized by this performer". However, in natural language, we often say that "a concert has performers who play these musical works", i.e. the domain of 'performer' is #Musical_Event in this case, and it would be more intuitive model. Hence, the domain is leave unrestricted here for a moment.
range: Agent
Example: http://lodlaundromat.org/.well-known/genid/samples/pellet///predicate//1db5ec77e444f4f38af2fda329ad1aa6/1db5ec77e444f4f38af2fda329ad1aa6#27
Example: http://lodlaundromat.org/.well-known/genid/samples/pellet///predicate//1db5ec77e444f4f38af2fda329ad1aa6/1db5ec77e444f4f38af2fda329ad1aa6#28

Soloist
sub property of: topObjectProperty
sub property of: Performer
property disjoint with: bottomObjectProperty
type: ObjectProperty
comment: The subject performance is performed by this soloist (or the subject musical event has a soloist. See comment of #performer.

License Document
issued: 2008-01-14
Relation: LicenseDocument-001
subclass of: Rights Statement
disjoint with: Nothing
type: Thing
type: Class
subclass of: Thing
date: 2008-01-14
Has Version: LicenseDocument-001
comment: A legal document giving official permission to do something with a Resource.

Description
date: 2008-01-14
property disjoint with: bottomObjectProperty
Relation: descriptionT-001
type: Thing
sub property of: topObjectProperty
Date Modified: 2008-01-14
type: ObjectProperty
Has Version: descriptionT-001
issued: 2008-01-14
comment: An account of the resource.
description: Description may include but is not limited to: an abstract, a table of contents, a graphical representation, or a free-text account of the resource.
sub property of: Description
type: Property

Artist Description
sub property of: topObjectProperty
property disjoint with: bottomObjectProperty
type: ObjectProperty
comment: A description of the subject artist or agent. Super-property of #plays, #performs.
domain: Agent
range: Thing

http://lodlaundromat.org/.well-known/genid/samples/pellet///predicate//1db5ec77e444f4f38af2fda329ad1aa6/1db5ec77e444f4f38af2fda329ad1aa6#29
type: Example
type: Thing
comment: A simple description of a concert.
comment: 演奏会の簡単な記述例。 @ja
Prefix: m:
Code: <dc:date>2008-02-11</dc:date> <foaf:name>Masato Osada</foaf:name> <foaf:name>orchestra 'do svidanya'</foaf:name> <dc:title>Symphony No.11 g-minor</dc:title> op.103
Example of: Music Vocabulary

UDC
date: 2008-01-14
Relation: UDC-003
date: 2000-07-11
type: VocabularyEncodingScheme
type: Thing
Has Version: UDC-003
Date Modified: 2008-01-14
issued: 2000-07-11
comment: The set of conceptual resources specified by the Universal Decimal Classification.

Is Replaced By
type: ObjectProperty
sub property of: topObjectProperty
date: 2008-01-14
date: 2000-07-11
sub property of: Relation
property disjoint with: bottomObjectProperty
Relation: isReplacedBy-003
note: This term is intended to be used with non-literal values as defined in the DCMI Abstract Model (http://dublincore.org/documents/abstract-model/). As of December 2007, the DCMI Usage Board is seeking a way to express this intention with a formal range declaration.
Date Modified: 2008-01-14
issued: 2000-07-11
Has Version: isReplacedBy-003
type: Thing
type: Property
comment: A related resource that supplants, displaces, or supersedes the described resource.

http://lodlaundromat.org/.well-known/genid/samples/pellet///predicate//1db5ec77e444f4f38af2fda329ad1aa6/1db5ec77e444f4f38af2fda329ad1aa6#30
type: Example
type: Thing
comment: Another description of a concert with its title, date, program and venue. See also examples in the definition of 'performer' for more erabolate model (the preferred domain of this property is m:Performance, not m:Concert).
comment: ある演奏会の名称、日時、プログラム、会場の記述例。より精密なモデルの案として、'performer'の定義セクションにある例も参照。 @ja
Prefix: m:
Image: 'circles and arrows' graphical representation of this example
Code: <dc:title>Tokyo Green Symphony Orchestra 12th Concert</dc:title> <dc:date>2003-11-02T14:00+09:00</dc:date> <m:conductor foaf:name="Yuri Nitta"/> <foaf:name>Tomoko Kawada</foaf:name> <m:performs rdf:nodeID="p1"/> <m:Orchestra foaf:name="Tokyo Green Symphony Orchestra"/> <m:composer foaf:name="Bruch"/> <dc:title>Violin Concerto No.1 g minor</dc:title> op.26 <m:composer foaf:name="Brahms"/> <dc:title>Symphony No.2 D major</dc:title> op.73 <dc:title>Sumida Triphony</dc:title>
Example of: Music Vocabulary

interest
term status: testing
type: Thing
sub property of: topObjectProperty
property disjoint with: bottomObjectProperty
type: ObjectProperty
type: Property
comment: A page about a topic of interest to this person.
domain: Agent
range: Document

modified
sub property of: Date
sub property of: Date Modified
sub property of: topDataProperty
property disjoint with: bottomDataProperty
type: DatatypeProperty
type: Property

Opera Event
disjoint with: Nothing
equivalent class: Opera Performance
subclass of: Musical Event
subclass of: Thing
subclass of: Opera Performance
type: Class
comment: An event of opera performance (not an opera as a musical work, which is defined here as 'Opera')

Language
issued: 1999-07-02
date: 2008-01-14
type: Thing
type: ObjectProperty
note: A second property with the same name as this property has been declared in the dcterms: namespace (http://purl.org/dc/terms/). See the Introduction to the document "DCMI Metadata Terms" (http://dublincore.org/documents/dcmi-terms/) for an explanation.
date: 1999-07-02
Relation: language-007
Has Version: language-007
sub property of: topObjectProperty
Date Modified: 2008-01-14
property disjoint with: bottomObjectProperty
description: Recommended best practice is to use a controlled vocabulary such as RFC 4646 [RFC4646].
type: Property
comment: A language of the resource.

work info homepage
term status: testing
type: Thing
sub property of: topObjectProperty
property disjoint with: bottomObjectProperty
type: ObjectProperty
type: Property
comment: A work info homepage of some person; a page about their work for some organization.
domain: Person
range: Document

title
term status: testing
type: Thing
sub property of: topDataProperty
property disjoint with: bottomDataProperty
type: DatatypeProperty
type: Property
comment: Title (Mr, Mrs, Ms, Dr. etc)

Has Part
property disjoint with: bottomObjectProperty
Relation: hasPart-003
Date Modified: 2008-01-14
type: ObjectProperty
date: 2000-07-11
type: Thing
issued: 2000-07-11
note: This term is intended to be used with non-literal values as defined in the DCMI Abstract Model (http://dublincore.org/documents/abstract-model/). As of December 2007, the DCMI Usage Board is seeking a way to express this intention with a formal range declaration.
sub property of: Relation
date: 2008-01-14
Has Version: hasPart-003
sub property of: topObjectProperty
type: Property
comment: A related resource that is included either physically or logically in the described resource.

Harpsichord
disjoint with: Nothing
subclass of: Keyboard Instrument
subclass of: Musical Instrument
subclass of: Thing
type: Class
comment: A keyboard instrument whose strings are plucked by means of quills or plectrums. Cembalo.

Singer
disjoint with: Nothing
subclass of: Musician
subclass of: Artist
subclass of: Thing
subclass of: Agent
type: Class
comment: An artist who sings a song

Opera Company
disjoint with: Nothing
subclass of: Musical Group
subclass of: Artist
subclass of: Thing
subclass of: Agent
type: Class
comment: A musical group that performs opera works.

account service homepage
term status: testing
type: Thing
sub property of: topObjectProperty
property disjoint with: bottomObjectProperty
type: ObjectProperty
type: Property
comment: Indicates a homepage of the service provide for this online account.
domain: Online Account
range: Document

Trumpet
disjoint with: Nothing
subclass of: Musical Instrument
subclass of: Brass Instrument
subclass of: Thing
type: Class
comment: A A soprano brass instrument consisting of a long metal tube looped once and ending in a flared bell, usually being equipped with valves or pistons.

funded by
term status: archaic
type: Thing
sub property of: topObjectProperty
property disjoint with: bottomObjectProperty
type: ObjectProperty
type: Property
comment: An organization funding a project or person.
domain: Thing
range: Thing

Agent
type: Thing
date: 2008-01-14
Has Version: Agent-001
type: Agent Class
subclass of: Agent
subclass of: Thing
issued: 2008-01-14
Relation: Agent-001
type: Class
disjoint with: Nothing
equivalent class: Agent
description: Examples of Agent include person, organization, and software agent.
comment: A resource that acts or has the power to act.

C-Sharp minor
description: C sharp minor
Alternative Title: C-Sharp minor
type: Key
type: Thing
label: cis moll
comment: Minor key based on C sharp, whose key signature has 4 sharps.

C major
description: C major
Alternative Title: C major
type: Key
type: Thing
label: C dur
comment: Major key based on C, whose key signature has no sharp or flat.

lastName
term status: testing
type: Thing
sub property of: topDataProperty
property disjoint with: bottomDataProperty
type: DatatypeProperty
type: Property
comment: The last name of a person.
domain: Person
range: Literal

member
term status: stable
type: Thing
sub property of: topObjectProperty
property disjoint with: bottomObjectProperty
type: ObjectProperty
type: Property
comment: Indicates a member of a Group
domain: Group
range: Agent

personal mailbox
term status: stable
type: Thing
sub property of: topObjectProperty
property disjoint with: bottomObjectProperty
type: InverseFunctionalProperty
type: ObjectProperty
type: Property
comment: A personal mailbox, ie. an Internet mailbox associated with exactly one owner, the first owner of this mailbox. This is a 'static inverse functional property', in that there is (across time and change) at most one individual that ever has any particular value for foaf:mbox.
domain: Agent
range: Thing

Source
note: This term is intended to be used with non-literal values as defined in the DCMI Abstract Model (http://dublincore.org/documents/abstract-model/). As of December 2007, the DCMI Usage Board is seeking a way to express this intention with a formal range declaration.
Relation: sourceT-001
property disjoint with: bottomObjectProperty
date: 2008-01-14
sub property of: Source
sub property of: Relation
issued: 2008-01-14
sub property of: topObjectProperty
type: ObjectProperty
Date Modified: 2008-01-14
type: Thing
Has Version: sourceT-001
description: The described resource may be derived from the related resource in whole or in part. Recommended best practice is to identify the related resource by means of a string conforming to a formal identification system.
comment: A related resource from which the described resource is derived.
type: Property

Type
date: 1999-07-02
Relation: type-006
type: Thing
date: 2008-01-14
sub property of: topObjectProperty
note: A second property with the same name as this property has been declared in the dcterms: namespace (http://purl.org/dc/terms/). See the Introduction to the document "DCMI Metadata Terms" (http://dublincore.org/documents/dcmi-terms/) for an explanation.
property disjoint with: bottomObjectProperty
type: ObjectProperty
issued: 1999-07-02
Has Version: type-006
Date Modified: 2008-01-14
description: Recommended best practice is to use a controlled vocabulary such as the DCMI Type Vocabulary [DCMITYPE]. To describe the file format, physical medium, or dimensions of the resource, use the Format element.
type: Property
comment: The nature or genre of the resource.

Source
sub property of: topObjectProperty
sub property of: Description
property disjoint with: bottomObjectProperty
type: ObjectProperty
comment: The subject musical work has a historical source, such as sketch, autograph score or published score.
range: Written Representation

Symphonic Poem
disjoint with: Nothing
subclass of: Oeuvre
subclass of: Musical Work
subclass of: Orchestral Work
subclass of: Thing
type: Class
comment: An orchestral composition based on a thematic subject

Physical Resource
date: 2008-01-14
Relation: PhysicalResource-001
subclass of: Thing
type: Class
type: Thing
Has Version: PhysicalResource-001
issued: 2008-01-14
disjoint with: Nothing
comment: A material thing.

Relation
note: This term is intended to be used with non-literal values as defined in the DCMI Abstract Model (http://dublincore.org/documents/abstract-model/). As of December 2007, the DCMI Usage Board is seeking a way to express this intention with a formal range declaration.
Relation: relationT-001
date: 2008-01-14
type: Thing
type: ObjectProperty
Has Version: relationT-001
sub property of: Relation
property disjoint with: bottomObjectProperty
issued: 2008-01-14
Date Modified: 2008-01-14
sub property of: topObjectProperty
comment: A related resource.
description: Recommended best practice is to identify the related resource by means of a string conforming to a formal identification system.
type: Property

Is Part Of
issued: 2000-07-11
date: 2000-07-11
sub property of: Relation
sub property of: topObjectProperty
date: 2008-01-14
Date Modified: 2008-01-14
type: ObjectProperty
note: This term is intended to be used with non-literal values as defined in the DCMI Abstract Model (http://dublincore.org/documents/abstract-model/). As of December 2007, the DCMI Usage Board is seeking a way to express this intention with a formal range declaration.
type: Thing
Has Version: isPartOf-003
Relation: isPartOf-003
property disjoint with: bottomObjectProperty
type: Property
comment: A related resource in which the described resource is physically or logically included.

http://lodlaundromat.org/.well-known/genid/samples/pellet///predicate//1db5ec77e444f4f38af2fda329ad1aa6/1db5ec77e444f4f38af2fda329ad1aa6#24
type: Example
type: Thing
Code: <m:composer foaf:name="Shubert"/> <dc:title>Symohony No.7 'Unfinished'</dc:title> D.759 <dcterms:created>1822-01</dcterms:created> <dc:date>1865-12-17</dc:date> <cal:location>Wien Musikfereinsall</cal:location>

weblog
sub property of: page
term status: testing
type: Thing
property disjoint with: bottomObjectProperty
type: InverseFunctionalProperty
type: ObjectProperty
sub property of: topObjectProperty
type: Property
range: Document
comment: A weblog of some thing (whether person, group, company etc.).
domain: Agent

Surname
term status: archaic
type: Thing
sub property of: topDataProperty
property disjoint with: bottomDataProperty
type: DatatypeProperty
type: Property
comment: The surname of some person.
domain: Person
range: Literal

Online Account
term status: testing
type: Thing
disjoint with: Nothing
subclass of: Thing
type: Class
comment: An online account.

Media Type
disjoint with: Nothing
subclass of: Media Type or Extent
type: Class
date: 2008-01-14
Relation: MediaType-001
subclass of: Thing
type: Thing
Has Version: MediaType-001
issued: 2008-01-14
comment: A file format or physical medium.

Symphony
disjoint with: Nothing
subclass of: Oeuvre
subclass of: Musical Work
subclass of: Orchestral Work
subclass of: Thing
type: Class
comment: A large and complex work for symphony orchestra

Violin
disjoint with: Nothing
subclass of: Musical Instrument
subclass of: String Instrument
subclass of: Thing
type: Class
comment: A musical instrument played with a bow, having four strings. Usually plays the highest part of the string section.

Chorus
disjoint with: Nothing
subclass of: Musical Group
subclass of: Artist
subclass of: Thing
subclass of: Agent
type: Class
comment: A musical group of singers.

A minor
description: A minor
Alternative Title: A minor
type: Key
type: Thing
label: a moll

Agent Class
date: 2008-01-14
Relation: AgentClass-003
subclass of: Thing
disjoint with: Nothing
Has Version: AgentClass-003
issued: 2008-01-14
date: 2012-06-14
type: Class
Date Modified: 2012-06-14
type: Thing
subclass of: Class
description: Examples of Agent Class include groups seen as classes, such as students, women, charities, lecturers.
comment: A group of agents.

Table Of Contents
Relation: tableOfContents-003
date: 2008-01-14
property disjoint with: bottomDataProperty
sub property of: Description
date: 2000-07-11
Date Modified: 2008-01-14
type: Thing
type: DatatypeProperty
Has Version: tableOfContents-003
issued: 2000-07-11
sub property of: topDataProperty
type: Property
comment: A list of subunits of the resource.

RFC 5646
date: 2010-10-11
Relation: RFC5646-001
issued: 2010-10-11
Has Version: RFC5646-001
type: Thing
description: RFC 5646 obsoletes RFC 4646.
type: Datatype
comment: The set of tags constructed according to RFC 5646 for the identification of languages.

Creator
type: ObjectProperty
Has Version: creator-006
property disjoint with: bottomObjectProperty
date: 1999-07-02
date: 2008-01-14
issued: 1999-07-02
Relation: creator-006
note: A second property with the same name as this property has been declared in the dcterms: namespace (http://purl.org/dc/terms/). See the Introduction to the document "DCMI Metadata Terms" (http://dublincore.org/documents/dcmi-terms/) for an explanation.
Date Modified: 2008-01-14
type: Thing
sub property of: topObjectProperty
comment: An entity primarily responsible for making the resource.
description: Examples of a Creator include a person, an organization, or a service. Typically, the name of a Creator should be used to indicate the entity.
type: Property

Pian
disjoint with: Nothing
subclass of: Keyboard Instrument
subclass of: Musical Instrument
subclass of: Thing
type: Class
comment: A musical instrument with a manual keyboard actuating hammers that strike wire strings. A pianoforte.

Date Copyrighted
sub property of: topDataProperty
date: 2008-01-14
date: 2002-07-13
sub property of: Date
property disjoint with: bottomDataProperty
Relation: dateCopyrighted-002
type: Thing
issued: 2002-07-13
type: DatatypeProperty
Date Modified: 2008-01-14
Has Version: dateCopyrighted-002
range: Literal
type: Property
comment: Date of copyright.

Coverage
type: Thing
Relation: coverageT-001
type: ObjectProperty
date: 2008-01-14
Has Version: coverageT-001
Date Modified: 2008-01-14
sub property of: Coverage
property disjoint with: bottomObjectProperty
sub property of: topObjectProperty
issued: 2008-01-14
comment: The spatial or temporal topic of the resource, the spatial applicability of the resource, or the jurisdiction under which the resource is relevant.
type: Property
range: Location, Period, or Jurisdiction
description: Spatial topic and spatial applicability may be a named place or a location specified by its geographic coordinates. Temporal topic may be a named period, date, or date range. A jurisdiction may be a named administrative entity or a geographic place to which the resource applies. Recommended best practice is to use a controlled vocabulary such as the Thesaurus of Geographic Names [TGN]. Where appropriate, named places or time periods can be used in preference to numeric identifiers such as sets of coordinates or date ranges.

http://lodlaundromat.org/.well-known/genid/samples/pellet///predicate//1db5ec77e444f4f38af2fda329ad1aa6/ebd6d825318bc495634854d3b267d149#1
type: Example
type: Thing
comment: An example included in a schema definition.
comment: スキーマに例を埋め込む例。 @ja
Prefix: ex:
Code: <ex:Example> <rdfs:comment>An example to use Dublin Core vocabulary.</rdfs:comment> <rdfs:comment xml:lang="ja">ダブリンコア語彙を使う例</rdfs:comment> <ex:pfx>dc:</ex:pfx> <ex:code rdf:parseType="Literal"> <rdf:Description rdf:about="http://www.kanzaki.com/"> <dc:title>The Web KANZAKI</dc:title> <dc:creator>Masahide Kanzaki</dc:creator> </rdf:Description> </ex:code> <ex:exampleOf rdf:resource=""/> </ex:Example>
Example of: Example vocabulary

Keyboard Instrument
disjoint with: Nothing
subclass of: Musical Instrument
subclass of: Thing
type: Class
comment: A musical instrument that has a set of keys that consist of scale.

NLM
Has Version: NLM-002
issued: 2005-06-13
date: 2005-06-13
date: 2008-01-14
Relation: NLM-002
type: VocabularyEncodingScheme
Date Modified: 2008-01-14
type: Thing
comment: The set of conceptual resources specified by the National Library of Medicine Classification.

Accrual Policy
Relation: accrualPolicy-003
Has Version: accrualPolicy-003
type: ObjectProperty
date: 2005-06-13
issued: 2005-06-13
type: Thing
property disjoint with: bottomObjectProperty
sub property of: topObjectProperty
date: 2010-10-11
Date Modified: 2010-10-11
type: Property
comment: The policy governing the addition of items to a collection.
domain: Collection
range: Policy

Online Chat Account
term status: unstable
type: Thing
disjoint with: Nothing
subclass of: Thing
subclass of: Online Account
type: Class
comment: An online chat account.

DNA checksum
term status: archaic
type: Thing
sub property of: topDataProperty
property disjoint with: bottomDataProperty
type: DatatypeProperty
type: Property
comment: A checksum for the DNA of some thing. Joke.
range: Literal

Bass Clarinet
disjoint with: Nothing
subclass of: Musical Instrument
subclass of: Clarinet
subclass of: Woodwind Instrument
subclass of: Thing
type: Class
comment: A larger member of the clarinet family, usually in key B-flat.

membershipClass
term status: unstable
type: Thing
type: Property
type: AnnotationProperty
comment: Indicates the class of individuals that are a member of a Group

Part
disjoint with: Nothing
subclass of: Musical Representation
subclass of: Written Representation
subclass of: Thing
type: Class
comment: A music for a particular instrument or voice taken from a full score (Note: in this ontology, Part is not a division of an orchestra).

Concert
disjoint with: Nothing
subclass of: Musical Event
subclass of: Thing
type: Class
comment: An event of musical performance by players or singers not involving theatrical staging

Creator
sub property of: maker
type: ObjectProperty
Date Modified: 2010-10-11
Has Version: creatorT-002
type: Thing
sub property of: topObjectProperty
date: 2010-10-11
date: 2008-01-14
equivalent property: maker
issued: 2008-01-14
sub property of: Contributor
sub property of: Creator
property disjoint with: bottomObjectProperty
Relation: creatorT-002
inverse of: made
comment: An entity primarily responsible for making the resource.
type: Property
description: Examples of a Creator include a person, an organization, or a service.
range: Agent

knows
term status: stable
type: Thing
sub property of: topObjectProperty
property disjoint with: bottomObjectProperty
type: ObjectProperty
type: Property
comment: A person known by this person (indicating some level of reciprocated interaction between the parties).
domain: Person
range: Person

Form
sub property of: Description
sub property of: topDataProperty
property disjoint with: bottomDataProperty
type: DatatypeProperty
comment: The subject musical work or its movement has a form, such as sonata, minuet, etc. Would be better defined as ObjectProperty.
domain: Musical Work
range: Literal

Timpani
disjoint with: Nothing
subclass of: Musical Instrument
subclass of: Percussion
subclass of: Thing
type: Class
comment: A set of large copper or brass hemispherical drums with a parchment head that can be tuned by adjusting the tension.

Provenance
date: 2008-01-14
Has Version: provenance-002
Relation: provenance-002
issued: 2004-09-20
type: Thing
sub property of: topObjectProperty
Date Modified: 2008-01-14
date: 2004-09-20
type: ObjectProperty
property disjoint with: bottomObjectProperty
description: The statement may include a description of any changes successive custodians made to the resource.
type: Property
comment: A statement of any changes in ownership and custody of the resource since its creation that are significant for its authenticity, integrity, and interpretation.
range: Provenance Statement

D-Flat major
description: D flat major
Alternative Title: D-Flat major
type: Key
type: Thing
label: Des dur
comment: Major key based on D flat, whose key signature has 5 flats.

plan
term status: testing
type: Thing
sub property of: topDataProperty
property disjoint with: bottomDataProperty
type: DatatypeProperty
type: Property
comment: Aplan comment, in the tradition of finger and '.plan' files.
domain: Person
range: Literal

Composer
sub property of: topObjectProperty
sub property of: Description
sub property of: Creator
property disjoint with: bottomObjectProperty
type: ObjectProperty
comment: The subject musical work is composed by a person, a group, a software program etc.
domain: Oeuvre
range: Agent

Oboe
disjoint with: Nothing
subclass of: Musical Instrument
subclass of: Woodwind Instrument
subclass of: Thing
type: Class
comment: A woodwind instrument with a conical bore and a double-reed mouthpiece.

Countertenor
subclass of: Singer
subclass of: Musician
type: Class
subclass of: Artist
subclass of: Agent
subclass of: Thing
disjoint with: Nothing
comment: A Countertenor singer

sha1sum (hex)
term status: unstable
type: Thing
sub property of: topDataProperty
property disjoint with: bottomDataProperty
type: DatatypeProperty
type: Property
comment: A sha1sum hash, in hex.
domain: Document

B-Flat minor
description: B flat minor
Alternative Title: B-Flat minor
type: Key
type: Thing
label: b moll
comment: Minor key based on B flat, whose key signature has 5 flats.

Given name
term status: archaic
type: Thing
sub property of: topDataProperty
property disjoint with: bottomDataProperty
type: DatatypeProperty
type: Property
comment: The given name of some person.

C-Sharp major
description: C sharp major
Alternative Title: C-Sharp major
type: Key
type: Thing
label: Cis dur
comment: Major key based on C sharp, whose key signature has 7 sharps.

page
term status: testing
type: Thing
sub property of: topObjectProperty
property disjoint with: bottomObjectProperty
inverse of: topic
type: ObjectProperty
type: Property
comment: A page or document about this thing.
domain: Thing
range: Document

Title
type: DatatypeProperty
date: 1999-07-02
note: A second property with the same name as this property has been declared in the dcterms: namespace (http://purl.org/dc/terms/). See the Introduction to the document "DCMI Metadata Terms" (http://dublincore.org/documents/dcmi-terms/) for an explanation.
issued: 1999-07-02
type: Thing
Date Modified: 2008-01-14
date: 2008-01-14
sub property of: topDataProperty
property disjoint with: bottomDataProperty
Relation: title-006
Has Version: title-006
type: Property
comment: A name given to the resource.

LCC
Date Modified: 2008-01-14
issued: 2000-07-11
date: 2000-07-11
type: Thing
Relation: LCC-003
date: 2008-01-14
Has Version: LCC-003
type: VocabularyEncodingScheme
comment: The set of conceptual resources specified by the Library of Congress Classification.

CelestaPlayer
subclass of: Agent
subclass of: Artist
subclass of: Thing
disjoint with: Nothing
subclass of: Player
type: Class
subclass of: Musician
comment: A Celesta player
subclass of: http://lodlaundromat.org/.well-known/genid/samples/pellet///predicate//1db5ec77e444f4f38af2fda329ad1aa6/1db5ec77e444f4f38af2fda329ad1aa6#21

A-Flat major
description: A flat major
Alternative Title: A-Flat major
type: Key
type: Thing
label: As dur
comment: Major key based on A flat, whose key signature has 4 flats.

Title
date: 2008-01-14
date: 2010-10-11
sub property of: topDataProperty
Date Modified: 2010-10-11
sub property of: Title
type: DatatypeProperty
issued: 2008-01-14
property disjoint with: bottomDataProperty
Has Version: titleT-002
Relation: titleT-002
type: Thing
type: Property
comment: A name given to the resource.
range: Literal

IMT
issued: 2000-07-11
Relation: IMT-004
date: 2000-07-11
date: 2008-01-14
Date Modified: 2008-01-14
type: VocabularyEncodingScheme
Has Version: IMT-004
type: Thing
comment: The set of media types specified by the Internet Assigned Numbers Authority.

Location, Period, or Jurisdiction
date: 2008-01-14
disjoint with: Nothing
type: Thing
issued: 2008-01-14
Has Version: LocationPeriodOrJurisdiction-001
Relation: LocationPeriodOrJurisdiction-001
subclass of: Thing
type: Class
comment: A location, period of time, or jurisdiction.

Ballet (Work)
disjoint with: Nothing
subclass of: Oeuvre
subclass of: Musical Work
subclass of: Thing
type: Class
comment: A musical work for a dance form featuring a staged presentation of group or solo dancing. Note 'Ballet_Event' in this vocabulary describes the performance of a ballet.

relation
sub property of: topObjectProperty
sub property of: Relation
property disjoint with: bottomObjectProperty
type: ObjectProperty
type: Property

Sections
sub property of: topObjectProperty
sub property of: Description
property disjoint with: bottomObjectProperty
type: ObjectProperty
comment: The subject musical work has subsections such as movements. Current model recommends RDF Collection as the object.
domain: Oeuvre
range: Thing

Medium
Relation: medium-003
date: 2000-07-11
issued: 2000-07-11
type: ObjectProperty
property disjoint with: bottomObjectProperty
sub property of: topObjectProperty
Has Version: medium-003
date: 2008-01-14
sub property of: Format
type: Thing
Date Modified: 2008-01-14
range: Physical Medium
comment: The material or physical carrier of the resource.
domain: Physical Resource
type: Property

神崎正英
type: Person
type: Thing
type: Agent
type: SpatialThing

Cantata
disjoint with: Nothing
subclass of: Oeuvre
subclass of: Choral Music
subclass of: Musical Work
subclass of: Thing
type: Class
comment: A vocal composition accompanied by instruments and generally containing more than one movement.

http://lodlaundromat.org/.well-known/genid/samples/pellet///predicate//1db5ec77e444f4f38af2fda329ad1aa6/1db5ec77e444f4f38af2fda329ad1aa6#31
type: Example
type: Thing
comment: A simplified description of a concert with its title, date, program and venue. All property values are literal string here.
comment: ある演奏会の名称、日時、プログラム、会場を、文字列だけで記述する例。 @ja
Prefix: m:
Code: <dc:title>Tokyo Green Symphony Orchestra 12th Concert</dc:title> <dc:date>2003-11-02T14:00+09:00</dc:date> Yuri Nitta Violin: Tomoko Kawada Orchestra: Tokyo Green Symphony Orchestra Bruch: Violin Concerto No.1 g minor Brahms: Symphony No.2 D major <cal:location>Sumida Triphony</cal:location>
Example of: Music Vocabulary

B-Flat major
description: B flat major
Alternative Title: B-Flat major
type: Key
type: Thing
label: B dur
comment: Major key based on B flat, whose key signature has 2 flats.

ICQ chat ID
sub property of: nickname
term status: testing
type: Thing
property disjoint with: bottomDataProperty
sub property of: topDataProperty
type: InverseFunctionalProperty
type: DatatypeProperty
domain: Agent
range: Literal
comment: An ICQ chat ID
type: Property

Date Available
Relation: available-003
date: 2008-01-14
type: Thing
property disjoint with: bottomDataProperty
date: 2000-07-11
issued: 2000-07-11
Has Version: available-003
sub property of: Date
Date Modified: 2008-01-14
type: DatatypeProperty
sub property of: topDataProperty
comment: Date (often a range) that the resource became or will become available.
type: Property
range: Literal

Musical Work
disjoint with: Nothing
subclass of: Thing
type: Class
comment: A musical work in any form, e.g. a composition, its movement, phrase, theme etc.

Event Description
sub property of: topObjectProperty
property disjoint with: bottomObjectProperty
type: ObjectProperty
comment: A description of the subject musical event. Super-property of #program, #presents, #venue.
domain: Musical Event
range: Thing

Harpist
subclass of: Thing
type: Class
subclass of: Agent
disjoint with: Nothing
subclass of: Player
subclass of: Artist
subclass of: Musician
comment: A Harp player
subclass of: http://lodlaundromat.org/.well-known/genid/samples/pellet///predicate//1db5ec77e444f4f38af2fda329ad1aa6/1db5ec77e444f4f38af2fda329ad1aa6#19

published
sub property of: topObjectProperty
sub property of: Description
property disjoint with: bottomObjectProperty
type: ObjectProperty
comment: The subject musical work is published as a score or sheet music (still not sure what kind of class is appropriate as the range)
range: Written Representation
Example: http://lodlaundromat.org/.well-known/genid/samples/pellet///predicate//1db5ec77e444f4f38af2fda329ad1aa6/1db5ec77e444f4f38af2fda329ad1aa6#25

account
term status: testing
type: Thing
sub property of: topObjectProperty
property disjoint with: bottomObjectProperty
type: ObjectProperty
type: Property
comment: Indicates an account held by this agent.
domain: Agent
range: Online Account

Has Format
sub property of: topObjectProperty
Relation: hasFormat-003
type: ObjectProperty
issued: 2000-07-11
date: 2000-07-11
date: 2008-01-14
Date Modified: 2008-01-14
type: Thing
property disjoint with: bottomObjectProperty
Has Version: hasFormat-003
sub property of: Relation
note: This term is intended to be used with non-literal values as defined in the DCMI Abstract Model (http://dublincore.org/documents/abstract-model/). As of December 2007, the DCMI Usage Board is seeking a way to express this intention with a formal range declaration.
type: Property
comment: A related resource that is substantially the same as the pre-existing described resource, but in another format.

homepage
sub property of: topObjectProperty
term status: stable
sub property of: page
sub property of: is primary topic of
type: Thing
property disjoint with: bottomObjectProperty
type: ObjectProperty
type: InverseFunctionalProperty
comment: A homepage for some thing.
range: Document
type: Property
domain: Thing

Label Property
term status: unstable
type: Thing
disjoint with: Nothing
subclass of: Thing
type: Class
comment: A foaf:LabelProperty is any RDF property with texual values that serve as labels.

Linguistic System
type: Class
Relation: LinguisticSystem-001
Has Version: LinguisticSystem-001
issued: 2008-01-14
subclass of: Thing
disjoint with: Nothing
type: Thing
date: 2008-01-14
description: Examples include written, spoken, sign, and computer languages.
comment: A system of signs, symbols, sounds, gestures, or rules used in communication.

Peroformance
disjoint with: Nothing
subclass of: Musical Representation
subclass of: Thing
type: Class
comment: Representation of a musical work in the form of performace, e.g. playing instruments, singing etc. Note a concert is a Musical_Event where a Performance is presented.

Hornist
subclass of: Agent
subclass of: Musician
disjoint with: Nothing
subclass of: Player
subclass of: Thing
subclass of: Artist
type: Class
comment: A Horn player
subclass of: http://lodlaundromat.org/.well-known/genid/samples/pellet///predicate//1db5ec77e444f4f38af2fda329ad1aa6/1db5ec77e444f4f38af2fda329ad1aa6#14

DDC
issued: 2000-07-11
date: 2000-07-11
Relation: DDC-003
type: Thing
Has Version: DDC-003
date: 2008-01-14
Date Modified: 2008-01-14
type: VocabularyEncodingScheme
comment: The set of conceptual resources specified by the Dewey Decimal Classification.

G minor
description: G minor
Alternative Title: G minor
type: Key
type: Thing
label: g moll
comment: Minor key based on G, whose key signature has 2 flats.

PersonalProfileDocument
term status: testing
disjoint with: Nothing
disjoint with: Project
type: Thing
subclass of: Thing
type: Class
subclass of: Document
disjoint with: Organization
comment: A personal profile RDF document.

G major
description: G major
Alternative Title: G major
type: Key
type: Thing
label: G dur
comment: Major key based on G, whose key signature has 1 sharp.

deprecated by
sub property of: topObjectProperty
sub property of: see other
property disjoint with: bottomObjectProperty
type: ObjectProperty
type: Property

Ensemble
disjoint with: Nothing
subclass of: Musical Group
subclass of: Artist
subclass of: Thing
subclass of: Agent
type: Class
comment: A musical group which perfroms in relatively small size, particularly chamber music

Suite
disjoint with: Nothing
subclass of: Oeuvre
subclass of: Musical Work
subclass of: Thing
type: Class
comment: A musical composition of several movements only loosely connected

Ballet Company
disjoint with: Nothing
subclass of: Musical Group
subclass of: Artist
subclass of: Thing
subclass of: Agent
type: Class
comment: A musical group that performs ballet works.

theme
term status: archaic
type: Thing
sub property of: topObjectProperty
property disjoint with: bottomObjectProperty
type: ObjectProperty
type: Property
comment: A theme.
domain: Thing
range: Thing

File Format
type: Thing
type: Class
date: 2008-01-14
Relation: FileFormat-001
subclass of: Media Type
issued: 2008-01-14
Has Version: FileFormat-001
disjoint with: Nothing
subclass of: Media Type or Extent
subclass of: Thing
description: Examples include the formats defined by the list of Internet Media Types.
comment: A digital resource format.

http://lodlaundromat.org/.well-known/genid/samples/pellet///predicate//1db5ec77e444f4f38af2fda329ad1aa6/1db5ec77e444f4f38af2fda329ad1aa6#25
type: Example
type: Thing
Code: <m:composer foaf:name="Beethoven"/> <dc:title>Symphony No.9</dc:title> Op.125 <dc:date>1826-08</dc:date> <dc:description>The first published edition</dc:description> <dc:publisher>Schott</dc:publisher>

topic
term status: testing
type: Thing
sub property of: topObjectProperty
property disjoint with: bottomObjectProperty
inverse of: page
type: ObjectProperty
type: Property
comment: A topic of some page or document.
domain: Document
range: Thing

RFC 4646
date: 2008-01-14
Relation: RFC4646-001
issued: 2008-01-14
Has Version: RFC4646-001
type: Thing
description: RFC 4646 obsoletes RFC 3066.
type: Datatype
comment: The set of tags constructed according to RFC 4646 for the identification of languages.

Horn
disjoint with: Nothing
subclass of: Musical Instrument
subclass of: Brass Instrument
subclass of: Thing
type: Class
comment: A brass instrument with a long narrow tube that is coiled in a circle before ending in a flaring bell, usually being equipped with valves. A French Horn.

Frequency
subclass of: Thing
disjoint with: Nothing
type: Class
Relation: Frequency-001
type: Thing
date: 2008-01-14
Has Version: Frequency-001
issued: 2008-01-14
comment: A rate at which something recurs.

B minor
description: B minor
Alternative Title: B minor
type: Key
type: Thing
label: h moll
comment: Minor key based on B, whose key signature has 2 sharps.

Description
sub property of: topObjectProperty
property disjoint with: bottomObjectProperty
type: ObjectProperty
comment: A description of the subject musical work. Super-property of some properties in this vocabulary, as well as description of a general descriptive resource such as time-line of composing process.
domain: Musical Work
range: Thing

maker
sub property of: topObjectProperty
equivalent property: Creator
sub property of: Creator
term status: stable
sub property of: Contributor
inverse of: made
property disjoint with: bottomObjectProperty
type: Thing
type: ObjectProperty
comment: An agent that made this thing.
domain: Thing
type: Property
range: Agent

Piccolo
disjoint with: Nothing
subclass of: Flute
subclass of: Musical Instrument
subclass of: Woodwind Instrument
subclass of: Thing
type: Class
comment: A piccolo flute, smaller member of the flute family.

Bibliographic Citation
date: 2003-02-15
date: 2008-01-14
Has Version: bibliographicCitation-002
sub property of: topDataProperty
sub property of: Identifier
property disjoint with: bottomDataProperty
type: Thing
Relation: bibliographicCitation-002
issued: 2003-02-15
Date Modified: 2008-01-14
type: DatatypeProperty
description: Recommended practice is to include sufficient bibliographic detail to identify the resource as unambiguously as possible.
range: Literal
domain: Bibliographic Resource
comment: A bibliographic reference for the resource.
type: Property

Replaces
Has Version: replaces-003
date: 2000-07-11
note: This term is intended to be used with non-literal values as defined in the DCMI Abstract Model (http://dublincore.org/documents/abstract-model/). As of December 2007, the DCMI Usage Board is seeking a way to express this intention with a formal range declaration.
type: ObjectProperty
Date Modified: 2008-01-14
date: 2008-01-14
property disjoint with: bottomObjectProperty
sub property of: Relation
type: Thing
sub property of: topObjectProperty
Relation: replaces-003
issued: 2000-07-11
comment: A related resource that is supplanted, displaced, or superseded by the described resource.
type: Property

DCMI Box
date: 2008-01-14
Date Modified: 2008-01-14
Has Version: Box-003
issued: 2000-07-11
Relation: Box-003
date: 2000-07-11
type: Thing
type: Datatype
comment: The set of regions in space defined by their geographic coordinates according to the DCMI Box Encoding Scheme.

Artist
disjoint with: Nothing
subclass of: Thing
subclass of: Agent
type: Class
comment: A person or group (or any agent) who creates or performs art works

Director
disjoint with: Nothing
subclass of: Artist
subclass of: Thing
subclass of: Agent
type: Class
comment: An artist who directs a musical group

Conductor Name
sub property of: Description
sub property of: topDataProperty
sub property of: PerformerName
property disjoint with: bottomDataProperty
type: DatatypeProperty
comment: The subject musical event has a conductor. Literal version of #conductor.

Contrafagotto
disjoint with: Nothing
subclass of: Musical Instrument
subclass of: Woodwind Instrument
subclass of: Thing
subclass of: Bassoon
type: Class
comment: A larger mebmer of the basoon family, producing the lowest tone in the woodwind section.

DCMI Metadata Terms - other
date: 2012-06-14
Date Modified: 2012-06-14
publisher: DCMI
type: Thing

Clarinet
disjoint with: Nothing
subclass of: Musical Instrument
subclass of: Woodwind Instrument
subclass of: Thing
type: Class
comment: A woodwind instrument having a straight cylindrical tube with a flaring bell and a single-reed mouthpiece.

Movement
disjoint with: Nothing
subclass of: Musical Work
subclass of: Thing
type: Class
comment: A subsection of a musical work. Typically a movement of a symphony, but also a piece of suit, etc.

Celesta
disjoint with: Nothing
subclass of: Keyboard Instrument
subclass of: Musical Instrument
subclass of: Thing
type: Class
comment: A musical instrument with a keyboard and metal plates struck by hammers that produce bell-like tones.

Oratorio
disjoint with: Nothing
subclass of: Oeuvre
subclass of: Choral Music
subclass of: Musical Work
subclass of: Thing
type: Class
comment: A large musical composition for orchestra, vocal soloists and chorus

ISO 639-2
Has Version: ISO639-2-003
Date Modified: 2008-01-14
date: 2008-01-14
type: Thing
date: 2000-07-11
Relation: ISO639-2-003
issued: 2000-07-11
type: Datatype
comment: The three-letter alphabetic codes listed in ISO639-2 for the representation of names of languages.

openid
type: ObjectProperty
term status: testing
sub property of: page
property disjoint with: bottomObjectProperty
type: InverseFunctionalProperty
sub property of: is primary topic of
sub property of: topObjectProperty
type: Thing
range: Document
type: Property
domain: Agent
comment: An OpenID for an Agent.

Temporal Coverage
sub property of: Coverage
date: 2008-01-14
Has Version: temporal-003
date: 2000-07-11
property disjoint with: bottomObjectProperty
issued: 2000-07-11
Date Modified: 2008-01-14
sub property of: topObjectProperty
Relation: temporal-003
type: Thing
type: ObjectProperty
type: Property
range: Period of Time
comment: Temporal characteristics of the resource.

String Quartet
subclass of: Musical Work
equivalent class: String Quartette
subclass of: Oeuvre
disjoint with: Nothing
subclass of: String Quartette
subclass of: Chamber Music
type: Class
subclass of: Thing
comment: A music composed for instrumental quartet with 2 violins and a viola and a cello. Note 'StringQuartetEnsemble' is SQ ensemble in this vocabulary.

Saxophone
disjoint with: Nothing
subclass of: Musical Instrument
subclass of: Woodwind Instrument
subclass of: Thing
type: Class
comment: A woodwind instrument with a single-reed mouthpiece and a (usually curved) conical metal tube, including soprano, alto, tenor, and baritone sizes.

Guitarist
subclass of: Musician
subclass of: Agent
disjoint with: Nothing
subclass of: Thing
subclass of: Player
type: Class
subclass of: Artist
comment: A Guitar player
subclass of: http://lodlaundromat.org/.well-known/genid/samples/pellet///predicate//1db5ec77e444f4f38af2fda329ad1aa6/1db5ec77e444f4f38af2fda329ad1aa6#23

Date Valid
Relation: valid-003
sub property of: topDataProperty
date: 2000-07-11
issued: 2000-07-11
type: DatatypeProperty
sub property of: Date
Date Modified: 2008-01-14
date: 2008-01-14
property disjoint with: bottomDataProperty
Has Version: valid-003
type: Thing
type: Property
range: Literal
comment: Date (often a range) of validity of a resource.

title
sub property of: Title
sub property of: topDataProperty
property disjoint with: bottomDataProperty
type: DatatypeProperty
type: Property

Concerto
disjoint with: Nothing
subclass of: Oeuvre
subclass of: Musical Work
subclass of: Orchestral Work
subclass of: Thing
type: Class
comment: A composition for orchestra and a soloist

RFC 3066
type: Thing
date: 2002-07-13
Relation: RFC3066-002
Has Version: RFC3066-002
Date Modified: 2008-01-14
date: 2008-01-14
issued: 2002-07-13
description: RFC 3066 has been obsoleted by RFC 4646.
type: Datatype
comment: The set of tags constructed according to RFC 3066 for the identification of languages.

A major
description: A major
Alternative Title: A major
type: Key
type: Thing
label: A dur
comment: Major key based on A, whose key signature has 3 sharps.

Cellist
disjoint with: Nothing
subclass of: Musician
subclass of: Agent
subclass of: Thing
subclass of: Artist
subclass of: Player
type: Class
comment: A Cello player
subclass of: http://lodlaundromat.org/.well-known/genid/samples/pellet///predicate//1db5ec77e444f4f38af2fda329ad1aa6/1db5ec77e444f4f38af2fda329ad1aa6#4

Alto
disjoint with: Nothing
subclass of: Agent
subclass of: Artist
subclass of: Singer
subclass of: Musician
subclass of: Thing
type: Class
comment: An Alto singer

Bassoonist
subclass of: Agent
subclass of: Thing
disjoint with: Nothing
subclass of: Musician
subclass of: Artist
subclass of: Player
type: Class
comment: A Fagotto player
subclass of: http://lodlaundromat.org/.well-known/genid/samples/pellet///predicate//1db5ec77e444f4f38af2fda329ad1aa6/1db5ec77e444f4f38af2fda329ad1aa6#12

birthday
term status: unstable
type: Thing
sub property of: topDataProperty
property disjoint with: bottomDataProperty
type: FunctionalProperty
type: DatatypeProperty
type: Property
comment: The birthday of this Agent, represented in mm-dd string form, eg. '12-31'.
domain: Agent
range: Literal

G-Flat major
description: G flat major
Alternative Title: G-Flat major
type: Key
type: Thing
label: Ges dur
comment: Major key based on G flat, whose key signature has 6 flats.

神崎正英
type: SpatialThing
type: Person
type: Agent
type: Thing

Presents
sub property of: topObjectProperty
sub property of: Event Description
property disjoint with: bottomObjectProperty
type: ObjectProperty
comment: The subject musical event presents a performance of a musical work. An experiment to have better model to describe musical work, its representation and an event to present the representation.
range: Peroformance

Player
disjoint with: Nothing
subclass of: Musician
subclass of: Artist
subclass of: Thing
subclass of: Agent
type: Class
comment: An artist who performs a musical instrument

Extent
sub property of: topObjectProperty
Relation: extent-003
issued: 2000-07-11
date: 2000-07-11
Has Version: extent-003
Date Modified: 2008-01-14
date: 2008-01-14
type: ObjectProperty
type: Thing
sub property of: Format
property disjoint with: bottomObjectProperty
type: Property
comment: The size or duration of the resource.
range: Size or Duration

F major
description: F major
Alternative Title: F major
type: Key
type: Thing
label: F dur
comment: Major key based on F, whose key signature has 1 flat.

http://lodlaundromat.org/.well-known/genid/samples/pellet///predicate//1db5ec77e444f4f38af2fda329ad1aa6/1db5ec77e444f4f38af2fda329ad1aa6#32
type: Example
type: Thing
comment: A description of a symphony with its composition data and descriptions of movements. Note now key values are expressed as URIs.
comment: 交響曲の楽曲情報と楽章データの記述例。調性の記述をURIに変更。 @ja
Trial: D.759
Image: 'circles and arrows' graphical representation of this example
Prefix: m:
Code: <foaf:name>シューベルト</foaf:name> <foaf:homepage rdf:resource="http://www.kanzaki.com/music/mw/sym/schubert"/> <dc:title>Symohony No.7 'Unfinished'</dc:title> D.759 <m:key rdf:resource="http://www.kanzaki.com/ns/music#h-moll"/> <dcterms:created>1822-01</dcterms:created> <dc:date>1865-12-17</dc:date> <cal:location>Wien Musikfereinsall</cal:location> Allegro moderato <m:key rdf:resource="http://www.kanzaki.com/ns/music#h-moll"/> 3/4 Andante con moto <m:key rdf:resource="http://www.kanzaki.com/ns/music#Es-dur"/> 3/8
Example of: Music Vocabulary

F-Sharp major
description: F sharp major
Alternative Title: F-Sharp major
type: Key
type: Thing
label: Fis dur
comment: Major key based on F sharp, whose key signature has 6 sharps.

String Instrument
disjoint with: Nothing
subclass of: Musical Instrument
subclass of: Thing
type: Class
comment: A stringed musical instrument, in which sound is produced by plucking, striking, or bowing taut strings.

URI
Has Version: URI-003
date: 2000-07-11
date: 2008-01-14
type: Thing
Date Modified: 2008-01-14
Relation: URI-003
issued: 2000-07-11
type: Datatype
comment: The set of identifiers constructed according to the generic syntax for Uniform Resource Identifiers as specified by the Internet Engineering Task Force.

Media Type or Extent
Has Version: MediaTypeOrExtent-001
issued: 2008-01-14
Relation: MediaTypeOrExtent-001
subclass of: Thing
date: 2008-01-14
type: Thing
type: Class
disjoint with: Nothing
comment: A media type or extent.

Bass_Clarinettist
subclass of: Player
subclass of: Agent
disjoint with: Nothing
subclass of: Musician
subclass of: Thing
type: Class
subclass of: Artist
subclass of: Clarinettist
comment: A Bass Clarinet player
subclass of: http://lodlaundromat.org/.well-known/genid/samples/pellet///predicate//1db5ec77e444f4f38af2fda329ad1aa6/1db5ec77e444f4f38af2fda329ad1aa6#11

Musical Instrument
disjoint with: Nothing
subclass of: Thing
type: Class
comment: An instrument to play music

Date
type: DatatypeProperty
issued: 2008-01-14
Relation: dateT-001
sub property of: topDataProperty
Has Version: dateT-001
Date Modified: 2008-01-14
date: 2008-01-14
property disjoint with: bottomDataProperty
type: Thing
sub property of: Date
comment: A point or period of time associated with an event in the lifecycle of the resource.
description: Date may be used to express temporal information at any level of granularity. Recommended best practice is to use an encoding scheme, such as the W3CDTF profile of ISO 8601 [W3CDTF].
type: Property
range: Literal

W3C-DTF
Relation: W3CDTF-003
Date Modified: 2008-01-14
date: 2008-01-14
date: 2000-07-11
issued: 2000-07-11
type: Thing
Has Version: W3CDTF-003
type: Datatype
comment: The set of dates and times constructed according to the W3C Date and Time Formats Specification.

Physical Medium
Relation: PhysicalMedium-001
type: Class
date: 2008-01-14
subclass of: Media Type or Extent
subclass of: Media Type
issued: 2008-01-14
subclass of: Thing
type: Thing
disjoint with: Nothing
Has Version: PhysicalMedium-001
description: Examples include paper, canvas, or DVD.
comment: A physical material or carrier.

Flute
disjoint with: Nothing
subclass of: Musical Instrument
subclass of: Woodwind Instrument
subclass of: Thing
type: Class
comment: A high-pitched woodwind instrument; a slender tube closed at one end with finger holes on one end and an opening near the closed end across which the breath is blown

Score
disjoint with: Nothing
subclass of: Musical Representation
subclass of: Written Representation
subclass of: Thing
type: Class
comment: A full score or piano-vocal score of a work, either published or manuscript.

Trumpeter
disjoint with: Nothing
subclass of: Player
subclass of: Musician
subclass of: Artist
subclass of: Thing
subclass of: Agent
type: Class
comment: A Trumpet player
subclass of: http://lodlaundromat.org/.well-known/genid/samples/pellet///predicate//1db5ec77e444f4f38af2fda329ad1aa6/1db5ec77e444f4f38af2fda329ad1aa6#15

Choreographer
disjoint with: Nothing
subclass of: Director
subclass of: Artist
subclass of: Thing
subclass of: Agent
type: Class
comment: someone who creates new dances, or directs an opera

Oboist
subclass of: Musician
subclass of: Thing
subclass of: Player
type: Class
disjoint with: Nothing
subclass of: Artist
subclass of: Agent
comment: An Oboe player
subclass of: http://lodlaundromat.org/.well-known/genid/samples/pellet///predicate//1db5ec77e444f4f38af2fda329ad1aa6/1db5ec77e444f4f38af2fda329ad1aa6#8

F-Sharp minor
description: F sharp minor
Alternative Title: F-Sharp minor
type: Key
type: Thing
label: fis moll
comment: Minor key based on F sharp, whose key signature has 3 sharps.

Music Vocabulary
date: 2003-07-04
type: Thing
creator: 神崎正英
created: 2003-07-04
date: 2007-10-31
modified: 2007-10-31
type: Ontology
imports: dliser.rdf
comment: A vocabulary, or music ontology, to describe classical music and performances. Classes (categories) for musical works, events, instruments and performers, as well as related properties are defined. Make sure to distinguish musical works (e.g. Opera) from performance events (Opera_Event), or works (String_Quartette) from performer (StringQuartetEnsemble in this vocab), whose natural language terms are used interchangeblly. The present version experiments more precise model to describe a musical work, its representations (performances, scores, etc) and a musical event to present a representation (a concert). Includes 30 keys as individuals.
comment: 音楽作品、楽器、演奏情報を記述するためのボキャブラリ。Opera_Event（演奏）とOpera（作品）や、String_Quartette（作品）とStringQuartetEnsemble（団体）のように、日常語では両方の意味に使われるクラスの区別に注意。このバージョンでは、音楽作品、その表現（演奏、楽譜など）とイベント（演奏会）をより精密にモデリングするべく実験中。 @ja
version info: Version 0.9.6 - OWL DL version. Some stable, some experimental. Changed terms: Opera_Performance to Opera_Event, Ballet_Performance to Ballet_Event.

C-Flat major
description: C flat major
Alternative Title: C-Flat major
type: Key
type: Thing
label: Ces dur
comment: Major key based on C flat, whose key signature has 7 flats.

Access Rights
date: 2003-02-15
type: ObjectProperty
Relation: accessRights-002
sub property of: topObjectProperty
issued: 2003-02-15
type: Thing
date: 2008-01-14
sub property of: Rights
Date Modified: 2008-01-14
Has Version: accessRights-002
property disjoint with: bottomObjectProperty
range: Rights Statement
type: Property
comment: Information about who can access the resource or an indication of its security status.
description: Access Rights may include information regarding access or restrictions based on privacy, security, or other policies.

Online E-commerce Account
term status: unstable
type: Thing
disjoint with: Nothing
subclass of: Thing
subclass of: Online Account
type: Class
comment: An online e-commerce account.

Opus
sub property of: topDataProperty
sub property of: Identifier
property disjoint with: bottomDataProperty
type: DatatypeProperty
comment: The subject musical composition has an identifier assigned by a composer (e.g. 'op.131') or other editor (e.g. 'KV.551')
domain: Oeuvre
range: Literal

Friend of a Friend (FOAF) vocabulary
description: The Friend of a Friend (FOAF) RDF vocabulary, described using W3C RDF Schema and the Web Ontology Language.
type: Thing
type: Ontology

Provenance Statement
type: Thing
issued: 2008-01-14
Has Version: ProvenanceStatement-001
Relation: ProvenanceStatement-001
type: Class
subclass of: Thing
disjoint with: Nothing
date: 2008-01-14
comment: A statement of any changes in ownership and custody of a resource since its creation that are significant for its authenticity, integrity, and interpretation.

Conductor
type: Class
subclass of: Artist
subclass of: Director
subclass of: Agent
subclass of: Musician
subclass of: Thing
disjoint with: Nothing
comment: A Conductor

TGN
date: 2000-07-11
Has Version: TGN-003
Relation: TGN-003
Date Modified: 2008-01-14
date: 2008-01-14
type: Thing
type: VocabularyEncodingScheme
issued: 2000-07-11
comment: The set of places specified by the Getty Thesaurus of Geographic Names.

PerformerName
sub property of: Description
sub property of: topDataProperty
property disjoint with: bottomDataProperty
type: DatatypeProperty
comment: The subject musical event has a performer. Literal version of #performer.
domain: Musical Event
range: Literal

Dublin Core Metadata Element Set, Version 1.1
date: 2012-06-14
Date Modified: 2012-06-14
publisher: DCMI
type: Thing

Jurisdiction
Relation: Jurisdiction-001
date: 2008-01-14
subclass of: Location, Period, or Jurisdiction
issued: 2008-01-14
Has Version: Jurisdiction-001
subclass of: Thing
type: Class
type: Thing
disjoint with: Nothing
comment: The extent or range of judicial, law enforcement, or other authority.

Contrabass
disjoint with: Nothing
subclass of: Musical Instrument
subclass of: String Instrument
subclass of: Thing
type: Class
comment: The largest member of string insrtument, usually with four or five strings.

Violinist
subclass of: Agent
subclass of: Player
disjoint with: Nothing
subclass of: Artist
subclass of: Thing
type: Class
subclass of: Musician
comment: A Violn player
subclass of: http://lodlaundromat.org/.well-known/genid/samples/pellet///predicate//1db5ec77e444f4f38af2fda329ad1aa6/1db5ec77e444f4f38af2fda329ad1aa6#2

Key
disjoint with: Nothing
subclass of: Thing
type: Class
comment: A key of a musical work (e.g. C-dur, b-moll)

Group
type: Thing
subclass of: Agent
disjoint with: Nothing
type: Class
subclass of: Thing
term status: stable
comment: A class of Agents.

DCMI Type Vocabulary
Date Modified: 2012-06-14
Has Version: DCMIType-005
type: Thing
date: 2012-06-14
date: 2000-07-11
Relation: DCMIType-005
type: VocabularyEncodingScheme
issued: 2000-07-11
comment: The set of classes specified by the DCMI Type Vocabulary, used to categorize the nature or genre of the resource.

workplace homepage
term status: testing
type: Thing
sub property of: topObjectProperty
property disjoint with: bottomObjectProperty
type: ObjectProperty
type: Property
comment: A workplace homepage of some person; the homepage of an organization they work for.
domain: Person
range: Document

http://lodlaundromat.org/.well-known/genid/samples/pellet///predicate//1db5ec77e444f4f38af2fda329ad1aa6/1db5ec77e444f4f38af2fda329ad1aa6#26
type: Example
type: Thing
Code: <dc:title>Autograph score</dc:title> <dc:title>A copyist's socore used as engraver's copy</dc:title> <m:derivedFrom rdf:resource="urn:musicalsource:lvb/125/autograph"/>

Sketch
disjoint with: Nothing
subclass of: Musical Representation
subclass of: Written Representation
subclass of: Thing
type: Class
comment: A sketch, or a brief prelimary composition of a work.

Language
sub property of: topObjectProperty
Date Modified: 2008-01-14
Relation: languageT-001
Has Version: languageT-001
date: 2008-01-14
type: ObjectProperty
sub property of: Language
type: Thing
issued: 2008-01-14
property disjoint with: bottomObjectProperty
type: Property
description: Recommended best practice is to use a controlled vocabulary such as RFC 4646 [RFC4646].
comment: A language of the resource.
range: Linguistic System

Written Representation
disjoint with: Nothing
subclass of: Musical Representation
subclass of: Thing
type: Class
comment: Representation of a musical work in the form of a written expression, e.g. score, parts, autograph, printed music, sketch, etc.

account
term status: archaic
type: Thing
sub property of: topObjectProperty
property disjoint with: bottomObjectProperty
type: ObjectProperty
type: Property
comment: Indicates an account held by this agent.
domain: Agent
range: Online Account

Trombonist
subclass of: Artist
type: Class
subclass of: Musician
disjoint with: Nothing
subclass of: Player
subclass of: Thing
subclass of: Agent
comment: A Trombone player
subclass of: http://lodlaundromat.org/.well-known/genid/samples/pellet///predicate//1db5ec77e444f4f38af2fda329ad1aa6/1db5ec77e444f4f38af2fda329ad1aa6#16

Musical Event
disjoint with: Nothing
subclass of: Thing
type: Class
comment: An event of musical performance by players or singers, including theatrical staging. Typically the event has date and location. Note this is different from Performance, which is a 'representation' of a musical work realized at a musical event or recording, etc.

Image
type: Class
disjoint with: Organization
subclass of: Thing
type: Thing
disjoint with: Project
subclass of: Document
disjoint with: Nothing
term status: testing
comment: An image.

English Horn
disjoint with: Nothing
subclass of: Musical Instrument
subclass of: Oboe
subclass of: Woodwind Instrument
subclass of: Thing
type: Class
comment: A double-reed woodwind instrument, larger member of the oboe family.

Person
term status: stable
subclass of: SpatialThing
disjoint with: Nothing
subclass of: Agent
disjoint with: Project
subclass of: Person
subclass of: Thing
type: Class
type: Thing
disjoint with: Organization
comment: A person.

'circles and arrows' graphical representation of this example
type: Thing
type: Document
type: Image

C minor
description: C minor
Alternative Title: C minor
type: Key
type: Thing
label: c moll
comment: Minor key based on C, whose key signature has 3 flats.

phone
term status: testing
type: Thing
sub property of: topObjectProperty
property disjoint with: bottomObjectProperty
type: ObjectProperty
type: Property
comment: A phone, specified using fully qualified tel: URI scheme (refs: http://www.w3.org/Addressing/schemes.html#tel).

Composition
sub property of: topObjectProperty
sub property of: Description
property disjoint with: bottomObjectProperty
type: ObjectProperty
comment: Describes the composition process of the subject. Composition period or completion date, place, revision etc. can be described as properties of the object composition process.

Given name
term status: testing
type: Thing
sub property of: topDataProperty
property disjoint with: bottomDataProperty
type: DatatypeProperty
type: Property
comment: The given name of some person.

Religious Music
disjoint with: Nothing
subclass of: Oeuvre
subclass of: Musical Work
subclass of: Thing
type: Class
comment: A genre of music composed for performance as part of religious ceremonies

Is Required By
date: 2000-07-11
date: 2008-01-14
property disjoint with: bottomObjectProperty
Relation: isRequiredBy-003
Date Modified: 2008-01-14
sub property of: Relation
note: This term is intended to be used with non-literal values as defined in the DCMI Abstract Model (http://dublincore.org/documents/abstract-model/). As of December 2007, the DCMI Usage Board is seeking a way to express this intention with a formal range declaration.
Has Version: isRequiredBy-003
sub property of: topObjectProperty
type: ObjectProperty
issued: 2000-07-11
type: Thing
comment: A related resource that requires the described resource to support its function, delivery, or coherence.
type: Property

Key Name
sub property of: Description
sub property of: topDataProperty
property disjoint with: bottomDataProperty
type: DatatypeProperty
comment: The subject musical work or its movement has a key. Textual version of #key.
domain: Musical Work
range: Literal

depicts
term status: testing
type: Thing
sub property of: topObjectProperty
property disjoint with: bottomObjectProperty
inverse of: depiction
type: ObjectProperty
type: Property
comment: A thing depicted in this representation.
domain: Image
range: Thing

Woodwind Instrument
disjoint with: Nothing
subclass of: Musical Instrument
subclass of: Thing
type: Class
comment: A wind musical instrument, in which sound is produced by the vibration of reeds in the mouthpiece, or by the passing of air across the mouthpiece.

D-Sharp minor
description: D sharp minor
Alternative Title: D-Sharp minor
type: Key
type: Thing
label: dis moll
comment: Minor key based on D sharp, whose key signature has 6 sharps.

ISO 639-3
date: 2008-01-14
Relation: ISO639-3-001
issued: 2008-01-14
Has Version: ISO639-3-001
type: Thing
type: Datatype
comment: The set of three-letter codes listed in ISO 639-3 for the representation of names of languages.

TubaPlayer
subclass of: Musician
disjoint with: Nothing
type: Class
subclass of: Agent
subclass of: Thing
subclass of: Player
subclass of: Artist
comment: A Tuba player
subclass of: http://lodlaundromat.org/.well-known/genid/samples/pellet///predicate//1db5ec77e444f4f38af2fda329ad1aa6/1db5ec77e444f4f38af2fda329ad1aa6#17

Percussion
disjoint with: Nothing
subclass of: Musical Instrument
subclass of: Thing
type: Class
comment: A musical instrument that produces sound by striking the body.

name
term status: testing
type: Thing
sub property of: topDataProperty
property disjoint with: bottomDataProperty
type: DatatypeProperty
type: Property
comment: A name for some thing.
domain: Thing
range: Literal
sub property of: label

Plays
sub property of: topObjectProperty
sub property of: Artist Description
property disjoint with: bottomObjectProperty
type: ObjectProperty
comment: The subject artist (or group, machine, etc) plays an musical instrument. If :me :plays :Violin, then :me a :Violininst.
range: Musical Instrument

Publisher
Date Modified: 2008-01-14
issued: 1999-07-02
type: Thing
date: 2008-01-14
Relation: publisher-006
type: ObjectProperty
Has Version: publisher-006
date: 1999-07-02
note: A second property with the same name as this property has been declared in the dcterms: namespace (http://purl.org/dc/terms/). See the Introduction to the document "DCMI Metadata Terms" (http://dublincore.org/documents/dcmi-terms/) for an explanation.
sub property of: topObjectProperty
property disjoint with: bottomObjectProperty
description: Examples of a Publisher include a person, an organization, or a service. Typically, the name of a Publisher should be used to indicate the entity.
type: Property
comment: An entity responsible for making the resource available.

ContrafagottoPlayer
subclass of: Agent
disjoint with: Nothing
subclass of: Musician
subclass of: Artist
subclass of: Player
type: Class
subclass of: Thing
subclass of: Bassoonist
comment: A Contrafagotto player
subclass of: http://lodlaundromat.org/.well-known/genid/samples/pellet///predicate//1db5ec77e444f4f38af2fda329ad1aa6/1db5ec77e444f4f38af2fda329ad1aa6#13

Qtring Quartet
disjoint with: Nothing
subclass of: Musical Group
subclass of: Artist
subclass of: Thing
subclass of: Agent
type: Class
comment: A musical group of four string players. Note 'String_Quartette' is SQ as musical work in this vocabulary.

E major
description: E major
Alternative Title: E major
type: Key
type: Thing
label: E dur
comment: Major key based on E, whose key signature has 4 sharps.

Flutist
subclass of: Agent
subclass of: Thing
subclass of: Artist
type: Class
subclass of: Player
subclass of: Musician
disjoint with: Nothing
comment: A Flute player
subclass of: http://lodlaundromat.org/.well-known/genid/samples/pellet///predicate//1db5ec77e444f4f38af2fda329ad1aa6/1db5ec77e444f4f38af2fda329ad1aa6#6

Overture
disjoint with: Nothing
subclass of: Oeuvre
subclass of: Musical Work
subclass of: Orchestral Work
subclass of: Thing
type: Class
comment: An orchestral music composed for the opening of an opera or oratorio, often played as an independend work in concerts

D minor
description: D minor
Alternative Title: D minor
type: Key
type: Thing
label: d moll
comment: Minor key based on D, whose key signature has 1 flat.

Chamber Music
disjoint with: Nothing
subclass of: Oeuvre
subclass of: Musical Work
subclass of: Thing
type: Class
comment: A genre of music composed for performance by small ensemble

Orchestral Work
disjoint with: Nothing
subclass of: Oeuvre
subclass of: Musical Work
subclass of: Thing
type: Class
comment: A composition for orchestra (and a soloist or soloists, optionally with chorus)

Orchestra
disjoint with: Nothing
subclass of: Musical Group
subclass of: Artist
subclass of: Thing
subclass of: Agent
type: Class
comment: A musical group which perfroms large scale symphonic works

Mezzo Soprano
subclass of: Singer
subclass of: Artist
disjoint with: Nothing
subclass of: Thing
subclass of: Agent
subclass of: Musician
type: Class
comment: A Mezzo Soprano singer

Musical Representation
disjoint with: Nothing
subclass of: Thing
type: Class
comment: Representation of a musical work, such as a score, sheet music, perfornamce, recoding, etc.

Is Version Of
note: This term is intended to be used with non-literal values as defined in the DCMI Abstract Model (http://dublincore.org/documents/abstract-model/). As of December 2007, the DCMI Usage Board is seeking a way to express this intention with a formal range declaration.
date: 2008-01-14
type: ObjectProperty
Has Version: isVersionOf-003
sub property of: Relation
date: 2000-07-11
sub property of: topObjectProperty
type: Thing
issued: 2000-07-11
Relation: isVersionOf-003
property disjoint with: bottomObjectProperty
Date Modified: 2008-01-14
type: Property
comment: A related resource of which the described resource is a version, edition, or adaptation.
description: Changes in version imply substantive changes in content rather than differences in format.

Choral Music
disjoint with: Nothing
subclass of: Oeuvre
subclass of: Musical Work
subclass of: Thing
type: Class
comment: A genre of music composed for performance by a chorus or choir

nickname
term status: testing
type: Thing
sub property of: topDataProperty
property disjoint with: bottomDataProperty
type: DatatypeProperty
type: Property
comment: A short informal nickname characterising an agent (includes login identifiers, IRC and other chat nicknames).

Ballet Event
disjoint with: Nothing
equivalent class: Ballet Performance
subclass of: Musical Event
subclass of: Thing
subclass of: Ballet Performance
type: Class
comment: An event of ballet performance

English Horn player
subclass of: Oboist
subclass of: Player
subclass of: Agent
subclass of: Artist
subclass of: Thing
disjoint with: Nothing
type: Class
subclass of: Musician
comment: An English Horn player
subclass of: http://lodlaundromat.org/.well-known/genid/samples/pellet///predicate//1db5ec77e444f4f38af2fda329ad1aa6/1db5ec77e444f4f38af2fda329ad1aa6#9

Conforms To
date: 2001-05-21
issued: 2001-05-21
type: ObjectProperty
Date Modified: 2008-01-14
property disjoint with: bottomObjectProperty
date: 2008-01-14
sub property of: Relation
Has Version: conformsTo-003
Relation: conformsTo-003
sub property of: topObjectProperty
type: Thing
range: Standard
comment: An established standard to which the described resource conforms.
type: Property

Mandolin
disjoint with: Nothing
subclass of: Musical Instrument
subclass of: String Instrument
subclass of: Thing
type: Class
comment: A pear-shaped small stringed instrument descended from the lute, played with a pick.

Date Issued
date: 2008-01-14
Relation: issued-003
sub property of: Date
sub property of: topDataProperty
type: DatatypeProperty
property disjoint with: bottomDataProperty
type: Thing
Has Version: issued-003
date: 2000-07-11
Date Modified: 2008-01-14
issued: 2000-07-11
range: Literal
comment: Date of formal issuance (e.g., publication) of the resource.
type: Property

Yahoo chat ID
term status: testing
type: DatatypeProperty
type: Thing
sub property of: topDataProperty
property disjoint with: bottomDataProperty
sub property of: nickname
type: InverseFunctionalProperty
domain: Agent
range: Literal
comment: A Yahoo chat ID
type: Property

Abstract
date: 2008-01-14
sub property of: topDataProperty
type: DatatypeProperty
property disjoint with: bottomDataProperty
type: Thing
issued: 2000-07-11
sub property of: Description
Relation: abstract-003
date: 2000-07-11
Has Version: abstract-003
Date Modified: 2008-01-14
type: Property
comment: A summary of the resource.

current project
term status: testing
type: Thing
sub property of: topObjectProperty
property disjoint with: bottomObjectProperty
type: ObjectProperty
type: Property
comment: A current project this person works on.
domain: Person
range: Thing

Method of Accrual
type: Thing
disjoint with: Nothing
Has Version: MethodOfAccrual-001
Relation: MethodOfAccrual-001
issued: 2008-01-14
date: 2008-01-14
type: Class
subclass of: Thing
comment: A method by which resources are added to a collection.

AIM chat ID
type: DatatypeProperty
property disjoint with: bottomDataProperty
sub property of: topDataProperty
type: InverseFunctionalProperty
term status: testing
type: Thing
sub property of: nickname
type: Property
domain: Agent
comment: An AIM chat ID
range: Literal

Date
type: DatatypeProperty
Relation: date-006
Date Modified: 2008-01-14
Has Version: date-006
date: 2008-01-14
property disjoint with: bottomDataProperty
note: A second property with the same name as this property has been declared in the dcterms: namespace (http://purl.org/dc/terms/). See the Introduction to the document "DCMI Metadata Terms" (http://dublincore.org/documents/dcmi-terms/) for an explanation.
date: 1999-07-02
type: Thing
issued: 1999-07-02
sub property of: topDataProperty
description: Date may be used to express temporal information at any level of granularity. Recommended best practice is to use an encoding scheme, such as the W3CDTF profile of ISO 8601 [W3CDTF].
type: Property
comment: A point or period of time associated with an event in the lifecycle of the resource.

Soprano
type: Class
subclass of: Agent
subclass of: Singer
subclass of: Musician
disjoint with: Nothing
subclass of: Thing
subclass of: Artist
comment: A Soprano singer

E-Flat minor
description: E flat minor
Alternative Title: E-Flat minor
type: Key
type: Thing
label: es moll
comment: Minor key based on E flat, whose key signature has 6 flats.

Basset Horn
disjoint with: Nothing
subclass of: Musical Instrument
subclass of: Clarinet
subclass of: Woodwind Instrument
subclass of: Thing
type: Class
comment: A larger member of the clarinet family, typically in lower F, and has darker and less brilliant timbre.

Trombone
disjoint with: Nothing
subclass of: Musical Instrument
subclass of: Brass Instrument
subclass of: Thing
type: Class
comment: A brass instrument consisting of a long cylindrical tube, and having a movable U-shaped slide for producing different pitches.

Harp
disjoint with: Nothing
subclass of: Musical Instrument
subclass of: String Instrument
subclass of: Thing
type: Class
comment: An instrument with usually 46 or 47 strings that are played by plucking with the fingers.

Audience
property disjoint with: bottomObjectProperty
date: 2001-05-21
Date Modified: 2008-01-14
date: 2008-01-14
sub property of: topObjectProperty
issued: 2001-05-21
Has Version: audience-003
Relation: audience-003
type: ObjectProperty
type: Thing
type: Property
comment: A class of entity for whom the resource is intended or useful.
range: Agent Class

Opera (Work)
disjoint with: Nothing
subclass of: Oeuvre
subclass of: Musical Work
subclass of: Thing
type: Class
comment: A musical work with drama, song, chorus and orchestral music. Note 'Opera_Event' in this vocabulary describes the performance of an opera.

References
Relation: references-003
note: This term is intended to be used with non-literal values as defined in the DCMI Abstract Model (http://dublincore.org/documents/abstract-model/). As of December 2007, the DCMI Usage Board is seeking a way to express this intention with a formal range declaration.
issued: 2000-07-11
date: 2000-07-11
sub property of: topObjectProperty
property disjoint with: bottomObjectProperty
Date Modified: 2008-01-14
date: 2008-01-14
type: ObjectProperty
type: Thing
sub property of: Relation
Has Version: references-003
type: Property
comment: A related resource that is referenced, cited, or otherwise pointed to by the described resource.

http://lodlaundromat.org/.well-known/genid/samples/pellet///predicate//1db5ec77e444f4f38af2fda329ad1aa6/1db5ec77e444f4f38af2fda329ad1aa6#27
type: Example
type: Thing
Code: <m:conductor foaf:name="Sir Roger Norrington"/> <m:performer foaf:name="R.S.O. Stuttgart"/> <m:composer foaf:name="Brahms"/> <dc:title>Symphony No.2 D major</dc:title>

A-Flat minor
description: A flat minor
Alternative Title: A-Flat minor
type: Key
type: Thing
label: as moll
comment: Minor key based on A flat, whose key signature has 7 flats.

Alternative Title
property disjoint with: bottomDataProperty
sub property of: Title
Relation: alternative-003
date: 2000-07-11
date: 2010-10-11
type: Thing
Date Modified: 2010-10-11
issued: 2000-07-11
sub property of: topDataProperty
Has Version: alternative-003
type: DatatypeProperty
type: Property
range: Literal
description: The distinction between titles and alternative titles is application-specific.
comment: An alternative name for the resource.

Musician
disjoint with: Nothing
subclass of: Artist
subclass of: Thing
subclass of: Agent
type: Class
comment: An artist who performs, composes or conducts music

Identifier
sub property of: Identifier
type: DatatypeProperty
Relation: identifierT-001
sub property of: topDataProperty
date: 2008-01-14
Has Version: identifierT-001
issued: 2008-01-14
property disjoint with: bottomDataProperty
Date Modified: 2008-01-14
type: Thing
range: Literal
description: Recommended best practice is to identify the resource by means of a string conforming to a formal identification system.
type: Property
comment: An unambiguous reference to the resource within a given context.

Relation
property disjoint with: bottomObjectProperty
issued: 1999-07-02
type: Thing
Relation: relation-006
type: ObjectProperty
date: 1999-07-02
Date Modified: 2008-01-14
sub property of: topObjectProperty
Has Version: relation-006
date: 2008-01-14
note: A second property with the same name as this property has been declared in the dcterms: namespace (http://purl.org/dc/terms/). See the Introduction to the document "DCMI Metadata Terms" (http://dublincore.org/documents/dcmi-terms/) for an explanation.
description: Recommended best practice is to identify the related resource by means of a string conforming to a formal identification system.
type: Property
comment: A related resource.

Rights
type: Thing
property disjoint with: bottomObjectProperty
Has Version: rights-006
date: 1999-07-02
date: 2008-01-14
issued: 1999-07-02
Relation: rights-006
sub property of: topObjectProperty
note: A second property with the same name as this property has been declared in the dcterms: namespace (http://purl.org/dc/terms/). See the Introduction to the document "DCMI Metadata Terms" (http://dublincore.org/documents/dcmi-terms/) for an explanation.
type: ObjectProperty
Date Modified: 2008-01-14
description: Typically, rights information includes a statement about various property rights associated with the resource, including intellectual property rights.
type: Property
comment: Information about rights held in and over the resource.

Baritone
disjoint with: Nothing
subclass of: Agent
subclass of: Thing
subclass of: Musician
type: Class
subclass of: Artist
subclass of: Singer
comment: A Baritone singer

Instructional Method
property disjoint with: bottomObjectProperty
Date Modified: 2008-01-14
Relation: instructionalMethod-002
Has Version: instructionalMethod-002
sub property of: topObjectProperty
date: 2008-01-14
type: Thing
date: 2005-06-13
type: ObjectProperty
issued: 2005-06-13
description: Instructional Method will typically include ways of presenting instructional materials or conducting instructional activities, patterns of learner-to-learner and learner-to-instructor interactions, and mechanisms by which group and individual levels of learning are measured. Instructional methods include all aspects of the instruction and learning processes from planning and implementation through evaluation and feedback.
type: Property
comment: A process, used to engender knowledge, attitudes and skills, that the described resource is designed to support.
range: Method of Instruction

schoolHomepage
term status: testing
type: Thing
sub property of: topObjectProperty
property disjoint with: bottomObjectProperty
type: ObjectProperty
type: Property
comment: A homepage of a school attended by the person.
domain: Person
range: Document

geekcode
term status: archaic
type: Thing
sub property of: topDataProperty
property disjoint with: bottomDataProperty
type: DatatypeProperty
type: Property
comment: A textual geekcode for this person, see http://www.geekcode.com/geek.html
domain: Person
range: Literal

family_name
term status: archaic
type: Thing
sub property of: topDataProperty
property disjoint with: bottomDataProperty
type: DatatypeProperty
type: Property
comment: The family name of some person.
domain: Person
range: Literal

Date Submitted
date: 2002-07-13
property disjoint with: bottomDataProperty
sub property of: Date
type: Thing
Relation: dateSubmitted-002
date: 2008-01-14
Date Modified: 2008-01-14
issued: 2002-07-13
type: DatatypeProperty
sub property of: topDataProperty
Has Version: dateSubmitted-002
type: Property
range: Literal
comment: Date of submission of the resource.
description: Examples of resources to which a Date Submitted may be relevant are a thesis (submitted to a university department) or an article (submitted to a journal).

Is Format Of
date: 2000-07-11
date: 2008-01-14
Relation: isFormatOf-003
Has Version: isFormatOf-003
property disjoint with: bottomObjectProperty
Date Modified: 2008-01-14
issued: 2000-07-11
sub property of: Relation
note: This term is intended to be used with non-literal values as defined in the DCMI Abstract Model (http://dublincore.org/documents/abstract-model/). As of December 2007, the DCMI Usage Board is seeking a way to express this intention with a formal range declaration.
type: Thing
type: ObjectProperty
sub property of: topObjectProperty
type: Property
comment: A related resource that is substantially the same as the described resource, but in another format.

Marks
sub property of: Description
sub property of: topDataProperty
property disjoint with: bottomDataProperty
type: DatatypeProperty
comment: The subject musical work or its movement has instruction mark(s) of tempo and/or expression
domain: Musical Work
range: Literal

Mediator
type: ObjectProperty
Relation: mediator-003
date: 2008-01-14
issued: 2001-05-21
sub property of: topObjectProperty
Has Version: mediator-003
property disjoint with: bottomObjectProperty
Date Modified: 2008-01-14
date: 2001-05-21
type: Thing
sub property of: Audience
type: Property
range: Agent Class
comment: An entity that mediates access to the resource and for whom the resource is intended or useful.
description: In an educational context, a mediator might be a parent, teacher, teaching assistant, or care-giver.

Organization
term status: stable
disjoint with: Image
subclass of: Agent
disjoint with: Nothing
disjoint with: Person
disjoint with: Document
subclass of: Thing
type: Thing
disjoint with: PersonalProfileDocument
type: Class
comment: An organization.

Program Line
sub property of: Description
sub property of: topDataProperty
property disjoint with: bottomDataProperty
type: DatatypeProperty
comment: The subject musical event presents a musical work as its program. Literal version of #program.
domain: Musical Event
range: Literal

Policy
Relation: Policy-001
type: Class
date: 2008-01-14
issued: 2008-01-14
Has Version: Policy-001
type: Thing
disjoint with: Nothing
subclass of: Thing
comment: A plan or course of action by an authority, intended to influence and determine decisions, actions, and other matters.

Coverage
date: 1999-07-02
date: 2008-01-14
type: Thing
property disjoint with: bottomObjectProperty
type: ObjectProperty
Date Modified: 2008-01-14
Has Version: coverage-006
issued: 1999-07-02
note: A second property with the same name as this property has been declared in the dcterms: namespace (http://purl.org/dc/terms/). See the Introduction to the document "DCMI Metadata Terms" (http://dublincore.org/documents/dcmi-terms/) for an explanation.
sub property of: topObjectProperty
Relation: coverage-006
description: Spatial topic and spatial applicability may be a named place or a location specified by its geographic coordinates. Temporal topic may be a named period, date, or date range. A jurisdiction may be a named administrative entity or a geographic place to which the resource applies. Recommended best practice is to use a controlled vocabulary such as the Thesaurus of Geographic Names [TGN]. Where appropriate, named places or time periods can be used in preference to numeric identifiers such as sets of coordinates or date ranges.
type: Property
comment: The spatial or temporal topic of the resource, the spatial applicability of the resource, or the jurisdiction under which the resource is relevant.

Text
disjoint with: Nothing
subclass of: Oeuvre
subclass of: Musical Work
subclass of: Thing
type: Class
comment: Text of a musical work (e.g. lyric or verse)

Venue
sub property of: topObjectProperty
sub property of: Event Description
property disjoint with: bottomObjectProperty
type: ObjectProperty
comment: The subject musical event is presented at the object venue.
range: Venue

Cello
disjoint with: Nothing
subclass of: Musical Instrument
subclass of: String Instrument
subclass of: Thing
type: Class
comment: A stringed instrument of the violin family, with bass to tenor tone. Usually played in sitting position.

Method of Instruction
issued: 2008-01-14
subclass of: Thing
type: Thing
Relation: MethodOfInstruction-001
type: Class
disjoint with: Nothing
date: 2008-01-14
Has Version: MethodOfInstruction-001
comment: A process that is used to engender knowledge, attitudes, and skills.

Tenor
subclass of: Agent
subclass of: Musician
subclass of: Thing
disjoint with: Nothing
subclass of: Artist
subclass of: Singer
type: Class
comment: A Tenor singer

Oeuvre
disjoint with: Nothing
subclass of: Musical Work
subclass of: Thing
type: Class
comment: A (complete) musical work by a composer.

focus
term status: testing
type: Thing
sub property of: topObjectProperty
property disjoint with: bottomObjectProperty
type: ObjectProperty
type: Property
comment: The underlying or 'focal' entity associated with some SKOS-described concept.
domain: Concept
range: Thing

Example
disjoint with: Nothing
subclass of: Thing
type: Class
comment: A class represents one example.
comment: ひとつの例を表すクラス @ja

Timpanist
subclass of: Musician
type: Class
subclass of: Agent
subclass of: Thing
subclass of: Artist
subclass of: Player
disjoint with: Nothing
comment: A Timpani player
subclass of: http://lodlaundromat.org/.well-known/genid/samples/pellet///predicate//1db5ec77e444f4f38af2fda329ad1aa6/1db5ec77e444f4f38af2fda329ad1aa6#18

Size or Duration
subclass of: Thing
disjoint with: Nothing
type: Thing
Relation: SizeOrDuration-001
date: 2008-01-14
type: Class
subclass of: Media Type or Extent
Has Version: SizeOrDuration-001
issued: 2008-01-14
description: Examples include a number of pages, a specification of length, width, and breadth, or a period in hours, minutes, and seconds.
comment: A dimension or extent, or a time taken to play or execute.

Subject
property disjoint with: bottomObjectProperty
Date Modified: 2012-06-14
sub property of: topObjectProperty
type: ObjectProperty
date: 1999-07-02
Relation: subject-007
note: A second property with the same name as this property has been declared in the dcterms: namespace (http://purl.org/dc/terms/). See the Introduction to the document "DCMI Metadata Terms" (http://dublincore.org/documents/dcmi-terms/) for an explanation.
type: Thing
date: 2012-06-14
Has Version: subject-007
issued: 1999-07-02
description: Typically, the subject will be represented using keywords, key phrases, or classification codes. Recommended best practice is to use a controlled vocabulary.
type: Property
comment: The topic of the resource.

Format
type: Thing
date: 2008-01-14
sub property of: topObjectProperty
property disjoint with: bottomObjectProperty
Date Modified: 2008-01-14
date: 1999-07-02
issued: 1999-07-02
note: A second property with the same name as this property has been declared in the dcterms: namespace (http://purl.org/dc/terms/). See the Introduction to the document "DCMI Metadata Terms" (http://dublincore.org/documents/dcmi-terms/) for an explanation.
Relation: format-007
Has Version: format-007
type: ObjectProperty
description: Examples of dimensions include size and duration. Recommended best practice is to use a controlled vocabulary such as the list of Internet Media Types [MIME].
type: Property
comment: The file format, physical medium, or dimensions of the resource.

made
inverse of: maker
type: ObjectProperty
type: Thing
inverse of: Creator
property disjoint with: bottomObjectProperty
sub property of: topObjectProperty
term status: stable
type: Property
comment: Something that was made by this agent.
domain: Agent
range: Thing

topic_interest
term status: testing
type: Thing
sub property of: topObjectProperty
property disjoint with: bottomObjectProperty
type: ObjectProperty
type: Property
comment: A thing of interest to this person.
domain: Agent
range: Thing

past project
term status: testing
type: Thing
sub property of: topObjectProperty
property disjoint with: bottomObjectProperty
type: ObjectProperty
type: Property
comment: A project this person has previously worked on.
domain: Person
range: Thing

RFC 1766
Has Version: RFC1766-003
date: 2008-01-14
date: 2000-07-11
Date Modified: 2008-01-14
type: Thing
Relation: RFC1766-003
issued: 2000-07-11
type: Datatype
comment: The set of tags, constructed according to RFC 1766, for the identification of languages.

MSN chat ID
sub property of: nickname
property disjoint with: bottomDataProperty
type: Thing
sub property of: topDataProperty
type: InverseFunctionalProperty
term status: testing
type: DatatypeProperty
comment: An MSN chat ID
domain: Agent
type: Property
range: Literal

Is Referenced By
type: ObjectProperty
property disjoint with: bottomObjectProperty
date: 2008-01-14
Date Modified: 2008-01-14
date: 2000-07-11
sub property of: topObjectProperty
issued: 2000-07-11
sub property of: Relation
type: Thing
note: This term is intended to be used with non-literal values as defined in the DCMI Abstract Model (http://dublincore.org/documents/abstract-model/). As of December 2007, the DCMI Usage Board is seeking a way to express this intention with a formal range declaration.
Relation: isReferencedBy-003
Has Version: isReferencedBy-003
comment: A related resource that references, cites, or otherwise points to the described resource.
type: Property

DCMI Point
date: 2008-01-14
Relation: Point-003
Date Modified: 2008-01-14
type: Thing
date: 2000-07-11
issued: 2000-07-11
Has Version: Point-003
type: Datatype
comment: The set of points in space defined by their geographic coordinates according to the DCMI Point Encoding Scheme.

Requires
Relation: requires-003
Has Version: requires-003
sub property of: topObjectProperty
issued: 2000-07-11
date: 2008-01-14
sub property of: Relation
date: 2000-07-11
note: This term is intended to be used with non-literal values as defined in the DCMI Abstract Model (http://dublincore.org/documents/abstract-model/). As of December 2007, the DCMI Usage Board is seeking a way to express this intention with a formal range declaration.
property disjoint with: bottomObjectProperty
Date Modified: 2008-01-14
type: Thing
type: ObjectProperty
type: Property
comment: A related resource that is required by the described resource to support its function, delivery, or coherence.

based near
term status: testing
type: Thing
sub property of: topObjectProperty
property disjoint with: bottomObjectProperty
type: ObjectProperty
type: Property
comment: A location that something is based near, for some broadly human notion of near.
domain: SpatialThing
range: SpatialThing

created
sub property of: Date
sub property of: Date Created
sub property of: topDataProperty
property disjoint with: bottomDataProperty
type: DatatypeProperty
type: Property

primary topic
type: FunctionalProperty
sub property of: topic
term status: stable
type: ObjectProperty
type: Thing
inverse of: is primary topic of
sub property of: topObjectProperty
property disjoint with: bottomObjectProperty
domain: Document
range: Thing
type: Property
comment: The primary topic of some page or document.

Violist
subclass of: Musician
subclass of: Artist
subclass of: Agent
type: Class
disjoint with: Nothing
subclass of: Thing
subclass of: Player
comment: A Viola player
subclass of: http://lodlaundromat.org/.well-known/genid/samples/pellet///predicate//1db5ec77e444f4f38af2fda329ad1aa6/1db5ec77e444f4f38af2fda329ad1aa6#3

Rights
property disjoint with: bottomObjectProperty
type: Thing
issued: 2008-01-14
Relation: rightsT-001
Date Modified: 2008-01-14
sub property of: topObjectProperty
Has Version: rightsT-001
date: 2008-01-14
sub property of: Rights
type: ObjectProperty
range: Rights Statement
description: Typically, rights information includes a statement about various property rights associated with the resource, including intellectual property rights.
comment: Information about rights held in and over the resource.
type: Property

Subject
Has Version: subjectT-002
Date Modified: 2012-06-14
Relation: subjectT-002
type: ObjectProperty
type: Thing
date: 2012-06-14
property disjoint with: bottomObjectProperty
issued: 2008-01-14
sub property of: Subject
sub property of: topObjectProperty
date: 2008-01-14
note: This term is intended to be used with non-literal values as defined in the DCMI Abstract Model (http://dublincore.org/documents/abstract-model/). As of December 2007, the DCMI Usage Board is seeking a way to express this intention with a formal range declaration.
description: Typically, the subject will be represented using keywords, key phrases, or classification codes. Recommended best practice is to use a controlled vocabulary.
type: Property
comment: The topic of the resource.

Piccolo player
subclass of: Agent
subclass of: Flutist
subclass of: Musician
subclass of: Artist
subclass of: Thing
type: Class
disjoint with: Nothing
subclass of: Player
comment: A Piccolo flute player
subclass of: http://lodlaundromat.org/.well-known/genid/samples/pellet///predicate//1db5ec77e444f4f38af2fda329ad1aa6/1db5ec77e444f4f38af2fda329ad1aa6#7

Period of Time
subclass of: Thing
type: Thing
issued: 2008-01-14
date: 2008-01-14
type: Class
subclass of: Location, Period, or Jurisdiction
Has Version: PeriodOfTime-001
Relation: PeriodOfTime-001
disjoint with: Nothing
comment: An interval of time that is named or defined by its start and end dates.

sha1sum of a personal mailbox URI name
term status: testing
type: Thing
sub property of: topDataProperty
property disjoint with: bottomDataProperty
type: InverseFunctionalProperty
type: DatatypeProperty
type: Property
comment: The sha1sum of the URI of an Internet mailbox associated with exactly one owner, the first owner of the mailbox.
domain: Agent
range: Literal

is primary topic of
sub property of: topObjectProperty
property disjoint with: bottomObjectProperty
type: Thing
type: ObjectProperty
sub property of: page
type: InverseFunctionalProperty
term status: stable
inverse of: primary topic
comment: A document that this thing is the primary topic of.
domain: Thing
range: Document
type: Property

Composer
disjoint with: Nothing
subclass of: Artist
subclass of: Thing
subclass of: Agent
type: Class
comment: A person (or any agent) who composed art works

Contributor
date: 2008-01-14
issued: 1999-07-02
type: Thing
date: 1999-07-02
type: ObjectProperty
Relation: contributor-006
property disjoint with: bottomObjectProperty
Date Modified: 2008-01-14
sub property of: topObjectProperty
note: A second property with the same name as this property has been declared in the dcterms: namespace (http://purl.org/dc/terms/). See the Introduction to the document "DCMI Metadata Terms" (http://dublincore.org/documents/dcmi-terms/) for an explanation.
Has Version: contributor-006
description: Examples of a Contributor include a person, an organization, or a service. Typically, the name of a Contributor should be used to indicate the entity.
type: Property
comment: An entity responsible for making contributions to the resource.

Rights Holder
date: 2004-06-14
Relation: rightsHolder-002
issued: 2004-06-14
type: Thing
date: 2008-01-14
type: ObjectProperty
property disjoint with: bottomObjectProperty
sub property of: topObjectProperty
Date Modified: 2008-01-14
Has Version: rightsHolder-002
type: Property
comment: A person or organization owning or managing rights over the resource.
range: Agent

Spatial Coverage
date: 2008-01-14
type: ObjectProperty
Relation: spatial-003
date: 2000-07-11
issued: 2000-07-11
Date Modified: 2008-01-14
property disjoint with: bottomObjectProperty
Has Version: spatial-003
sub property of: topObjectProperty
sub property of: Coverage
type: Thing
type: Property
range: Location
comment: Spatial characteristics of the resource.

Publisher
Relation: publisherT-001
Date Modified: 2010-10-11
date: 2008-01-14
issued: 2008-01-14
date: 2010-10-11
type: Thing
Has Version: publisherT-001
sub property of: topObjectProperty
property disjoint with: bottomObjectProperty
sub property of: Publisher
type: ObjectProperty
range: Agent
comment: An entity responsible for making the resource available.
type: Property
description: Examples of a Publisher include a person, an organization, or a service.

logo
term status: testing
type: Thing
sub property of: topObjectProperty
property disjoint with: bottomObjectProperty
type: InverseFunctionalProperty
type: ObjectProperty
type: Property
comment: A logo representing some thing.
domain: Thing
range: Thing

Rights Statement
type: Thing
subclass of: Thing
Has Version: RightsStatement-001
Relation: RightsStatement-001
disjoint with: Nothing
date: 2008-01-14
type: Class
issued: 2008-01-14
comment: A statement about the intellectual property rights (IPR) held in or over a Resource, a legal document giving official permission to do something with a resource, or a statement about access rights.

Venue
disjoint with: Nothing
subclass of: Thing
type: Class
comment: A venue for musical performance, e.g. concert hall, opera house, recital hall, etc.

Percussionist
subclass of: Musician
subclass of: Artist
subclass of: Agent
subclass of: Thing
type: Class
disjoint with: Nothing
subclass of: Player
comment: A Percussion player
subclass of: http://lodlaundromat.org/.well-known/genid/samples/pellet///predicate//1db5ec77e444f4f38af2fda329ad1aa6/1db5ec77e444f4f38af2fda329ad1aa6#22

Clarinettist
subclass of: Agent
type: Class
subclass of: Musician
subclass of: Player
disjoint with: Nothing
subclass of: Thing
subclass of: Artist
comment: A Clarinet player
subclass of: http://lodlaundromat.org/.well-known/genid/samples/pellet///predicate//1db5ec77e444f4f38af2fda329ad1aa6/1db5ec77e444f4f38af2fda329ad1aa6#10

Guitar
disjoint with: Nothing
subclass of: Musical Instrument
subclass of: String Instrument
subclass of: Thing
type: Class
comment: A musical instrument having a large flat-backed sound box, a long fretted neck, and usually six strings, played by strumming or plucking.

Performs
sub property of: topObjectProperty
sub property of: Artist Description
property disjoint with: bottomObjectProperty
inverse of: Performer
type: ObjectProperty
comment: The subject artist (or group, machine, etc) performs a musical work.
domain: Agent

Bassoon
disjoint with: Nothing
subclass of: Musical Instrument
subclass of: Woodwind Instrument
subclass of: Thing
type: Class
comment: A low-pitched woodwind instrument with a double reed, having a long wooden body attached to a U-shaped lateral tube that leads to the mouthpiece. A Fagotto.

Represents
sub property of: topObjectProperty
property disjoint with: bottomObjectProperty
type: ObjectProperty
comment: The subject (performance, score, etc) is a representation of the object musical work. An experiment to have better model.
domain: Musical Representation
range: Musical Work

see other
sub property of: topObjectProperty
property disjoint with: bottomObjectProperty
type: ObjectProperty
type: Property
sub property of: seeAlso

MeSH
Date Modified: 2008-01-14
date: 2008-01-14
date: 2000-07-11
Has Version: MESH-003
type: Thing
issued: 2000-07-11
Relation: MESH-003
type: VocabularyEncodingScheme
comment: The set of labeled concepts specified by the Medical Subject Headings.

image
term status: testing
type: Thing
sub property of: topObjectProperty
sub property of: depiction
property disjoint with: bottomObjectProperty
type: ObjectProperty
type: Property
comment: An image that can be used to represent some thing (ie. those depictions which are particularly representative of something, eg. one's photo on a homepage).
domain: Person
range: Image

Project
disjoint with: PersonalProfileDocument
type: Class
term status: testing
disjoint with: Document
subclass of: Thing
disjoint with: Nothing
disjoint with: Image
disjoint with: Person
type: Thing
comment: A project (a collective endeavour of some kind).

account name
term status: testing
type: Thing
sub property of: topDataProperty
property disjoint with: bottomDataProperty
type: DatatypeProperty
type: Property
comment: Indicates the name (identifier) associated with this online account.
domain: Online Account
range: Literal

Identifier
date: 2008-01-14
type: Thing
sub property of: topDataProperty
note: A second property with the same name as this property has been declared in the dcterms: namespace (http://purl.org/dc/terms/). See the Introduction to the document "DCMI Metadata Terms" (http://dublincore.org/documents/dcmi-terms/) for an explanation.
property disjoint with: bottomDataProperty
Date Modified: 2008-01-14
type: DatatypeProperty
Relation: identifier-006
issued: 1999-07-02
date: 1999-07-02
Has Version: identifier-006
comment: An unambiguous reference to the resource within a given context.
description: Recommended best practice is to identify the resource by means of a string conforming to a formal identification system.
type: Property

Location
Relation: Location-001
date: 2008-01-14
type: Class
subclass of: Location, Period, or Jurisdiction
type: Thing
issued: 2008-01-14
Has Version: Location-001
subclass of: Thing
disjoint with: Nothing
comment: A spatial region or named place.

Example vocabulary
Date Created: 2003-07-04
creator: 神崎正英
Date Modified: 2007-12-13
type: Thing
date: 2003-07-04
date: 2007-12-13
type: Ontology
imports: dliser.rdf
comment: Vocabulary to include sample codes in a schema. Can work with XSLT (http://purl.org/net/ns/ns-schema.xsl) to present schema as XHTML list with examples.
comment: スキーマにサンプルコードを埋め込むための語彙。XSLTを使って、XHTMLの中で例を表示させることができる。 @ja
version info: Version 0.35

Tuba
disjoint with: Nothing
subclass of: Musical Instrument
subclass of: Brass Instrument
subclass of: Thing
type: Class
comment: A large, valved, brass instrument with a bass pitch.

jabber ID
term status: testing
type: Thing
sub property of: topDataProperty
property disjoint with: bottomDataProperty
type: InverseFunctionalProperty
type: DatatypeProperty
type: Property
comment: A jabber ID for something.
domain: Agent
range: Literal

Ontology annotation DLiser vocabulary
created: 2007-10-08
date: 2007-11-07
date: 2007-10-08
creator: 神崎正英
modified: 2007-11-07
type: Thing
comment: Vocabulary to define some annotation properties as subproperties of common terms. Because owl:Ontology resource cannot have properties other than annotation, these terms are defined as owl:AnnotationProperty type in dliser.rdf that is to be imported. However, some RDF application might want those properties to be related to well known terms such as Dublin Core. Hence this vocabulary redefines these properties as ordinary RDF/OWL terms and subProperty of others.
comment: オントロジーのアノテーションに用いるプロパティを、汎用プロパティと関連付けるための回避策としての語彙 @ja
version info: Version 0.12

http://lodlaundromat.org/.well-known/genid/samples/pellet///predicate//1db5ec77e444f4f38af2fda329ad1aa6/1db5ec77e444f4f38af2fda329ad1aa6#28
type: Example
type: Thing
Code: <m:conductor foaf:name="Sir Roger Norrington"/> <m:performer foaf:name="R.S.O. Stuttgart"/> <m:composer foaf:name="Brahms"/> <dc:title>Symphony No.2 D major</dc:title> <!-- An application may infer that: {X a m:Concert; m:performer Y; m:program Z.} => {X m:presents [a m:Performance; m:performer Y; m:represents Z]} -->

Format
Relation: formatT-001
Has Version: formatT-001
Date Modified: 2008-01-14
date: 2008-01-14
sub property of: topObjectProperty
issued: 2008-01-14
sub property of: Format
type: ObjectProperty
property disjoint with: bottomObjectProperty
type: Thing
type: Property
description: Examples of dimensions include size and duration. Recommended best practice is to use a controlled vocabulary such as the list of Internet Media Types [MIME].
comment: The file format, physical medium, or dimensions of the resource.
range: Media Type or Extent

LCSH
issued: 2000-07-11
type: VocabularyEncodingScheme
Has Version: LCSH-003
Date Modified: 2008-01-14
Relation: LCSH-003
date: 2000-07-11
type: Thing
date: 2008-01-14
comment: The set of labeled concepts specified by the Library of Congress Subject Headings.

Online Gaming Account
term status: unstable
type: Thing
disjoint with: Nothing
subclass of: Thing
subclass of: Online Account
type: Class
comment: An online gaming account.

Document
term status: testing
subclass of: Thing
disjoint with: Nothing
type: Class
disjoint with: Project
type: Thing
disjoint with: Organization
comment: A document.

Conductor
sub property of: topObjectProperty
sub property of: Performer
property disjoint with: bottomObjectProperty
type: ObjectProperty
comment: The subject performance is coducted by the object (or the subject musical event has a conductor). See comment of #performer.

Derived From
sub property of: topObjectProperty
sub property of: Source
property disjoint with: bottomObjectProperty
type: ObjectProperty
comment: The subject is (was) derived from the object, e.g a copy score is derived from the composer manuscript (or, possibly, a CD recording is derived from a performance at a concert).
domain: Musical Representation
range: Musical Representation
Example: http://lodlaundromat.org/.well-known/genid/samples/pellet///predicate//1db5ec77e444f4f38af2fda329ad1aa6/1db5ec77e444f4f38af2fda329ad1aa6#26

Key
sub property of: topObjectProperty
sub property of: Description
property disjoint with: bottomObjectProperty
type: ObjectProperty
comment: The subject musical work or its movement has a key, such as C major, d minor, etc.
domain: Musical Work
range: Key

Contrabassist
subclass of: Thing
subclass of: Player
disjoint with: Nothing
type: Class
subclass of: Agent
subclass of: Artist
subclass of: Musician
comment: A Contrabass player
subclass of: http://lodlaundromat.org/.well-known/genid/samples/pellet///predicate//1db5ec77e444f4f38af2fda329ad1aa6/1db5ec77e444f4f38af2fda329ad1aa6#5

tipjar
term status: testing
type: Thing
sub property of: topObjectProperty
sub property of: page
property disjoint with: bottomObjectProperty
type: ObjectProperty
type: Property
comment: A tipjar document for this agent, describing means for payment and reward.
domain: Agent
range: Document

age
term status: unstable
type: Thing
sub property of: topDataProperty
property disjoint with: bottomDataProperty
type: FunctionalProperty
type: DatatypeProperty
type: Property
comment: The age in years of some agent.
domain: Agent
range: Literal

B major
description: B major
Alternative Title: B major
type: Key
type: Thing
label: H dur
comment: Major key based on B, whose key signature has 5 sharps.

publications
term status: testing
type: Thing
sub property of: topObjectProperty
property disjoint with: bottomObjectProperty
type: ObjectProperty
type: Property
comment: A link to the publications of this person.
domain: Person
range: Document

E minor
description: E minor
Alternative Title: E minor
type: Key
type: Thing
label: e moll
comment: Minor key based on E, whose key signature has 1 sharp.

G-Sharp minor
description: G sharp minor
Alternative Title: G-Sharp minor
type: Key
type: Thing
label: gis moll
comment: Minor key based on G sharp, whose key signature has 5 sharps.

'circles and arrows' graphical representation of this example
type: Thing
type: Document
type: Image

License
date: 2008-01-14
type: ObjectProperty
sub property of: topObjectProperty
sub property of: Rights
issued: 2004-06-14
Relation: license-002
date: 2004-06-14
Date Modified: 2008-01-14
property disjoint with: bottomObjectProperty
Has Version: license-002
type: Thing
comment: A legal document giving official permission to do something with the resource.
type: Property
range: License Document

Description
Date Modified: 2008-01-14
Has Version: description-006
Relation: description-006
date: 1999-07-02
note: A second property with the same name as this property has been declared in the dcterms: namespace (http://purl.org/dc/terms/). See the Introduction to the document "DCMI Metadata Terms" (http://dublincore.org/documents/dcmi-terms/) for an explanation.
date: 2008-01-14
sub property of: topDataProperty
type: Thing
issued: 1999-07-02
type: DatatypeProperty
property disjoint with: bottomDataProperty
comment: An account of the resource.
type: Property
description: Description may include but is not limited to: an abstract, a table of contents, a graphical representation, or a free-text account of the resource.

firstName
term status: testing
type: Thing
sub property of: topDataProperty
property disjoint with: bottomDataProperty
type: DatatypeProperty
type: Property
comment: The first name of a person.
domain: Person
range: Literal

Type
property disjoint with: bottomObjectProperty
sub property of: topObjectProperty
date: 2008-01-14
Has Version: typeT-001
sub property of: Type
type: Thing
Date Modified: 2008-01-14
Relation: typeT-001
type: ObjectProperty
issued: 2008-01-14
description: Recommended best practice is to use a controlled vocabulary such as the DCMI Type Vocabulary [DCMITYPE]. To describe the file format, physical medium, or dimensions of the resource, use the Format element.
range: Class
type: Property
comment: The nature or genre of the resource.

Soprano Clarinet
disjoint with: Nothing
subclass of: Musical Instrument
subclass of: Clarinet
subclass of: Woodwind Instrument
subclass of: Thing
type: Class
comment: A smaller member of the clarinet family, commonly in key E-flat.

ISO 3166
issued: 2000-07-11
type: Thing
date: 2000-07-11
date: 2008-01-14
Date Modified: 2008-01-14
Relation: ISO3166-004
Has Version: ISO3166-004
type: Datatype
comment: The set of codes listed in ISO 3166-1 for the representation of names of countries.

Musical Group
disjoint with: Nothing
subclass of: Artist
subclass of: Thing
subclass of: Agent
type: Class
comment: A group that performs art works

Contributor
date: 2008-01-14
sub property of: topObjectProperty
Relation: contributorT-001
type: ObjectProperty
date: 2010-10-11
type: Thing
Date Modified: 2010-10-11
issued: 2008-01-14
sub property of: Contributor
property disjoint with: bottomObjectProperty
Has Version: contributorT-001
comment: An entity responsible for making contributions to the resource.
description: Examples of a Contributor include a person, an organization, or a service.
type: Property
range: Agent

depiction
term status: testing
type: Thing
sub property of: topObjectProperty
property disjoint with: bottomObjectProperty
inverse of: depicts
type: ObjectProperty
type: Property
comment: A depiction of some thing.
domain: Thing
range: Image

status
term status: unstable
type: Thing
sub property of: topDataProperty
property disjoint with: bottomDataProperty
type: DatatypeProperty
type: Property
comment: A string expressing what the user is happy for the general public (normally) to know about their current activity.
domain: Agent
range: Literal

Agent
type: Class
subclass of: Agent
equivalent class: Agent
subclass of: Thing
disjoint with: Nothing
type: Thing
term status: stable
comment: An agent (eg. person, group, software or physical artifact).

Standard
Relation: Standard-001
date: 2008-01-14
subclass of: Thing
disjoint with: Nothing
Has Version: Standard-001
type: Class
issued: 2008-01-14
type: Thing
comment: A basis for comparison; a reference point against which other things can be evaluated.

gender
term status: testing
type: Thing
sub property of: topDataProperty
property disjoint with: bottomDataProperty
type: FunctionalProperty
type: DatatypeProperty
type: Property
comment: The gender of this Agent (typically but not necessarily 'male' or 'female').
domain: Agent
range: Literal

Brass Instrument
disjoint with: Nothing
subclass of: Musical Instrument
subclass of: Thing
type: Class
comment: A wind musical instrument, that consists of a brass tube blown by means of a cup-shaped or funnel-shaped mouthpiece.

myersBriggs
term status: testing
type: Thing
sub property of: topDataProperty
property disjoint with: bottomDataProperty
type: DatatypeProperty
type: Property
comment: A Myers Briggs (MBTI) personality classification.
domain: Person
range: Literal

DCMI Period
date: 2000-07-11
Relation: Period-003
type: Thing
Date Modified: 2008-01-14
issued: 2000-07-11
date: 2008-01-14
Has Version: Period-003
type: Datatype
comment: The set of time intervals defined by their limits according to the DCMI Period Encoding Scheme.

A-Sharp minor
description: A sharp minor
Alternative Title: A-Sharp minor
type: Key
type: Thing
label: ais moll
comment: Minor key based on A sharp, whose key signature has 7 sharps.

Date Modified
type: DatatypeProperty
sub property of: topDataProperty
date: 2000-07-11
Date Modified: 2008-01-14
date: 2008-01-14
sub property of: Date
Relation: modified-003
property disjoint with: bottomDataProperty
type: Thing
issued: 2000-07-11
Has Version: modified-003
type: Property
range: Literal
comment: Date on which the resource was changed.

Date Accepted
date: 2008-01-14
Relation: dateAccepted-002
Date Modified: 2008-01-14
type: Thing
type: DatatypeProperty
sub property of: Date
property disjoint with: bottomDataProperty
sub property of: topDataProperty
date: 2002-07-13
Has Version: dateAccepted-002
issued: 2002-07-13
range: Literal
comment: Date of acceptance of the resource.
type: Property
description: Examples of resources to which a Date Accepted may be relevant are a thesis (accepted by a university department) or an article (accepted by a journal).

Bass
subclass of: Thing
subclass of: Musician
subclass of: Agent
subclass of: Artist
subclass of: Singer
type: Class
disjoint with: Nothing
comment: A Bass singer

Viola
disjoint with: Nothing
subclass of: Musical Instrument
subclass of: String Instrument
subclass of: Thing
type: Class
comment: A stringed instrument of the violin family, slightly larger than a violin, tuned a fifth lower, and having a deeper, more sonorous tone.

Audience Education Level
type: Thing
Relation: educationLevel-002
issued: 2002-07-13
Has Version: educationLevel-002
sub property of: Audience
date: 2002-07-13
date: 2008-01-14
sub property of: topObjectProperty
type: ObjectProperty
property disjoint with: bottomObjectProperty
Date Modified: 2008-01-14
type: Property
comment: A class of entity, defined in terms of progression through an educational or training context, for which the described resource is intended.
range: Agent Class

D major
description: D major
Alternative Title: D major
type: Key
type: Thing
label: D dur
comment: Major key based on D, whose key signature has 2 sharps.

description
sub property of: Description
sub property of: topDataProperty
property disjoint with: bottomDataProperty
type: DatatypeProperty
type: Property

F minor
description: F minor
Alternative Title: F minor
type: Key
type: Thing
label: f moll
comment: Minor key based on F, whose key signature has 4 flats.

Has Version
Relation: hasVersion-003
sub property of: topObjectProperty
Has Version: hasVersion-003
sub property of: Relation
property disjoint with: bottomObjectProperty
Date Modified: 2008-01-14
date: 2008-01-14
note: This term is intended to be used with non-literal values as defined in the DCMI Abstract Model (http://dublincore.org/documents/abstract-model/). As of December 2007, the DCMI Usage Board is seeking a way to express this intention with a formal range declaration.
issued: 2000-07-11
date: 2000-07-11
type: Thing
type: ObjectProperty
comment: A related resource that is a version, edition, or adaptation of the described resource.
type: Property

thumbnail
term status: testing
type: Thing
sub property of: topObjectProperty
property disjoint with: bottomObjectProperty
type: ObjectProperty
type: Property
comment: A derived thumbnail image.
domain: Image
range: Image

Example of
type: AnnotationProperty
comment: The subject is an example of the object vocabulary.
comment: 主語は目的語語彙の用例である。 @ja

Trial
type: AnnotationProperty
comment: A pointer to a real example or a trial page.
comment: 語彙が使われている実例、あるいはトライアルページへのポインタ。 @ja

Example
type: AnnotationProperty
comment: The subject has an Example. Use to include example(s) in a term definition.
comment: 主語となる語彙定義が例を持つ。 @ja

Image
type: AnnotationProperty
comment: A pointer to an image that helps to understand the vocabulary.
comment: 語彙の理解を助ける画像へのポインタ。 @ja

Prefix
type: AnnotationProperty
comment: A prefix used in the example to represent the schema namespace. A rendaring application may use this value to distinguish target terms in the example.
comment: 例の中でスキーマを表すために用いている名前空間接頭辞。例をレンダリングする場合、この値を使ってスキーマの語彙を他の語彙と区別することができる。 @ja

Code
type: AnnotationProperty
comment: Has an example code of an RDF/XML statements that use the schema. Content may be CDATA section or rdf:parseType="Literal".
comment: スキーマを使ったRDF/XMLのサンプルを記述する。CDATAセクションもしくはrdf:parseType="Literal"にすると、タグをそのまま記述できて便利。 @ja