Program
range: Thing
domain: Thing
type: ObjectProperty
comment: The subject musical event presents a musical work as its program
sub property of: Event Description
range: Oeuvre
type: Property
domain: Musical Event
domain: Resource
range: Resource
range: Musical Work

Pianist
subclass of: Resource
subclass of: Thing
type: Class
comment: A Piano player
subclass of: Player
subclass of: http://lodlaundromat.org/.well-known/genid/samples/jena///predicate//1db5ec77e444f4f38af2fda329ad1aa6/1db5ec77e444f4f38af2fda329ad1aa6#20
subclass of: Musician
subclass of: Artist
subclass of: Agent

Premiere
range: Thing
domain: Thing
type: ObjectProperty
comment: The subject musical work was first performed at an concert
sub property of: Description
range: Musical Event
Example: http://lodlaundromat.org/.well-known/genid/samples/jena///predicate//1db5ec77e444f4f38af2fda329ad1aa6/1db5ec77e444f4f38af2fda329ad1aa6#24
type: Property
domain: Musical Work
domain: Resource
range: Resource

Recital
subclass of: Resource
subclass of: Thing
type: Class
comment: An event of musical performance especially by soloists
subclass of: Musical Event

Music Director
subclass of: Resource
subclass of: Thing
type: Class
comment: The person who leads a musical group
subclass of: Director
subclass of: Musician
subclass of: Agent
subclass of: Artist

Source
range: Thing
domain: Thing
issued: 1999-07-02
description: The described resource may be derived from the related resource in whole or in part. Recommended best practice is to identify the related resource by means of a string conforming to a formal identification system.
Date Modified: 2008-01-14
note: A second property with the same name as this property has been declared in the dcterms: namespace (http://purl.org/dc/terms/). See the Introduction to the document "DCMI Metadata Terms" (http://dublincore.org/documents/dcmi-terms/) for an explanation.
comment: A related resource from which the described resource is derived.
type: Property
Has Version: source-006
type: ObjectProperty
type: Thing
date: 1999-07-02
date: 2008-01-14
Relation: source-006
range: Resource
domain: Resource

Bibliographic Resource
subclass of: Resource
Has Version: BibliographicResource-001
issued: 2008-01-14
type: Class
comment: A book, article, or other documentary resource.
date: 2008-01-14
Relation: BibliographicResource-001

Performer
range: Thing
domain: Thing
inverse of: Performs
type: ObjectProperty
comment: The subject has a performer (an artist, a group, a machine etc.). The preferred domain of this property is #Performance, so as to model that "a concert presents a performance (of a musical work) that is realized by this performer". However, in natural language, we often say that "a concert has performers who play these musical works", i.e. the domain of 'performer' is #Musical_Event in this case, and it would be more intuitive model. Hence, the domain is leave unrestricted here for a moment.
range: Agent
Example: http://lodlaundromat.org/.well-known/genid/samples/jena///predicate//1db5ec77e444f4f38af2fda329ad1aa6/1db5ec77e444f4f38af2fda329ad1aa6#27
Example: http://lodlaundromat.org/.well-known/genid/samples/jena///predicate//1db5ec77e444f4f38af2fda329ad1aa6/1db5ec77e444f4f38af2fda329ad1aa6#28
type: Property
range: Resource
domain: Resource

Soloist
range: Thing
domain: Thing
type: ObjectProperty
comment: The subject performance is performed by this soloist (or the subject musical event has a soloist. See comment of #performer.
sub property of: Performer
type: Property
domain: Resource
range: Agent
range: Resource

License Document
subclass of: Resource
Has Version: LicenseDocument-001
issued: 2008-01-14
type: Class
comment: A legal document giving official permission to do something with a Resource.
subclass of: Rights Statement
date: 2008-01-14
Relation: LicenseDocument-001

Description
range: Thing
domain: Thing
comment: An account of the resource.
description: Description may include but is not limited to: an abstract, a table of contents, a graphical representation, or a free-text account of the resource.
Date Modified: 2008-01-14
type: ObjectProperty
Has Version: descriptionT-001
sub property of: Description
issued: 2008-01-14
type: Property
type: Thing
date: 2008-01-14
Relation: descriptionT-001
range: Resource
domain: Resource

Artist Description
domain: Thing
type: ObjectProperty
comment: A description of the subject artist or agent. Super-property of #plays, #performs.
domain: Agent
range: Thing
type: Property
range: Resource
domain: Resource

Example of
type: Property
type: AnnotationProperty
comment: The subject is an example of the object vocabulary.
comment: 主語は目的語語彙の用例である。 @ja

interest
range: Thing
domain: Thing
type: Property
type: ObjectProperty
comment: A page about a topic of interest to this person.
domain: Agent
range: Document
term status: testing
range: Resource
domain: Resource

modified
sub property of: Date
type: Property
sub property of: Date Modified
range: Literal
range: Resource

Opera Event
subclass of: Resource
subclass of: Thing
type: Class
subclass of: Opera Performance
comment: An event of opera performance (not an opera as a musical work, which is defined here as 'Opera')
subclass of: Musical Event
equivalent class: Opera Performance

work info homepage
range: Thing
domain: Thing
type: Property
type: ObjectProperty
comment: A work info homepage of some person; a page about their work for some organization.
domain: Person
range: Document
term status: testing
range: Resource
domain: SpatialThing
domain: Resource
domain: Agent

Harpsichord
subclass of: Resource
subclass of: Thing
type: Class
comment: A keyboard instrument whose strings are plucked by means of quills or plectrums. Cembalo.
subclass of: Keyboard Instrument
subclass of: Musical Instrument

Singer
subclass of: Resource
subclass of: Thing
type: Class
comment: An artist who sings a song
subclass of: Musician
subclass of: Agent
subclass of: Artist

Opera Company
subclass of: Resource
subclass of: Thing
type: Class
comment: A musical group that performs opera works.
subclass of: Musical Group
subclass of: Artist
subclass of: Agent

account service homepage
range: Thing
domain: Thing
type: Property
type: ObjectProperty
comment: Indicates a homepage of the service provide for this online account.
domain: Online Account
range: Document
term status: testing
range: Resource
domain: Resource

Trumpet
subclass of: Resource
subclass of: Thing
type: Class
comment: A A soprano brass instrument consisting of a long metal tube looped once and ending in a flared bell, usually being equipped with valves or pistons.
subclass of: Brass Instrument
subclass of: Musical Instrument

Trial
type: Property
type: AnnotationProperty
comment: A pointer to a real example or a trial page.
comment: 語彙が使われている実例、あるいはトライアルページへのポインタ。 @ja

Agent
subclass of: Resource
subclass of: Agent
description: Examples of Agent include person, organization, and software agent.
Has Version: Agent-001
issued: 2008-01-14
type: Agent Class
type: Class
comment: A resource that acts or has the power to act.
type: Thing
date: 2008-01-14
Relation: Agent-001
equivalent class: Agent

member
range: Thing
domain: Thing
type: Property
type: ObjectProperty
comment: Indicates a member of a Group
domain: Group
range: Agent
term status: stable
range: Resource
domain: Resource
domain: Agent

Source
sub property of: Relation
description: The described resource may be derived from the related resource in whole or in part. Recommended best practice is to identify the related resource by means of a string conforming to a formal identification system.
note: This term is intended to be used with non-literal values as defined in the DCMI Abstract Model (http://dublincore.org/documents/abstract-model/). As of December 2007, the DCMI Usage Board is seeking a way to express this intention with a formal range declaration.
comment: A related resource from which the described resource is derived.
type: Property
sub property of: Source
issued: 2008-01-14
Date Modified: 2008-01-14
Has Version: sourceT-001
type: Thing
date: 2008-01-14
Relation: sourceT-001
domain: Thing
domain: Resource
range: Thing
range: Resource

personal mailbox
domain: Thing
type: Property
type: InverseFunctionalProperty
type: ObjectProperty
comment: A personal mailbox, ie. an Internet mailbox associated with exactly one owner, the first owner of this mailbox. This is a 'static inverse functional property', in that there is (across time and change) at most one individual that ever has any particular value for foaf:mbox.
domain: Agent
range: Thing
term status: stable
range: Resource
domain: Resource

Source
range: Thing
domain: Thing
type: ObjectProperty
comment: The subject musical work has a historical source, such as sketch, autograph score or published score.
sub property of: Description
range: Written Representation
type: Property
domain: Musical Work
domain: Resource
range: Resource
range: Musical Representation

Symphonic Poem
subclass of: Resource
subclass of: Thing
type: Class
comment: An orchestral composition based on a thematic subject
subclass of: Orchestral Work
subclass of: Oeuvre
subclass of: Musical Work

Physical Resource
subclass of: Resource
Has Version: PhysicalResource-001
issued: 2008-01-14
type: Class
comment: A material thing.
date: 2008-01-14
Relation: PhysicalResource-001

weblog
range: Thing
domain: Thing
sub property of: page
type: Property
range: Document
term status: testing
comment: A weblog of some thing (whether person, group, company etc.).
domain: Agent
type: InverseFunctionalProperty
type: ObjectProperty
domain: Resource
range: Resource

Online Account
subclass of: Resource
type: Class
comment: An online account.
subclass of: Thing
term status: testing

Media Type
subclass of: Resource
Has Version: MediaType-001
issued: 2008-01-14
type: Class
comment: A file format or physical medium.
subclass of: Media Type or Extent
date: 2008-01-14
Relation: MediaType-001

Symphony
subclass of: Resource
subclass of: Thing
type: Class
comment: A large and complex work for symphony orchestra
subclass of: Orchestral Work
subclass of: Oeuvre
subclass of: Musical Work

Violin
subclass of: Resource
subclass of: Thing
type: Class
comment: A musical instrument played with a bow, having four strings. Usually plays the highest part of the string section.
subclass of: String Instrument
subclass of: Musical Instrument

Chorus
subclass of: Resource
subclass of: Thing
type: Class
comment: A musical group of singers.
subclass of: Musical Group
subclass of: Artist
subclass of: Agent

Agent Class
subclass of: Resource
description: Examples of Agent Class include groups seen as classes, such as students, women, charities, lecturers.
Has Version: AgentClass-003
issued: 2008-01-14
Date Modified: 2012-06-14
type: Class
comment: A group of agents.
subclass of: Class
type: Thing
date: 2008-01-14
date: 2012-06-14
Relation: AgentClass-003

Creator
range: Thing
domain: Thing
type: ObjectProperty
comment: An entity primarily responsible for making the resource.
Has Version: creator-006
description: Examples of a Creator include a person, an organization, or a service. Typically, the name of a Creator should be used to indicate the entity.
issued: 1999-07-02
note: A second property with the same name as this property has been declared in the dcterms: namespace (http://purl.org/dc/terms/). See the Introduction to the document "DCMI Metadata Terms" (http://dublincore.org/documents/dcmi-terms/) for an explanation.
type: Property
Date Modified: 2008-01-14
type: Thing
date: 1999-07-02
date: 2008-01-14
Relation: creator-006
range: Resource
domain: Resource

Pian
subclass of: Resource
subclass of: Thing
type: Class
comment: A musical instrument with a manual keyboard actuating hammers that strike wire strings. A pianoforte.
subclass of: Keyboard Instrument
subclass of: Musical Instrument

Keyboard Instrument
subclass of: Resource
subclass of: Thing
type: Class
comment: A musical instrument that has a set of keys that consist of scale.
subclass of: Musical Instrument

Online Chat Account
subclass of: Resource
subclass of: Thing
type: Class
comment: An online chat account.
subclass of: Online Account
term status: unstable

Bass Clarinet
subclass of: Resource
subclass of: Thing
type: Class
comment: A larger member of the clarinet family, usually in key B-flat.
subclass of: Clarinet
subclass of: Woodwind Instrument
subclass of: Musical Instrument

Part
subclass of: Resource
subclass of: Thing
type: Class
comment: A music for a particular instrument or voice taken from a full score (Note: in this ontology, Part is not a division of an orchestra).
subclass of: Written Representation
subclass of: Musical Representation

Concert
subclass of: Resource
subclass of: Thing
type: Class
comment: An event of musical performance by players or singers not involving theatrical staging
subclass of: Musical Event

knows
range: Thing
domain: Thing
type: Property
type: ObjectProperty
comment: A person known by this person (indicating some level of reciprocated interaction between the parties).
domain: Person
range: Person
term status: stable
range: Resource
range: Agent
range: SpatialThing
domain: SpatialThing
domain: Resource
domain: Agent

Creator
sub property of: Contributor
sub property of: maker
Date Modified: 2010-10-11
comment: An entity primarily responsible for making the resource.
Has Version: creatorT-002
equivalent property: maker
issued: 2008-01-14
sub property of: Creator
type: Property
description: Examples of a Creator include a person, an organization, or a service.
range: Agent
type: Thing
date: 2008-01-14
date: 2010-10-11
Relation: creatorT-002
domain: Thing
domain: Resource
range: Thing
range: Resource

Timpani
subclass of: Resource
subclass of: Thing
type: Class
comment: A set of large copper or brass hemispherical drums with a parchment head that can be tuned by adjusting the tension.
subclass of: Percussion
subclass of: Musical Instrument

Example
type: Property
type: AnnotationProperty
comment: The subject has an Example. Use to include example(s) in a term definition.
comment: 主語となる語彙定義が例を持つ。 @ja

Composer
range: Thing
domain: Thing
type: ObjectProperty
comment: The subject musical work is composed by a person, a group, a software program etc.
sub property of: Description
sub property of: Creator
domain: Oeuvre
range: Agent
type: Property
domain: Resource
domain: Musical Work
range: Resource

Oboe
subclass of: Resource
subclass of: Thing
type: Class
comment: A woodwind instrument with a conical bore and a double-reed mouthpiece.
subclass of: Woodwind Instrument
subclass of: Musical Instrument

Countertenor
subclass of: Resource
subclass of: Thing
type: Class
comment: A Countertenor singer
subclass of: Singer
subclass of: Musician
subclass of: Artist
subclass of: Agent

page
range: Thing
type: Property
type: ObjectProperty
comment: A page or document about this thing.
domain: Thing
range: Document
inverse of: topic
term status: testing
range: Resource
domain: Resource

CelestaPlayer
subclass of: Resource
subclass of: Thing
type: Class
comment: A Celesta player
subclass of: Player
subclass of: http://lodlaundromat.org/.well-known/genid/samples/jena///predicate//1db5ec77e444f4f38af2fda329ad1aa6/1db5ec77e444f4f38af2fda329ad1aa6#21
subclass of: Musician
subclass of: Artist
subclass of: Agent

Location, Period, or Jurisdiction
subclass of: Resource
Has Version: LocationPeriodOrJurisdiction-001
issued: 2008-01-14
type: Class
comment: A location, period of time, or jurisdiction.
date: 2008-01-14
Relation: LocationPeriodOrJurisdiction-001

Ballet (Work)
subclass of: Resource
subclass of: Thing
type: Class
comment: A musical work for a dance form featuring a staged presentation of group or solo dancing. Note 'Ballet_Event' in this vocabulary describes the performance of a ballet.
subclass of: Oeuvre
subclass of: Musical Work

Sections
domain: Thing
type: ObjectProperty
comment: The subject musical work has subsections such as movements. Current model recommends RDF Collection as the object.
sub property of: Description
domain: Oeuvre
range: Thing
type: Property
domain: Musical Work
domain: Resource
range: Resource

Cantata
subclass of: Resource
subclass of: Thing
type: Class
comment: A vocal composition accompanied by instruments and generally containing more than one movement.
subclass of: Choral Music
subclass of: Oeuvre
subclass of: Musical Work

神崎正英
type: Person
type: Thing
type: Agent
type: SpatialThing

Musical Work
subclass of: Thing
subclass of: Resource
type: Class
comment: A musical work in any form, e.g. a composition, its movement, phrase, theme etc.

Event Description
domain: Thing
type: ObjectProperty
comment: A description of the subject musical event. Super-property of #program, #presents, #venue.
domain: Musical Event
range: Thing
type: Property
range: Resource
domain: Resource

Harpist
subclass of: Resource
subclass of: Thing
type: Class
comment: A Harp player
subclass of: Player
subclass of: http://lodlaundromat.org/.well-known/genid/samples/jena///predicate//1db5ec77e444f4f38af2fda329ad1aa6/1db5ec77e444f4f38af2fda329ad1aa6#19
subclass of: Musician
subclass of: Artist
subclass of: Agent

published
range: Thing
domain: Thing
type: ObjectProperty
comment: The subject musical work is published as a score or sheet music (still not sure what kind of class is appropriate as the range)
sub property of: Description
range: Written Representation
Example: http://lodlaundromat.org/.well-known/genid/samples/jena///predicate//1db5ec77e444f4f38af2fda329ad1aa6/1db5ec77e444f4f38af2fda329ad1aa6#25
type: Property
domain: Musical Work
domain: Resource
range: Resource
range: Musical Representation

account
range: Thing
domain: Thing
type: Property
type: ObjectProperty
comment: Indicates an account held by this agent.
domain: Agent
range: Online Account
term status: testing
range: Resource
domain: Resource

homepage
range: Thing
comment: A homepage for some thing.
range: Document
type: Property
term status: stable
sub property of: page
sub property of: is primary topic of
domain: Thing
type: ObjectProperty
type: InverseFunctionalProperty
domain: Resource
range: Resource

Label Property
subclass of: Resource
subclass of: Thing
type: Class
comment: A foaf:LabelProperty is any RDF property with texual values that serve as labels.
term status: unstable

Linguistic System
subclass of: Resource
description: Examples include written, spoken, sign, and computer languages.
Has Version: LinguisticSystem-001
issued: 2008-01-14
type: Class
comment: A system of signs, symbols, sounds, gestures, or rules used in communication.
type: Thing
date: 2008-01-14
Relation: LinguisticSystem-001

Peroformance
subclass of: Thing
subclass of: Resource
type: Class
comment: Representation of a musical work in the form of performace, e.g. playing instruments, singing etc. Note a concert is a Musical_Event where a Performance is presented.
subclass of: Musical Representation

Hornist
subclass of: Resource
subclass of: Thing
type: Class
comment: A Horn player
subclass of: Player
subclass of: http://lodlaundromat.org/.well-known/genid/samples/jena///predicate//1db5ec77e444f4f38af2fda329ad1aa6/1db5ec77e444f4f38af2fda329ad1aa6#14
subclass of: Musician
subclass of: Artist
subclass of: Agent

PersonalProfileDocument
subclass of: Resource
subclass of: Thing
type: Class
comment: A personal profile RDF document.
subclass of: Document
term status: testing

deprecated by
sub property of: seeAlso
type: Property
sub property of: see other

Ensemble
subclass of: Resource
subclass of: Thing
type: Class
comment: A musical group which perfroms in relatively small size, particularly chamber music
subclass of: Musical Group
subclass of: Agent
subclass of: Artist

Suite
subclass of: Resource
subclass of: Thing
type: Class
comment: A musical composition of several movements only loosely connected
subclass of: Oeuvre
subclass of: Musical Work

Ballet Company
subclass of: Resource
subclass of: Thing
type: Class
comment: A musical group that performs ballet works.
subclass of: Musical Group
subclass of: Agent
subclass of: Artist

File Format
subclass of: Resource
description: Examples include the formats defined by the list of Internet Media Types.
Has Version: FileFormat-001
issued: 2008-01-14
type: Class
comment: A digital resource format.
subclass of: Media Type
type: Thing
date: 2008-01-14
Relation: FileFormat-001

topic
domain: Thing
type: Property
type: ObjectProperty
comment: A topic of some page or document.
domain: Document
range: Thing
inverse of: page
term status: testing
range: Resource
domain: Resource

Horn
subclass of: Resource
subclass of: Thing
type: Class
comment: A brass instrument with a long narrow tube that is coiled in a circle before ending in a flaring bell, usually being equipped with valves. A French Horn.
subclass of: Brass Instrument
subclass of: Musical Instrument

Frequency
subclass of: Resource
Has Version: Frequency-001
issued: 2008-01-14
type: Class
comment: A rate at which something recurs.
date: 2008-01-14
Relation: Frequency-001

Description
domain: Thing
type: ObjectProperty
comment: A description of the subject musical work. Super-property of some properties in this vocabulary, as well as description of a general descriptive resource such as time-line of composing process.
domain: Musical Work
range: Thing
type: Property
range: Resource
domain: Resource

maker
sub property of: Contributor
sub property of: Creator
range: Thing
equivalent property: Creator
comment: An agent that made this thing.
term status: stable
domain: Thing
inverse of: made
type: Property
range: Agent
type: ObjectProperty
domain: Resource
range: Resource

Piccolo
subclass of: Resource
subclass of: Thing
type: Class
comment: A piccolo flute, smaller member of the flute family.
subclass of: Flute
subclass of: Woodwind Instrument
subclass of: Musical Instrument

Artist
subclass of: Resource
subclass of: Thing
type: Class
subclass of: Agent
comment: A person or group (or any agent) who creates or performs art works

Director
subclass of: Resource
subclass of: Thing
type: Class
comment: An artist who directs a musical group
subclass of: Artist
subclass of: Agent

Conductor Name
sub property of: Description
type: DatatypeProperty
comment: The subject musical event has a conductor. Literal version of #conductor.
sub property of: PerformerName
type: Property
domain: Musical Event
domain: Thing
domain: Resource
range: Literal
range: Resource

Contrafagotto
subclass of: Resource
subclass of: Thing
type: Class
comment: A larger mebmer of the basoon family, producing the lowest tone in the woodwind section.
subclass of: Bassoon
subclass of: Musical Instrument
subclass of: Woodwind Instrument

Clarinet
subclass of: Resource
subclass of: Thing
type: Class
comment: A woodwind instrument having a straight cylindrical tube with a flaring bell and a single-reed mouthpiece.
subclass of: Woodwind Instrument
subclass of: Musical Instrument

Movement
subclass of: Resource
subclass of: Thing
type: Class
comment: A subsection of a musical work. Typically a movement of a symphony, but also a piece of suit, etc.
subclass of: Musical Work

Celesta
subclass of: Resource
subclass of: Thing
type: Class
comment: A musical instrument with a keyboard and metal plates struck by hammers that produce bell-like tones.
subclass of: Keyboard Instrument
subclass of: Musical Instrument

Oratorio
subclass of: Resource
subclass of: Thing
type: Class
comment: A large musical composition for orchestra, vocal soloists and chorus
subclass of: Choral Music
subclass of: Oeuvre
subclass of: Musical Work

openid
range: Thing
domain: Thing
sub property of: page
range: Document
type: ObjectProperty
term status: testing
type: Property
domain: Agent
type: InverseFunctionalProperty
sub property of: is primary topic of
comment: An OpenID for an Agent.
domain: Resource
range: Resource

String Quartet
subclass of: String Quartette
subclass of: Resource
subclass of: Thing
type: Class
comment: A music composed for instrumental quartet with 2 violins and a viola and a cello. Note 'StringQuartetEnsemble' is SQ ensemble in this vocabulary.
subclass of: Chamber Music
subclass of: Oeuvre
subclass of: Musical Work
equivalent class: String Quartette

Saxophone
subclass of: Resource
subclass of: Thing
type: Class
comment: A woodwind instrument with a single-reed mouthpiece and a (usually curved) conical metal tube, including soprano, alto, tenor, and baritone sizes.
subclass of: Woodwind Instrument
subclass of: Musical Instrument

Guitarist
subclass of: Resource
subclass of: Thing
type: Class
comment: A Guitar player
subclass of: Player
subclass of: http://lodlaundromat.org/.well-known/genid/samples/jena///predicate//1db5ec77e444f4f38af2fda329ad1aa6/1db5ec77e444f4f38af2fda329ad1aa6#23
subclass of: Musician
subclass of: Artist
subclass of: Agent

Concerto
subclass of: Resource
subclass of: Thing
type: Class
comment: A composition for orchestra and a soloist
subclass of: Orchestral Work
subclass of: Oeuvre
subclass of: Musical Work

Cellist
subclass of: Resource
subclass of: Thing
type: Class
comment: A Cello player
subclass of: Player
subclass of: http://lodlaundromat.org/.well-known/genid/samples/jena///predicate//1db5ec77e444f4f38af2fda329ad1aa6/1db5ec77e444f4f38af2fda329ad1aa6#4
subclass of: Musician
subclass of: Agent
subclass of: Artist

Alto
subclass of: Resource
subclass of: Thing
type: Class
comment: An Alto singer
subclass of: Singer
subclass of: Musician
subclass of: Artist
subclass of: Agent

Bassoonist
subclass of: Resource
subclass of: Thing
type: Class
comment: A Fagotto player
subclass of: Player
subclass of: http://lodlaundromat.org/.well-known/genid/samples/jena///predicate//1db5ec77e444f4f38af2fda329ad1aa6/1db5ec77e444f4f38af2fda329ad1aa6#12
subclass of: Musician
subclass of: Agent
subclass of: Artist

Presents
range: Thing
domain: Thing
type: ObjectProperty
comment: The subject musical event presents a performance of a musical work. An experiment to have better model to describe musical work, its representation and an event to present the representation.
sub property of: Event Description
range: Peroformance
type: Property
domain: Musical Event
domain: Resource
range: Resource
range: Musical Representation

Player
subclass of: Resource
subclass of: Thing
type: Class
comment: An artist who performs a musical instrument
subclass of: Musician
subclass of: Agent
subclass of: Artist

Image
type: Property
type: AnnotationProperty
comment: A pointer to an image that helps to understand the vocabulary.
comment: 語彙の理解を助ける画像へのポインタ。 @ja

String Instrument
subclass of: Resource
subclass of: Thing
type: Class
comment: A stringed musical instrument, in which sound is produced by plucking, striking, or bowing taut strings.
subclass of: Musical Instrument

Media Type or Extent
subclass of: Resource
Has Version: MediaTypeOrExtent-001
issued: 2008-01-14
type: Class
comment: A media type or extent.
date: 2008-01-14
Relation: MediaTypeOrExtent-001

Bass_Clarinettist
subclass of: Resource
subclass of: Thing
type: Class
comment: A Bass Clarinet player
subclass of: Clarinettist
subclass of: http://lodlaundromat.org/.well-known/genid/samples/jena///predicate//1db5ec77e444f4f38af2fda329ad1aa6/1db5ec77e444f4f38af2fda329ad1aa6#11
subclass of: http://lodlaundromat.org/.well-known/genid/samples/jena///predicate//1db5ec77e444f4f38af2fda329ad1aa6/1db5ec77e444f4f38af2fda329ad1aa6#10
subclass of: Player
subclass of: Musician
subclass of: Agent
subclass of: Artist

Musical Instrument
subclass of: Thing
subclass of: Resource
type: Class
comment: An instrument to play music

Physical Medium
subclass of: Resource
description: Examples include paper, canvas, or DVD.
Has Version: PhysicalMedium-001
issued: 2008-01-14
type: Class
comment: A physical material or carrier.
subclass of: Media Type
type: Thing
date: 2008-01-14
Relation: PhysicalMedium-001

Flute
subclass of: Resource
subclass of: Thing
type: Class
comment: A high-pitched woodwind instrument; a slender tube closed at one end with finger holes on one end and an opening near the closed end across which the breath is blown
subclass of: Woodwind Instrument
subclass of: Musical Instrument

Score
subclass of: Resource
subclass of: Thing
type: Class
comment: A full score or piano-vocal score of a work, either published or manuscript.
subclass of: Written Representation
subclass of: Musical Representation

Trumpeter
subclass of: Resource
subclass of: Thing
type: Class
comment: A Trumpet player
subclass of: Player
subclass of: http://lodlaundromat.org/.well-known/genid/samples/jena///predicate//1db5ec77e444f4f38af2fda329ad1aa6/1db5ec77e444f4f38af2fda329ad1aa6#15
subclass of: Musician
subclass of: Agent
subclass of: Artist

Choreographer
subclass of: Resource
subclass of: Thing
type: Class
comment: someone who creates new dances, or directs an opera
subclass of: Director
subclass of: Agent
subclass of: Artist

Oboist
subclass of: Resource
subclass of: Thing
type: Class
comment: An Oboe player
subclass of: Player
subclass of: http://lodlaundromat.org/.well-known/genid/samples/jena///predicate//1db5ec77e444f4f38af2fda329ad1aa6/1db5ec77e444f4f38af2fda329ad1aa6#8
subclass of: Musician
subclass of: Agent
subclass of: Artist

Online E-commerce Account
subclass of: Resource
subclass of: Thing
type: Class
comment: An online e-commerce account.
subclass of: Online Account
term status: unstable

Provenance Statement
subclass of: Resource
Has Version: ProvenanceStatement-001
issued: 2008-01-14
type: Class
comment: A statement of any changes in ownership and custody of a resource since its creation that are significant for its authenticity, integrity, and interpretation.
date: 2008-01-14
Relation: ProvenanceStatement-001

Conductor
subclass of: Resource
subclass of: Thing
type: Class
comment: A Conductor
subclass of: Director
subclass of: Musician
subclass of: Agent
subclass of: Artist

Jurisdiction
subclass of: Resource
Has Version: Jurisdiction-001
issued: 2008-01-14
type: Class
comment: The extent or range of judicial, law enforcement, or other authority.
subclass of: Location, Period, or Jurisdiction
date: 2008-01-14
Relation: Jurisdiction-001

Contrabass
subclass of: Resource
subclass of: Thing
type: Class
comment: The largest member of string insrtument, usually with four or five strings.
subclass of: String Instrument
subclass of: Musical Instrument

Violinist
subclass of: Resource
subclass of: Thing
type: Class
comment: A Violn player
subclass of: Player
subclass of: http://lodlaundromat.org/.well-known/genid/samples/jena///predicate//1db5ec77e444f4f38af2fda329ad1aa6/1db5ec77e444f4f38af2fda329ad1aa6#2
subclass of: Musician
subclass of: Artist
subclass of: Agent

Key
subclass of: Thing
subclass of: Resource
type: Class
comment: A key of a musical work (e.g. C-dur, b-moll)

Group
subclass of: Resource
subclass of: Thing
subclass of: Agent
type: Class
comment: A class of Agents.
term status: stable

workplace homepage
range: Thing
domain: Thing
type: Property
type: ObjectProperty
comment: A workplace homepage of some person; the homepage of an organization they work for.
domain: Person
range: Document
term status: testing
range: Resource
domain: SpatialThing
domain: Resource
domain: Agent

Sketch
subclass of: Resource
subclass of: Thing
type: Class
comment: A sketch, or a brief prelimary composition of a work.
subclass of: Written Representation
subclass of: Musical Representation

Written Representation
subclass of: Resource
subclass of: Thing
type: Class
comment: Representation of a musical work in the form of a written expression, e.g. score, parts, autograph, printed music, sketch, etc.
subclass of: Musical Representation

account
range: Thing
domain: Thing
type: Property
type: ObjectProperty
comment: Indicates an account held by this agent.
domain: Agent
range: Online Account
term status: archaic
range: Resource
domain: Resource

Trombonist
subclass of: Resource
subclass of: Thing
type: Class
comment: A Trombone player
subclass of: Player
subclass of: http://lodlaundromat.org/.well-known/genid/samples/jena///predicate//1db5ec77e444f4f38af2fda329ad1aa6/1db5ec77e444f4f38af2fda329ad1aa6#16
subclass of: Musician
subclass of: Agent
subclass of: Artist

Musical Event
subclass of: Thing
subclass of: Resource
type: Class
comment: An event of musical performance by players or singers, including theatrical staging. Typically the event has date and location. Note this is different from Performance, which is a 'representation' of a musical work realized at a musical event or recording, etc.

Image
subclass of: Resource
subclass of: Thing
type: Class
comment: An image.
subclass of: Document
term status: testing

English Horn
subclass of: Resource
subclass of: Thing
type: Class
comment: A double-reed woodwind instrument, larger member of the oboe family.
subclass of: Oboe
subclass of: Woodwind Instrument
subclass of: Musical Instrument

Person
subclass of: Resource
subclass of: Thing
subclass of: Agent
comment: A person.
term status: stable
subclass of: SpatialThing
disjoint with: Project
type: Class
subclass of: Person
disjoint with: Organization

phone
range: Thing
domain: Thing
type: Property
type: ObjectProperty
comment: A phone, specified using fully qualified tel: URI scheme (refs: http://www.w3.org/Addressing/schemes.html#tel).
term status: testing
range: Resource
domain: Resource

Composition
range: Thing
domain: Thing
type: ObjectProperty
comment: Describes the composition process of the subject. Composition period or completion date, place, revision etc. can be described as properties of the object composition process.
sub property of: Description
type: Property
domain: Musical Work
domain: Resource
range: Resource

Religious Music
subclass of: Resource
subclass of: Thing
type: Class
comment: A genre of music composed for performance as part of religious ceremonies
subclass of: Oeuvre
subclass of: Musical Work

神崎正英
type: Person
type: Thing
type: Agent
type: SpatialThing

depicts
domain: Thing
type: Property
type: ObjectProperty
comment: A thing depicted in this representation.
domain: Image
range: Thing
inverse of: depiction
term status: testing
range: Resource
domain: Resource
domain: Document

Woodwind Instrument
subclass of: Resource
subclass of: Thing
type: Class
comment: A wind musical instrument, in which sound is produced by the vibration of reeds in the mouthpiece, or by the passing of air across the mouthpiece.
subclass of: Musical Instrument

TubaPlayer
subclass of: Resource
subclass of: Thing
type: Class
comment: A Tuba player
subclass of: Player
subclass of: http://lodlaundromat.org/.well-known/genid/samples/jena///predicate//1db5ec77e444f4f38af2fda329ad1aa6/1db5ec77e444f4f38af2fda329ad1aa6#17
subclass of: Musician
subclass of: Agent
subclass of: Artist

Percussion
subclass of: Resource
subclass of: Thing
type: Class
comment: A musical instrument that produces sound by striking the body.
subclass of: Musical Instrument

Plays
range: Thing
domain: Thing
type: ObjectProperty
comment: The subject artist (or group, machine, etc) plays an musical instrument. If :me :plays :Violin, then :me a :Violininst.
sub property of: Artist Description
range: Musical Instrument
type: Property
domain: Agent
domain: Resource
range: Resource

ContrafagottoPlayer
subclass of: Resource
subclass of: Thing
type: Class
comment: A Contrafagotto player
subclass of: Bassoonist
subclass of: http://lodlaundromat.org/.well-known/genid/samples/jena///predicate//1db5ec77e444f4f38af2fda329ad1aa6/1db5ec77e444f4f38af2fda329ad1aa6#13
subclass of: Musician
subclass of: Player
subclass of: http://lodlaundromat.org/.well-known/genid/samples/jena///predicate//1db5ec77e444f4f38af2fda329ad1aa6/1db5ec77e444f4f38af2fda329ad1aa6#12
subclass of: Artist
subclass of: Agent

Qtring Quartet
subclass of: Resource
subclass of: Thing
type: Class
comment: A musical group of four string players. Note 'String_Quartette' is SQ as musical work in this vocabulary.
subclass of: Musical Group
subclass of: Agent
subclass of: Artist

Flutist
subclass of: Resource
subclass of: Thing
type: Class
comment: A Flute player
subclass of: Player
subclass of: http://lodlaundromat.org/.well-known/genid/samples/jena///predicate//1db5ec77e444f4f38af2fda329ad1aa6/1db5ec77e444f4f38af2fda329ad1aa6#6
subclass of: Musician
subclass of: Agent
subclass of: Artist

Overture
subclass of: Resource
subclass of: Thing
type: Class
comment: An orchestral music composed for the opening of an opera or oratorio, often played as an independend work in concerts
subclass of: Orchestral Work
subclass of: Oeuvre
subclass of: Musical Work

Chamber Music
subclass of: Resource
subclass of: Thing
type: Class
comment: A genre of music composed for performance by small ensemble
subclass of: Oeuvre
subclass of: Musical Work

Orchestral Work
subclass of: Resource
subclass of: Thing
type: Class
comment: A composition for orchestra (and a soloist or soloists, optionally with chorus)
subclass of: Oeuvre
subclass of: Musical Work

Orchestra
subclass of: Resource
subclass of: Thing
type: Class
comment: A musical group which perfroms large scale symphonic works
subclass of: Musical Group
subclass of: Agent
subclass of: Artist

Mezzo Soprano
subclass of: Resource
subclass of: Thing
type: Class
comment: A Mezzo Soprano singer
subclass of: Singer
subclass of: Musician
subclass of: Agent
subclass of: Artist

Musical Representation
subclass of: Thing
subclass of: Resource
type: Class
comment: Representation of a musical work, such as a score, sheet music, perfornamce, recoding, etc.

Choral Music
subclass of: Resource
subclass of: Thing
type: Class
comment: A genre of music composed for performance by a chorus or choir
subclass of: Oeuvre
subclass of: Musical Work

Ballet Event
subclass of: Ballet Performance
subclass of: Resource
subclass of: Thing
type: Class
comment: An event of ballet performance
subclass of: Musical Event
equivalent class: Ballet Performance

English Horn player
subclass of: Resource
subclass of: Thing
type: Class
comment: An English Horn player
subclass of: Oboist
subclass of: http://lodlaundromat.org/.well-known/genid/samples/jena///predicate//1db5ec77e444f4f38af2fda329ad1aa6/1db5ec77e444f4f38af2fda329ad1aa6#9
subclass of: http://lodlaundromat.org/.well-known/genid/samples/jena///predicate//1db5ec77e444f4f38af2fda329ad1aa6/1db5ec77e444f4f38af2fda329ad1aa6#8
subclass of: Musician
subclass of: Player
subclass of: Agent
subclass of: Artist

Mandolin
subclass of: Resource
subclass of: Thing
type: Class
comment: A pear-shaped small stringed instrument descended from the lute, played with a pick.
subclass of: String Instrument
subclass of: Musical Instrument

current project
domain: Thing
type: Property
type: ObjectProperty
comment: A current project this person works on.
domain: Person
range: Thing
term status: testing
range: Resource
domain: SpatialThing
domain: Resource
domain: Agent

Method of Accrual
subclass of: Resource
Has Version: MethodOfAccrual-001
issued: 2008-01-14
type: Class
comment: A method by which resources are added to a collection.
date: 2008-01-14
Relation: MethodOfAccrual-001

Soprano
subclass of: Resource
subclass of: Thing
type: Class
comment: A Soprano singer
subclass of: Singer
subclass of: Musician
subclass of: Agent
subclass of: Artist

Basset Horn
subclass of: Resource
subclass of: Thing
type: Class
comment: A larger member of the clarinet family, typically in lower F, and has darker and less brilliant timbre.
subclass of: Clarinet
subclass of: Woodwind Instrument
subclass of: Musical Instrument

Prefix
type: Property
type: AnnotationProperty
comment: A prefix used in the example to represent the schema namespace. A rendaring application may use this value to distinguish target terms in the example.
comment: 例の中でスキーマを表すために用いている名前空間接頭辞。例をレンダリングする場合、この値を使ってスキーマの語彙を他の語彙と区別することができる。 @ja

Trombone
subclass of: Resource
subclass of: Thing
type: Class
comment: A brass instrument consisting of a long cylindrical tube, and having a movable U-shaped slide for producing different pitches.
subclass of: Brass Instrument
subclass of: Musical Instrument

Harp
subclass of: Resource
subclass of: Thing
type: Class
comment: An instrument with usually 46 or 47 strings that are played by plucking with the fingers.
subclass of: String Instrument
subclass of: Musical Instrument

Opera (Work)
subclass of: Resource
subclass of: Thing
type: Class
comment: A musical work with drama, song, chorus and orchestral music. Note 'Opera_Event' in this vocabulary describes the performance of an opera.
subclass of: Oeuvre
subclass of: Musical Work

Musician
subclass of: Resource
subclass of: Thing
type: Class
comment: An artist who performs, composes or conducts music
subclass of: Artist
subclass of: Agent

Baritone
subclass of: Resource
subclass of: Thing
type: Class
comment: A Baritone singer
subclass of: Singer
subclass of: Agent
subclass of: Artist
subclass of: Musician

schoolHomepage
range: Thing
domain: Thing
type: Property
type: ObjectProperty
comment: A homepage of a school attended by the person.
domain: Person
range: Document
term status: testing
range: Resource
domain: SpatialThing
domain: Resource
domain: Agent

Organization
subclass of: Resource
subclass of: Thing
subclass of: Agent
type: Class
comment: An organization.
disjoint with: Person
disjoint with: Document
term status: stable

Policy
subclass of: Resource
Has Version: Policy-001
issued: 2008-01-14
type: Class
comment: A plan or course of action by an authority, intended to influence and determine decisions, actions, and other matters.
date: 2008-01-14
Relation: Policy-001

Text
subclass of: Resource
subclass of: Thing
type: Class
comment: Text of a musical work (e.g. lyric or verse)
subclass of: Oeuvre
subclass of: Musical Work

Venue
range: Thing
domain: Thing
type: ObjectProperty
comment: The subject musical event is presented at the object venue.
sub property of: Event Description
range: Venue
type: Property
domain: Musical Event
domain: Resource
range: Resource

Cello
subclass of: Resource
subclass of: Thing
type: Class
comment: A stringed instrument of the violin family, with bass to tenor tone. Usually played in sitting position.
subclass of: String Instrument
subclass of: Musical Instrument

Method of Instruction
subclass of: Resource
Has Version: MethodOfInstruction-001
issued: 2008-01-14
type: Class
comment: A process that is used to engender knowledge, attitudes, and skills.
date: 2008-01-14
Relation: MethodOfInstruction-001

Tenor
subclass of: Resource
subclass of: Thing
type: Class
comment: A Tenor singer
subclass of: Singer
subclass of: Agent
subclass of: Artist
subclass of: Musician

Oeuvre
subclass of: Resource
subclass of: Thing
type: Class
comment: A (complete) musical work by a composer.
subclass of: Musical Work

focus
domain: Thing
type: Property
type: ObjectProperty
comment: The underlying or 'focal' entity associated with some SKOS-described concept.
domain: Concept
range: Thing
term status: testing
range: Resource
domain: Resource

Example
subclass of: Resource
subclass of: Thing
type: Class
comment: A class represents one example.
comment: ひとつの例を表すクラス @ja

Timpanist
subclass of: Resource
subclass of: Thing
type: Class
comment: A Timpani player
subclass of: Player
subclass of: http://lodlaundromat.org/.well-known/genid/samples/jena///predicate//1db5ec77e444f4f38af2fda329ad1aa6/1db5ec77e444f4f38af2fda329ad1aa6#18
subclass of: Artist
subclass of: Agent
subclass of: Musician

Size or Duration
subclass of: Resource
description: Examples include a number of pages, a specification of length, width, and breadth, or a period in hours, minutes, and seconds.
Has Version: SizeOrDuration-001
issued: 2008-01-14
type: Class
comment: A dimension or extent, or a time taken to play or execute.
subclass of: Media Type or Extent
type: Thing
date: 2008-01-14
Relation: SizeOrDuration-001

made
domain: Thing
type: Property
type: ObjectProperty
comment: Something that was made by this agent.
domain: Agent
range: Thing
inverse of: maker
term status: stable
range: Resource
domain: Resource

topic_interest
domain: Thing
type: Property
type: ObjectProperty
comment: A thing of interest to this person.
domain: Agent
range: Thing
term status: testing
range: Resource
domain: Resource

past project
domain: Thing
type: Property
type: ObjectProperty
comment: A project this person has previously worked on.
domain: Person
range: Thing
term status: testing
range: Resource
domain: SpatialThing
domain: Resource
domain: Agent

created
sub property of: Date
type: Property
sub property of: Date Created
range: Literal
range: Resource

based near
range: Thing
domain: Thing
type: Property
type: ObjectProperty
comment: A location that something is based near, for some broadly human notion of near.
domain: SpatialThing
range: SpatialThing
term status: testing
range: Resource
domain: Resource

primary topic
domain: Thing
domain: Document
type: FunctionalProperty
range: Thing
type: Property
term status: stable
type: ObjectProperty
comment: The primary topic of some page or document.
inverse of: is primary topic of
range: Resource
domain: Resource

Violist
subclass of: Resource
subclass of: Thing
type: Class
comment: A Viola player
subclass of: Player
subclass of: http://lodlaundromat.org/.well-known/genid/samples/jena///predicate//1db5ec77e444f4f38af2fda329ad1aa6/1db5ec77e444f4f38af2fda329ad1aa6#3
subclass of: Agent
subclass of: Artist
subclass of: Musician

Piccolo player
subclass of: Resource
subclass of: Thing
type: Class
comment: A Piccolo flute player
subclass of: Flutist
subclass of: http://lodlaundromat.org/.well-known/genid/samples/jena///predicate//1db5ec77e444f4f38af2fda329ad1aa6/1db5ec77e444f4f38af2fda329ad1aa6#7
subclass of: http://lodlaundromat.org/.well-known/genid/samples/jena///predicate//1db5ec77e444f4f38af2fda329ad1aa6/1db5ec77e444f4f38af2fda329ad1aa6#6
subclass of: Player
subclass of: Musician
subclass of: Agent
subclass of: Artist

Period of Time
subclass of: Resource
Has Version: PeriodOfTime-001
issued: 2008-01-14
type: Class
comment: An interval of time that is named or defined by its start and end dates.
subclass of: Location, Period, or Jurisdiction
date: 2008-01-14
Relation: PeriodOfTime-001

is primary topic of
range: Thing
comment: A document that this thing is the primary topic of.
domain: Thing
sub property of: page
type: InverseFunctionalProperty
range: Document
type: Property
term status: stable
inverse of: primary topic
type: ObjectProperty
domain: Resource
range: Resource

Composer
subclass of: Resource
subclass of: Thing
type: Class
comment: A person (or any agent) who composed art works
subclass of: Artist
subclass of: Agent

Clarinettist
subclass of: Resource
subclass of: Thing
type: Class
comment: A Clarinet player
subclass of: Player
subclass of: http://lodlaundromat.org/.well-known/genid/samples/jena///predicate//1db5ec77e444f4f38af2fda329ad1aa6/1db5ec77e444f4f38af2fda329ad1aa6#10
subclass of: Artist
subclass of: Agent
subclass of: Musician

Rights Statement
subclass of: Resource
Has Version: RightsStatement-001
issued: 2008-01-14
type: Class
comment: A statement about the intellectual property rights (IPR) held in or over a Resource, a legal document giving official permission to do something with a resource, or a statement about access rights.
date: 2008-01-14
Relation: RightsStatement-001

Venue
subclass of: Resource
subclass of: Thing
type: Class
comment: A venue for musical performance, e.g. concert hall, opera house, recital hall, etc.

Percussionist
subclass of: Resource
subclass of: Thing
type: Class
comment: A Percussion player
subclass of: Player
subclass of: http://lodlaundromat.org/.well-known/genid/samples/jena///predicate//1db5ec77e444f4f38af2fda329ad1aa6/1db5ec77e444f4f38af2fda329ad1aa6#22
subclass of: Agent
subclass of: Artist
subclass of: Musician

Guitar
subclass of: Resource
subclass of: Thing
type: Class
comment: A musical instrument having a large flat-backed sound box, a long fretted neck, and usually six strings, played by strumming or plucking.
subclass of: String Instrument
subclass of: Musical Instrument

Performs
range: Thing
domain: Thing
type: ObjectProperty
comment: The subject artist (or group, machine, etc) performs a musical work.
sub property of: Artist Description
inverse of: Performer
domain: Agent
type: Property
domain: Resource
range: Resource

Bassoon
subclass of: Resource
subclass of: Thing
type: Class
comment: A low-pitched woodwind instrument with a double reed, having a long wooden body attached to a U-shaped lateral tube that leads to the mouthpiece. A Fagotto.
subclass of: Woodwind Instrument
subclass of: Musical Instrument

Represents
range: Thing
domain: Thing
type: ObjectProperty
comment: The subject (performance, score, etc) is a representation of the object musical work. An experiment to have better model.
domain: Musical Representation
range: Musical Work
type: Property
range: Resource
domain: Resource

image
range: Thing
domain: Thing
type: Property
type: ObjectProperty
comment: An image that can be used to represent some thing (ie. those depictions which are particularly representative of something, eg. one's photo on a homepage).
domain: Person
range: Image
sub property of: depiction
term status: testing
domain: Resource
range: Resource
range: Document
domain: SpatialThing
domain: Agent

Project
subclass of: Resource
subclass of: Thing
type: Class
comment: A project (a collective endeavour of some kind).
disjoint with: Person
disjoint with: Document
term status: testing

Code
type: Property
type: AnnotationProperty
comment: Has an example code of an RDF/XML statements that use the schema. Content may be CDATA section or rdf:parseType="Literal".
comment: スキーマを使ったRDF/XMLのサンプルを記述する。CDATAセクションもしくはrdf:parseType="Literal"にすると、タグをそのまま記述できて便利。 @ja

Location
subclass of: Resource
Has Version: Location-001
issued: 2008-01-14
type: Class
comment: A spatial region or named place.
subclass of: Location, Period, or Jurisdiction
date: 2008-01-14
Relation: Location-001

Tuba
subclass of: Resource
subclass of: Thing
type: Class
comment: A large, valved, brass instrument with a bass pitch.
subclass of: Brass Instrument
subclass of: Musical Instrument

Online Gaming Account
subclass of: Resource
subclass of: Thing
type: Class
comment: An online gaming account.
subclass of: Online Account
term status: unstable

Document
subclass of: Resource
subclass of: Thing
type: Class
comment: A document.
disjoint with: Organization
disjoint with: Project
term status: testing

Conductor
range: Thing
domain: Thing
type: ObjectProperty
comment: The subject performance is coducted by the object (or the subject musical event has a conductor). See comment of #performer.
sub property of: Performer
type: Property
domain: Resource
range: Agent
range: Resource

Derived From
range: Thing
domain: Thing
type: ObjectProperty
comment: The subject is (was) derived from the object, e.g a copy score is derived from the composer manuscript (or, possibly, a CD recording is derived from a performance at a concert).
sub property of: Source
domain: Musical Representation
range: Musical Representation
Example: http://lodlaundromat.org/.well-known/genid/samples/jena///predicate//1db5ec77e444f4f38af2fda329ad1aa6/1db5ec77e444f4f38af2fda329ad1aa6#26
type: Property
domain: Resource
range: Resource

Key
range: Thing
domain: Thing
type: ObjectProperty
comment: The subject musical work or its movement has a key, such as C major, d minor, etc.
sub property of: Description
domain: Musical Work
range: Key
type: Property
domain: Resource
range: Resource

Contrabassist
subclass of: Resource
subclass of: Thing
type: Class
comment: A Contrabass player
subclass of: Player
subclass of: http://lodlaundromat.org/.well-known/genid/samples/jena///predicate//1db5ec77e444f4f38af2fda329ad1aa6/1db5ec77e444f4f38af2fda329ad1aa6#5
subclass of: Musician
subclass of: Agent
subclass of: Artist

tipjar
range: Thing
domain: Thing
type: Property
type: ObjectProperty
comment: A tipjar document for this agent, describing means for payment and reward.
domain: Agent
range: Document
sub property of: page
term status: testing
domain: Resource
range: Resource

publications
range: Thing
domain: Thing
type: Property
type: ObjectProperty
comment: A link to the publications of this person.
domain: Person
range: Document
term status: testing
range: Resource
domain: SpatialThing
domain: Resource
domain: Agent

Soprano Clarinet
subclass of: Resource
subclass of: Thing
type: Class
comment: A smaller member of the clarinet family, commonly in key E-flat.
subclass of: Clarinet
subclass of: Musical Instrument
subclass of: Woodwind Instrument

Musical Group
subclass of: Resource
subclass of: Thing
type: Class
comment: A group that performs art works
subclass of: Artist
subclass of: Agent

depiction
range: Thing
type: Property
type: ObjectProperty
comment: A depiction of some thing.
domain: Thing
range: Image
inverse of: depicts
term status: testing
range: Document
range: Resource
domain: Resource

Agent
subclass of: Resource
subclass of: Agent
subclass of: Thing
type: Class
comment: An agent (eg. person, group, software or physical artifact).
equivalent class: Agent
term status: stable

Standard
subclass of: Resource
Has Version: Standard-001
issued: 2008-01-14
type: Class
comment: A basis for comparison; a reference point against which other things can be evaluated.
date: 2008-01-14
Relation: Standard-001

Brass Instrument
subclass of: Resource
subclass of: Thing
type: Class
comment: A wind musical instrument, that consists of a brass tube blown by means of a cup-shaped or funnel-shaped mouthpiece.
subclass of: Musical Instrument

Bass
subclass of: Resource
subclass of: Thing
type: Class
comment: A Bass singer
subclass of: Singer
subclass of: Agent
subclass of: Artist
subclass of: Musician

Viola
subclass of: Resource
subclass of: Thing
type: Class
comment: A stringed instrument of the violin family, slightly larger than a violin, tuned a fifth lower, and having a deeper, more sonorous tone.
subclass of: String Instrument
subclass of: Musical Instrument

thumbnail
range: Thing
domain: Thing
type: Property
type: ObjectProperty
comment: A derived thumbnail image.
domain: Image
range: Image
term status: testing
range: Document
range: Resource
domain: Resource
domain: Document

Es dur
type: Key
Alternative Title: E-Flat major
comment: Major key based on E flat, whose key signature has 3 flats.
description: E flat major
type: Thing
title: E-Flat major

Meter
type: DatatypeProperty
comment: The subject musical work or its movement has a time measure such as 3/4, 4/4, 6/8 etc
sub property of: Description
domain: Musical Work
range: Literal
type: Property
range: Resource
domain: Thing
domain: Resource

creator
type: Property
sub property of: Creator
domain: Thing
domain: Resource
range: Thing
range: Resource

Date Created
sub property of: Date
range: Literal
Date Modified: 2008-01-14
comment: Date of creation of the resource.
type: Property
Has Version: created-003
issued: 2000-07-11
date: 2000-07-11
date: 2008-01-14
Relation: created-003
range: Resource

familyName
type: Property
type: DatatypeProperty
comment: The family name of some person.
domain: Person
range: Literal
term status: testing
range: Resource
domain: Thing
domain: SpatialThing
domain: Resource
domain: Agent

Skype ID
type: Property
type: DatatypeProperty
comment: A Skype ID
domain: Agent
range: Literal
sub property of: nickname
term status: testing
range: Resource
domain: Thing
domain: Resource

Accrual Method
Has Version: accrualMethod-003
issued: 2005-06-13
Date Modified: 2010-10-11
type: Property
comment: The method by which items are added to a collection.
domain: Collection
range: Method of Accrual
date: 2005-06-13
date: 2010-10-11
Relation: accrualMethod-003
range: Resource
domain: Resource

http://lodlaundromat.org/.well-known/genid/samples/jena///predicate//1db5ec77e444f4f38af2fda329ad1aa6/1db5ec77e444f4f38af2fda329ad1aa6#31
type: Example
comment: A simplified description of a concert with its title, date, program and venue. All property values are literal string here.
comment: ある演奏会の名称、日時、プログラム、会場を、文字列だけで記述する例。 @ja
Prefix: m:
Code: <dc:title>Tokyo Green Symphony Orchestra 12th Concert</dc:title> <dc:date>2003-11-02T14:00+09:00</dc:date> Yuri Nitta Violin: Tomoko Kawada Orchestra: Tokyo Green Symphony Orchestra Bruch: Violin Concerto No.1 g minor Brahms: Symphony No.2 D major <cal:location>Sumida Triphony</cal:location>
Example of: Music Vocabulary
type: Thing

Accrual Periodicity
Has Version: accrualPeriodicity-003
issued: 2005-06-13
Date Modified: 2010-10-11
type: Property
comment: The frequency with which items are added to a collection.
domain: Collection
range: Frequency
date: 2005-06-13
date: 2010-10-11
Relation: accrualPeriodicity-003
range: Resource
domain: Resource

UDC
Has Version: UDC-003
issued: 2000-07-11
Date Modified: 2008-01-14
type: VocabularyEncodingScheme
comment: The set of conceptual resources specified by the Universal Decimal Classification.
date: 2000-07-11
date: 2008-01-14
Relation: UDC-003

Is Replaced By
type: Property
sub property of: Relation
note: This term is intended to be used with non-literal values as defined in the DCMI Abstract Model (http://dublincore.org/documents/abstract-model/). As of December 2007, the DCMI Usage Board is seeking a way to express this intention with a formal range declaration.
Date Modified: 2008-01-14
issued: 2000-07-11
Has Version: isReplacedBy-003
comment: A related resource that supplants, displaces, or supersedes the described resource.
date: 2000-07-11
date: 2008-01-14
Relation: isReplacedBy-003

Language
issued: 1999-07-02
note: A second property with the same name as this property has been declared in the dcterms: namespace (http://purl.org/dc/terms/). See the Introduction to the document "DCMI Metadata Terms" (http://dublincore.org/documents/dcmi-terms/) for an explanation.
Has Version: language-007
description: Recommended best practice is to use a controlled vocabulary such as RFC 4646 [RFC4646].
type: Property
comment: A language of the resource.
Date Modified: 2008-01-14
type: Thing
date: 1999-07-02
date: 2008-01-14
Relation: language-007

Has Part
type: Property
Date Modified: 2008-01-14
issued: 2000-07-11
comment: A related resource that is included either physically or logically in the described resource.
note: This term is intended to be used with non-literal values as defined in the DCMI Abstract Model (http://dublincore.org/documents/abstract-model/). As of December 2007, the DCMI Usage Board is seeking a way to express this intention with a formal range declaration.
sub property of: Relation
Has Version: hasPart-003
date: 2000-07-11
date: 2008-01-14
Relation: hasPart-003

title
type: Property
type: DatatypeProperty
comment: Title (Mr, Mrs, Ms, Dr. etc)
term status: testing

http://lodlaundromat.org/.well-known/genid/samples/jena///predicate//1db5ec77e444f4f38af2fda329ad1aa6/1db5ec77e444f4f38af2fda329ad1aa6#25
type: Example
Code: <m:composer foaf:name="Beethoven"/> <dc:title>Symphony No.9</dc:title> Op.125 <dc:date>1826-08</dc:date> <dc:description>The first published edition</dc:description> <dc:publisher>Schott</dc:publisher>
type: Thing

funded by
type: Property
type: ObjectProperty
comment: An organization funding a project or person.
domain: Thing
range: Thing
term status: archaic
range: Resource
domain: Resource

cis moll
type: Key
Alternative Title: C-Sharp minor
comment: Minor key based on C sharp, whose key signature has 4 sharps.
description: C sharp minor
type: Thing
title: C-Sharp minor

C dur
type: Key
Alternative Title: C major
comment: Major key based on C, whose key signature has no sharp or flat.
description: C major
type: Thing
title: C major

lastName
type: Property
type: DatatypeProperty
comment: The last name of a person.
domain: Person
range: Literal
term status: testing
range: Resource
domain: Thing
domain: SpatialThing
domain: Resource
domain: Agent

Type
description: Recommended best practice is to use a controlled vocabulary such as the DCMI Type Vocabulary [DCMITYPE]. To describe the file format, physical medium, or dimensions of the resource, use the Format element.
Has Version: type-006
issued: 1999-07-02
Date Modified: 2008-01-14
type: Property
comment: The nature or genre of the resource.
note: A second property with the same name as this property has been declared in the dcterms: namespace (http://purl.org/dc/terms/). See the Introduction to the document "DCMI Metadata Terms" (http://dublincore.org/documents/dcmi-terms/) for an explanation.
type: Thing
date: 1999-07-02
date: 2008-01-14
Relation: type-006

Relation
note: This term is intended to be used with non-literal values as defined in the DCMI Abstract Model (http://dublincore.org/documents/abstract-model/). As of December 2007, the DCMI Usage Board is seeking a way to express this intention with a formal range declaration.
comment: A related resource.
description: Recommended best practice is to identify the related resource by means of a string conforming to a formal identification system.
Has Version: relationT-001
type: Property
sub property of: Relation
issued: 2008-01-14
Date Modified: 2008-01-14
type: Thing
date: 2008-01-14
Relation: relationT-001

Is Part Of
issued: 2000-07-11
type: Property
sub property of: Relation
Date Modified: 2008-01-14
note: This term is intended to be used with non-literal values as defined in the DCMI Abstract Model (http://dublincore.org/documents/abstract-model/). As of December 2007, the DCMI Usage Board is seeking a way to express this intention with a formal range declaration.
Has Version: isPartOf-003
comment: A related resource in which the described resource is physically or logically included.
date: 2000-07-11
date: 2008-01-14
Relation: isPartOf-003

Surname
type: Property
type: DatatypeProperty
comment: The surname of some person.
domain: Person
range: Literal
term status: archaic
range: Resource
domain: Thing
domain: SpatialThing
domain: Resource
domain: Agent

a moll
type: Key
Alternative Title: A minor
description: A minor
type: Thing
title: A minor

Table Of Contents
Has Version: tableOfContents-003
issued: 2000-07-11
Date Modified: 2008-01-14
type: Property
comment: A list of subunits of the resource.
sub property of: Description
date: 2000-07-11
date: 2008-01-14
Relation: tableOfContents-003
domain: Thing
domain: Resource
range: Thing
range: Resource

RFC 5646
description: RFC 5646 obsoletes RFC 4646.
Has Version: RFC5646-001
issued: 2010-10-11
type: Datatype
comment: The set of tags constructed according to RFC 5646 for the identification of languages.
type: Thing
date: 2010-10-11
Relation: RFC5646-001
type: Class

Date Copyrighted
range: Literal
type: Property
sub property of: Date
comment: Date of copyright.
issued: 2002-07-13
Date Modified: 2008-01-14
Has Version: dateCopyrighted-002
date: 2002-07-13
date: 2008-01-14
Relation: dateCopyrighted-002
range: Resource

Coverage
issued: 2008-01-14
comment: The spatial or temporal topic of the resource, the spatial applicability of the resource, or the jurisdiction under which the resource is relevant.
Has Version: coverageT-001
Date Modified: 2008-01-14
sub property of: Coverage
type: Property
range: Location, Period, or Jurisdiction
description: Spatial topic and spatial applicability may be a named place or a location specified by its geographic coordinates. Temporal topic may be a named period, date, or date range. A jurisdiction may be a named administrative entity or a geographic place to which the resource applies. Recommended best practice is to use a controlled vocabulary such as the Thesaurus of Geographic Names [TGN]. Where appropriate, named places or time periods can be used in preference to numeric identifiers such as sets of coordinates or date ranges.
type: Thing
date: 2008-01-14
Relation: coverageT-001
range: Resource

NLM
Has Version: NLM-002
issued: 2005-06-13
Date Modified: 2008-01-14
type: VocabularyEncodingScheme
comment: The set of conceptual resources specified by the National Library of Medicine Classification.
date: 2005-06-13
date: 2008-01-14
Relation: NLM-002

Accrual Policy
Has Version: accrualPolicy-003
issued: 2005-06-13
Date Modified: 2010-10-11
type: Property
comment: The policy governing the addition of items to a collection.
domain: Collection
range: Policy
date: 2005-06-13
date: 2010-10-11
Relation: accrualPolicy-003
range: Resource
domain: Resource

DNA checksum
type: Property
type: DatatypeProperty
comment: A checksum for the DNA of some thing. Joke.
range: Literal
term status: archaic
range: Resource

membershipClass
type: Property
type: AnnotationProperty
comment: Indicates the class of individuals that are a member of a Group
term status: unstable

Provenance
description: The statement may include a description of any changes successive custodians made to the resource.
Has Version: provenance-002
issued: 2004-09-20
Date Modified: 2008-01-14
type: Property
comment: A statement of any changes in ownership and custody of the resource since its creation that are significant for its authenticity, integrity, and interpretation.
range: Provenance Statement
type: Thing
date: 2004-09-20
date: 2008-01-14
Relation: provenance-002
range: Resource

Form
type: DatatypeProperty
comment: The subject musical work or its movement has a form, such as sonata, minuet, etc. Would be better defined as ObjectProperty.
sub property of: Description
domain: Musical Work
range: Literal
type: Property
range: Resource
domain: Thing
domain: Resource

Des dur
type: Key
Alternative Title: D-Flat major
comment: Major key based on D flat, whose key signature has 5 flats.
description: D flat major
type: Thing
title: D-Flat major

plan
type: Property
type: DatatypeProperty
comment: Aplan comment, in the tradition of finger and '.plan' files.
domain: Person
range: Literal
term status: testing
range: Resource
domain: Thing
domain: SpatialThing
domain: Resource
domain: Agent

http://lodlaundromat.org/.well-known/genid/samples/jena///predicate//1db5ec77e444f4f38af2fda329ad1aa6/1db5ec77e444f4f38af2fda329ad1aa6#32
type: Example
comment: A description of a symphony with its composition data and descriptions of movements. Note now key values are expressed as URIs.
comment: 交響曲の楽曲情報と楽章データの記述例。調性の記述をURIに変更。 @ja
Trial: D.759
Image: 'circles and arrows' graphical representation of this example
Prefix: m:
Code: <foaf:name>シューベルト</foaf:name> <foaf:homepage rdf:resource="http://www.kanzaki.com/music/mw/sym/schubert"/> <dc:title>Symohony No.7 'Unfinished'</dc:title> D.759 <m:key rdf:resource="http://www.kanzaki.com/ns/music#h-moll"/> <dcterms:created>1822-01</dcterms:created> <dc:date>1865-12-17</dc:date> <cal:location>Wien Musikfereinsall</cal:location> Allegro moderato <m:key rdf:resource="http://www.kanzaki.com/ns/music#h-moll"/> 3/4 Andante con moto <m:key rdf:resource="http://www.kanzaki.com/ns/music#Es-dur"/> 3/8
Example of: Music Vocabulary
type: Thing

sha1sum (hex)
type: Property
type: DatatypeProperty
comment: A sha1sum hash, in hex.
domain: Document
term status: unstable
domain: Thing
domain: Resource

Given name
type: Property
type: DatatypeProperty
comment: The given name of some person.
term status: archaic

b moll
type: Key
Alternative Title: B-Flat minor
comment: Minor key based on B flat, whose key signature has 5 flats.
description: B flat minor
type: Thing
title: B-Flat minor

Cis dur
type: Key
Alternative Title: C-Sharp major
comment: Major key based on C sharp, whose key signature has 7 sharps.
description: C sharp major
type: Thing
title: C-Sharp major

Title
Has Version: title-006
issued: 1999-07-02
Date Modified: 2008-01-14
type: Property
comment: A name given to the resource.
note: A second property with the same name as this property has been declared in the dcterms: namespace (http://purl.org/dc/terms/). See the Introduction to the document "DCMI Metadata Terms" (http://dublincore.org/documents/dcmi-terms/) for an explanation.
date: 1999-07-02
date: 2008-01-14
Relation: title-006

LCC
Has Version: LCC-003
issued: 2000-07-11
Date Modified: 2008-01-14
type: VocabularyEncodingScheme
comment: The set of conceptual resources specified by the Library of Congress Classification.
date: 2000-07-11
date: 2008-01-14
Relation: LCC-003

As dur
type: Key
Alternative Title: A-Flat major
comment: Major key based on A flat, whose key signature has 4 flats.
description: A flat major
type: Thing
title: A-Flat major

Title
Has Version: titleT-002
issued: 2008-01-14
Date Modified: 2010-10-11
type: Property
comment: A name given to the resource.
range: Literal
sub property of: Title
date: 2008-01-14
date: 2010-10-11
Relation: titleT-002
range: Resource

IMT
Has Version: IMT-004
issued: 2000-07-11
Date Modified: 2008-01-14
type: VocabularyEncodingScheme
comment: The set of media types specified by the Internet Assigned Numbers Authority.
date: 2000-07-11
date: 2008-01-14
Relation: IMT-004

relation
type: Property
sub property of: Relation

Medium
range: Physical Medium
comment: The material or physical carrier of the resource.
domain: Physical Resource
issued: 2000-07-11
type: Property
Has Version: medium-003
sub property of: Format
Date Modified: 2008-01-14
date: 2000-07-11
date: 2008-01-14
Relation: medium-003
range: Media Type or Extent
range: Resource
range: Media Type
domain: Resource

Date Available
comment: Date (often a range) that the resource became or will become available.
issued: 2000-07-11
Has Version: available-003
sub property of: Date
Date Modified: 2008-01-14
type: Property
range: Literal
date: 2000-07-11
date: 2008-01-14
Relation: available-003
range: Resource

ICQ chat ID
sub property of: nickname
term status: testing
domain: Agent
range: Literal
comment: An ICQ chat ID
type: InverseFunctionalProperty
type: Property
type: DatatypeProperty
type: ObjectProperty
range: Resource
domain: Thing
domain: Resource

B dur
type: Key
Alternative Title: B-Flat major
comment: Major key based on B flat, whose key signature has 2 flats.
description: B flat major
type: Thing
title: B-Flat major

Has Format
issued: 2000-07-11
Date Modified: 2008-01-14
type: Property
comment: A related resource that is substantially the same as the pre-existing described resource, but in another format.
Has Version: hasFormat-003
sub property of: Relation
note: This term is intended to be used with non-literal values as defined in the DCMI Abstract Model (http://dublincore.org/documents/abstract-model/). As of December 2007, the DCMI Usage Board is seeking a way to express this intention with a formal range declaration.
date: 2000-07-11
date: 2008-01-14
Relation: hasFormat-003

http://lodlaundromat.org/.well-known/genid/samples/jena///predicate//1db5ec77e444f4f38af2fda329ad1aa6/1db5ec77e444f4f38af2fda329ad1aa6#26
type: Example
Code: <dc:title>Autograph score</dc:title> <dc:title>A copyist's socore used as engraver's copy</dc:title> <m:derivedFrom rdf:resource="urn:musicalsource:lvb/125/autograph"/>
type: Thing

DDC
Has Version: DDC-003
issued: 2000-07-11
Date Modified: 2008-01-14
type: VocabularyEncodingScheme
comment: The set of conceptual resources specified by the Dewey Decimal Classification.
date: 2000-07-11
date: 2008-01-14
Relation: DDC-003

g moll
type: Key
Alternative Title: G minor
comment: Minor key based on G, whose key signature has 2 flats.
description: G minor
type: Thing
title: G minor

G dur
type: Key
Alternative Title: G major
comment: Major key based on G, whose key signature has 1 sharp.
description: G major
type: Thing
title: G major

http://lodlaundromat.org/.well-known/genid/samples/jena///predicate//1db5ec77e444f4f38af2fda329ad1aa6/ebd6d825318bc495634854d3b267d149#1
type: Example
comment: An example included in a schema definition.
comment: スキーマに例を埋め込む例。 @ja
Prefix: ex:
Code: <ex:Example> <rdfs:comment>An example to use Dublin Core vocabulary.</rdfs:comment> <rdfs:comment xml:lang="ja">ダブリンコア語彙を使う例</rdfs:comment> <ex:pfx>dc:</ex:pfx> <ex:code rdf:parseType="Literal"> <rdf:Description rdf:about="http://www.kanzaki.com/"> <dc:title>The Web KANZAKI</dc:title> <dc:creator>Masahide Kanzaki</dc:creator> </rdf:Description> </ex:code> <ex:exampleOf rdf:resource=""/> </ex:Example>
Example of: Example vocabulary
type: Thing

theme
type: Property
type: ObjectProperty
comment: A theme.
domain: Thing
range: Thing
term status: archaic
range: Resource
domain: Resource

RFC 4646
description: RFC 4646 obsoletes RFC 3066.
Has Version: RFC4646-001
issued: 2008-01-14
type: Datatype
comment: The set of tags constructed according to RFC 4646 for the identification of languages.
type: Thing
date: 2008-01-14
Relation: RFC4646-001
type: Class

Bibliographic Citation
Has Version: bibliographicCitation-002
description: Recommended practice is to include sufficient bibliographic detail to identify the resource as unambiguously as possible.
range: Literal
domain: Bibliographic Resource
comment: A bibliographic reference for the resource.
type: Property
sub property of: Identifier
issued: 2003-02-15
Date Modified: 2008-01-14
type: Thing
date: 2003-02-15
date: 2008-01-14
Relation: bibliographicCitation-002
range: Resource
domain: Resource

Replaces
Has Version: replaces-003
note: This term is intended to be used with non-literal values as defined in the DCMI Abstract Model (http://dublincore.org/documents/abstract-model/). As of December 2007, the DCMI Usage Board is seeking a way to express this intention with a formal range declaration.
Date Modified: 2008-01-14
comment: A related resource that is supplanted, displaced, or superseded by the described resource.
sub property of: Relation
type: Property
issued: 2000-07-11
date: 2000-07-11
date: 2008-01-14
Relation: replaces-003

h moll
type: Key
Alternative Title: B minor
comment: Minor key based on B, whose key signature has 2 sharps.
description: B minor
type: Thing
title: B minor

DCMI Box
Has Version: Box-003
issued: 2000-07-11
Date Modified: 2008-01-14
type: Datatype
comment: The set of regions in space defined by their geographic coordinates according to the DCMI Box Encoding Scheme.
date: 2000-07-11
date: 2008-01-14
Relation: Box-003
type: Class

DCMI Metadata Terms - other
Date Modified: 2012-06-14
publisher: DCMI
date: 2012-06-14

Temporal Coverage
sub property of: Coverage
Has Version: temporal-003
type: Property
issued: 2000-07-11
Date Modified: 2008-01-14
range: Period of Time
comment: Temporal characteristics of the resource.
date: 2000-07-11
date: 2008-01-14
Relation: temporal-003
range: Location, Period, or Jurisdiction
range: Resource

ISO 639-2
Has Version: ISO639-2-003
issued: 2000-07-11
Date Modified: 2008-01-14
type: Datatype
comment: The three-letter alphabetic codes listed in ISO639-2 for the representation of names of languages.
date: 2000-07-11
date: 2008-01-14
Relation: ISO639-2-003
type: Class

Date Valid
type: Property
range: Literal
issued: 2000-07-11
sub property of: Date
comment: Date (often a range) of validity of a resource.
Date Modified: 2008-01-14
Has Version: valid-003
date: 2000-07-11
date: 2008-01-14
Relation: valid-003
range: Resource

title
type: Property
sub property of: Title

RFC 3066
description: RFC 3066 has been obsoleted by RFC 4646.
Has Version: RFC3066-002
issued: 2002-07-13
Date Modified: 2008-01-14
type: Datatype
comment: The set of tags constructed according to RFC 3066 for the identification of languages.
type: Thing
date: 2002-07-13
date: 2008-01-14
Relation: RFC3066-002
type: Class

A dur
type: Key
Alternative Title: A major
comment: Major key based on A, whose key signature has 3 sharps.
description: A major
type: Thing
title: A major

birthday
type: Property
type: FunctionalProperty
type: DatatypeProperty
comment: The birthday of this Agent, represented in mm-dd string form, eg. '12-31'.
domain: Agent
range: Literal
term status: unstable
range: Resource
domain: Thing
domain: Resource

Ges dur
type: Key
Alternative Title: G-Flat major
comment: Major key based on G flat, whose key signature has 6 flats.
description: G flat major
type: Thing
title: G-Flat major

Extent
type: Property
comment: The size or duration of the resource.
issued: 2000-07-11
range: Size or Duration
Has Version: extent-003
Date Modified: 2008-01-14
sub property of: Format
date: 2000-07-11
date: 2008-01-14
Relation: extent-003
range: Media Type or Extent
range: Resource

F dur
type: Key
Alternative Title: F major
comment: Major key based on F, whose key signature has 1 flat.
description: F major
type: Thing
title: F major

Fis dur
type: Key
Alternative Title: F-Sharp major
comment: Major key based on F sharp, whose key signature has 6 sharps.
description: F sharp major
type: Thing
title: F-Sharp major

URI
Has Version: URI-003
issued: 2000-07-11
Date Modified: 2008-01-14
type: Datatype
comment: The set of identifiers constructed according to the generic syntax for Uniform Resource Identifiers as specified by the Internet Engineering Task Force.
date: 2000-07-11
date: 2008-01-14
Relation: URI-003
type: Class

Date
issued: 2008-01-14
comment: A point or period of time associated with an event in the lifecycle of the resource.
description: Date may be used to express temporal information at any level of granularity. Recommended best practice is to use an encoding scheme, such as the W3CDTF profile of ISO 8601 [W3CDTF].
Has Version: dateT-001
Date Modified: 2008-01-14
type: Property
range: Literal
sub property of: Date
type: Thing
date: 2008-01-14
Relation: dateT-001
range: Resource

W3C-DTF
Has Version: W3CDTF-003
issued: 2000-07-11
Date Modified: 2008-01-14
type: Datatype
comment: The set of dates and times constructed according to the W3C Date and Time Formats Specification.
date: 2000-07-11
date: 2008-01-14
Relation: W3CDTF-003
type: Class

fis moll
type: Key
Alternative Title: F-Sharp minor
comment: Minor key based on F sharp, whose key signature has 3 sharps.
description: F sharp minor
type: Thing
title: F-Sharp minor

Music Vocabulary
type: Ontology
imports: dliser.rdf
comment: A vocabulary, or music ontology, to describe classical music and performances. Classes (categories) for musical works, events, instruments and performers, as well as related properties are defined. Make sure to distinguish musical works (e.g. Opera) from performance events (Opera_Event), or works (String_Quartette) from performer (StringQuartetEnsemble in this vocab), whose natural language terms are used interchangeblly. The present version experiments more precise model to describe a musical work, its representations (performances, scores, etc) and a musical event to present a representation (a concert). Includes 30 keys as individuals.
comment: 音楽作品、楽器、演奏情報を記述するためのボキャブラリ。Opera_Event（演奏）とOpera（作品）や、String_Quartette（作品）とStringQuartetEnsemble（団体）のように、日常語では両方の意味に使われるクラスの区別に注意。このバージョンでは、音楽作品、その表現（演奏、楽譜など）とイベント（演奏会）をより精密にモデリングするべく実験中。 @ja
version info: Version 0.9.6 - OWL DL version. Some stable, some experimental. Changed terms: Opera_Performance to Opera_Event, Ballet_Performance to Ballet_Event.
created: 2003-07-04
modified: 2007-10-31
creator: 神崎正英
date: 2007-10-31
type: Thing
date: 2003-07-04

http://lodlaundromat.org/.well-known/genid/samples/jena///predicate//1db5ec77e444f4f38af2fda329ad1aa6/1db5ec77e444f4f38af2fda329ad1aa6#27
type: Example
Code: <m:conductor foaf:name="Sir Roger Norrington"/> <m:performer foaf:name="R.S.O. Stuttgart"/> <m:composer foaf:name="Brahms"/> <dc:title>Symphony No.2 D major</dc:title>
type: Thing

Access Rights
range: Rights Statement
type: Property
issued: 2003-02-15
comment: Information about who can access the resource or an indication of its security status.
description: Access Rights may include information regarding access or restrictions based on privacy, security, or other policies.
sub property of: Rights
Date Modified: 2008-01-14
Has Version: accessRights-002
type: Thing
date: 2003-02-15
date: 2008-01-14
Relation: accessRights-002
range: Resource

Ces dur
type: Key
Alternative Title: C-Flat major
comment: Major key based on C flat, whose key signature has 7 flats.
description: C flat major
type: Thing
title: C-Flat major

Opus
type: DatatypeProperty
comment: The subject musical composition has an identifier assigned by a composer (e.g. 'op.131') or other editor (e.g. 'KV.551')
sub property of: Identifier
domain: Oeuvre
range: Literal
type: Property
range: Resource
domain: Thing
domain: Musical Work
domain: Resource

Friend of a Friend (FOAF) vocabulary
type: Ontology
description: The Friend of a Friend (FOAF) RDF vocabulary, described using W3C RDF Schema and the Web Ontology Language.

TGN
Has Version: TGN-003
issued: 2000-07-11
Date Modified: 2008-01-14
type: VocabularyEncodingScheme
comment: The set of places specified by the Getty Thesaurus of Geographic Names.
date: 2000-07-11
date: 2008-01-14
Relation: TGN-003

PerformerName
type: DatatypeProperty
comment: The subject musical event has a performer. Literal version of #performer.
sub property of: Description
domain: Musical Event
range: Literal
type: Property
range: Resource
domain: Thing
domain: Resource

Dublin Core Metadata Element Set, Version 1.1
Date Modified: 2012-06-14
publisher: DCMI
date: 2012-06-14

DCMI Type Vocabulary
Has Version: DCMIType-005
issued: 2000-07-11
Date Modified: 2012-06-14
type: VocabularyEncodingScheme
comment: The set of classes specified by the DCMI Type Vocabulary, used to categorize the nature or genre of the resource.
date: 2000-07-11
date: 2012-06-14
Relation: DCMIType-005

Language
Date Modified: 2008-01-14
type: Property
Has Version: languageT-001
sub property of: Language
description: Recommended best practice is to use a controlled vocabulary such as RFC 4646 [RFC4646].
issued: 2008-01-14
comment: A language of the resource.
range: Linguistic System
type: Thing
date: 2008-01-14
Relation: languageT-001
range: Resource

'circles and arrows' graphical representation of this example
type: Image
type: Document
type: Thing

c moll
type: Key
Alternative Title: C minor
comment: Minor key based on C, whose key signature has 3 flats.
description: C minor
type: Thing
title: C minor

Given name
type: Property
type: DatatypeProperty
comment: The given name of some person.
term status: testing

Is Required By
comment: A related resource that requires the described resource to support its function, delivery, or coherence.
type: Property
Date Modified: 2008-01-14
sub property of: Relation
note: This term is intended to be used with non-literal values as defined in the DCMI Abstract Model (http://dublincore.org/documents/abstract-model/). As of December 2007, the DCMI Usage Board is seeking a way to express this intention with a formal range declaration.
Has Version: isRequiredBy-003
issued: 2000-07-11
date: 2000-07-11
date: 2008-01-14
Relation: isRequiredBy-003

Key Name
type: DatatypeProperty
comment: The subject musical work or its movement has a key. Textual version of #key.
sub property of: Description
domain: Musical Work
range: Literal
type: Property
range: Resource
domain: Thing
domain: Resource

dis moll
type: Key
Alternative Title: D-Sharp minor
comment: Minor key based on D sharp, whose key signature has 6 sharps.
description: D sharp minor
type: Thing
title: D-Sharp minor

ISO 639-3
Has Version: ISO639-3-001
issued: 2008-01-14
type: Datatype
comment: The set of three-letter codes listed in ISO 639-3 for the representation of names of languages.
date: 2008-01-14
Relation: ISO639-3-001
type: Class

name
type: Property
type: DatatypeProperty
comment: A name for some thing.
domain: Thing
range: Literal
sub property of: label
term status: testing
range: Resource
domain: Resource

Publisher
description: Examples of a Publisher include a person, an organization, or a service. Typically, the name of a Publisher should be used to indicate the entity.
Has Version: publisher-006
issued: 1999-07-02
Date Modified: 2008-01-14
type: Property
comment: An entity responsible for making the resource available.
note: A second property with the same name as this property has been declared in the dcterms: namespace (http://purl.org/dc/terms/). See the Introduction to the document "DCMI Metadata Terms" (http://dublincore.org/documents/dcmi-terms/) for an explanation.
type: Thing
date: 1999-07-02
date: 2008-01-14
Relation: publisher-006

E dur
type: Key
Alternative Title: E major
comment: Major key based on E, whose key signature has 4 sharps.
description: E major
type: Thing
title: E major

d moll
type: Key
Alternative Title: D minor
comment: Minor key based on D, whose key signature has 1 flat.
description: D minor
type: Thing
title: D minor

Is Version Of
note: This term is intended to be used with non-literal values as defined in the DCMI Abstract Model (http://dublincore.org/documents/abstract-model/). As of December 2007, the DCMI Usage Board is seeking a way to express this intention with a formal range declaration.
Has Version: isVersionOf-003
sub property of: Relation
type: Property
comment: A related resource of which the described resource is a version, edition, or adaptation.
issued: 2000-07-11
description: Changes in version imply substantive changes in content rather than differences in format.
Date Modified: 2008-01-14
type: Thing
date: 2000-07-11
date: 2008-01-14
Relation: isVersionOf-003

nickname
type: Property
type: DatatypeProperty
comment: A short informal nickname characterising an agent (includes login identifiers, IRC and other chat nicknames).
term status: testing

Conforms To
issued: 2001-05-21
Date Modified: 2008-01-14
range: Standard
sub property of: Relation
comment: An established standard to which the described resource conforms.
Has Version: conformsTo-003
type: Property
date: 2001-05-21
date: 2008-01-14
Relation: conformsTo-003
range: Resource

Date Issued
range: Literal
sub property of: Date
comment: Date of formal issuance (e.g., publication) of the resource.
Has Version: issued-003
Date Modified: 2008-01-14
type: Property
issued: 2000-07-11
date: 2000-07-11
date: 2008-01-14
Relation: issued-003
range: Resource

Yahoo chat ID
domain: Agent
term status: testing
range: Literal
comment: A Yahoo chat ID
type: DatatypeProperty
sub property of: nickname
type: Property
type: InverseFunctionalProperty
type: ObjectProperty
range: Resource
domain: Thing
domain: Resource

Abstract
Has Version: abstract-003
issued: 2000-07-11
Date Modified: 2008-01-14
type: Property
comment: A summary of the resource.
sub property of: Description
date: 2000-07-11
date: 2008-01-14
Relation: abstract-003
domain: Thing
domain: Resource
range: Thing
range: Resource

http://lodlaundromat.org/.well-known/genid/samples/jena///predicate//1db5ec77e444f4f38af2fda329ad1aa6/1db5ec77e444f4f38af2fda329ad1aa6#28
type: Example
Code: <m:conductor foaf:name="Sir Roger Norrington"/> <m:performer foaf:name="R.S.O. Stuttgart"/> <m:composer foaf:name="Brahms"/> <dc:title>Symphony No.2 D major</dc:title> <!-- An application may infer that: {X a m:Concert; m:performer Y; m:program Z.} => {X m:presents [a m:Performance; m:performer Y; m:represents Z]} -->
type: Thing

AIM chat ID
type: Property
type: DatatypeProperty
domain: Agent
comment: An AIM chat ID
type: InverseFunctionalProperty
term status: testing
range: Literal
sub property of: nickname
type: ObjectProperty
range: Resource
domain: Thing
domain: Resource

Date
description: Date may be used to express temporal information at any level of granularity. Recommended best practice is to use an encoding scheme, such as the W3CDTF profile of ISO 8601 [W3CDTF].
Has Version: date-006
issued: 1999-07-02
Date Modified: 2008-01-14
type: Property
comment: A point or period of time associated with an event in the lifecycle of the resource.
note: A second property with the same name as this property has been declared in the dcterms: namespace (http://purl.org/dc/terms/). See the Introduction to the document "DCMI Metadata Terms" (http://dublincore.org/documents/dcmi-terms/) for an explanation.
type: Thing
date: 1999-07-02
date: 2008-01-14
Relation: date-006

es moll
type: Key
Alternative Title: E-Flat minor
comment: Minor key based on E flat, whose key signature has 6 flats.
description: E flat minor
type: Thing
title: E-Flat minor

Audience
Has Version: audience-003
issued: 2001-05-21
Date Modified: 2008-01-14
type: Property
comment: A class of entity for whom the resource is intended or useful.
range: Agent Class
date: 2001-05-21
date: 2008-01-14
Relation: audience-003
range: Resource
range: Class

References
type: Property
note: This term is intended to be used with non-literal values as defined in the DCMI Abstract Model (http://dublincore.org/documents/abstract-model/). As of December 2007, the DCMI Usage Board is seeking a way to express this intention with a formal range declaration.
issued: 2000-07-11
Date Modified: 2008-01-14
sub property of: Relation
Has Version: references-003
comment: A related resource that is referenced, cited, or otherwise pointed to by the described resource.
date: 2000-07-11
date: 2008-01-14
Relation: references-003

as moll
type: Key
Alternative Title: A-Flat minor
comment: Minor key based on A flat, whose key signature has 7 flats.
description: A flat minor
type: Thing
title: A-Flat minor

Alternative Title
sub property of: Title
type: Property
Date Modified: 2010-10-11
range: Literal
issued: 2000-07-11
description: The distinction between titles and alternative titles is application-specific.
Has Version: alternative-003
comment: An alternative name for the resource.
type: DatatypeProperty
type: Thing
date: 2000-07-11
date: 2010-10-11
Relation: alternative-003
range: Resource

Identifier
sub property of: Identifier
range: Literal
Has Version: identifierT-001
description: Recommended best practice is to identify the resource by means of a string conforming to a formal identification system.
issued: 2008-01-14
type: Property
comment: An unambiguous reference to the resource within a given context.
Date Modified: 2008-01-14
type: Thing
date: 2008-01-14
Relation: identifierT-001
range: Resource

Relation
description: Recommended best practice is to identify the related resource by means of a string conforming to a formal identification system.
Has Version: relation-006
issued: 1999-07-02
Date Modified: 2008-01-14
type: Property
comment: A related resource.
note: A second property with the same name as this property has been declared in the dcterms: namespace (http://purl.org/dc/terms/). See the Introduction to the document "DCMI Metadata Terms" (http://dublincore.org/documents/dcmi-terms/) for an explanation.
type: Thing
date: 1999-07-02
date: 2008-01-14
Relation: relation-006

Rights
description: Typically, rights information includes a statement about various property rights associated with the resource, including intellectual property rights.
Has Version: rights-006
issued: 1999-07-02
Date Modified: 2008-01-14
type: Property
comment: Information about rights held in and over the resource.
note: A second property with the same name as this property has been declared in the dcterms: namespace (http://purl.org/dc/terms/). See the Introduction to the document "DCMI Metadata Terms" (http://dublincore.org/documents/dcmi-terms/) for an explanation.
type: Thing
date: 1999-07-02
date: 2008-01-14
Relation: rights-006

Instructional Method
description: Instructional Method will typically include ways of presenting instructional materials or conducting instructional activities, patterns of learner-to-learner and learner-to-instructor interactions, and mechanisms by which group and individual levels of learning are measured. Instructional methods include all aspects of the instruction and learning processes from planning and implementation through evaluation and feedback.
Has Version: instructionalMethod-002
issued: 2005-06-13
Date Modified: 2008-01-14
type: Property
comment: A process, used to engender knowledge, attitudes and skills, that the described resource is designed to support.
range: Method of Instruction
type: Thing
date: 2005-06-13
date: 2008-01-14
Relation: instructionalMethod-002
range: Resource

geekcode
type: Property
type: DatatypeProperty
comment: A textual geekcode for this person, see http://www.geekcode.com/geek.html
domain: Person
range: Literal
term status: archaic
range: Resource
domain: Thing
domain: SpatialThing
domain: Resource
domain: Agent

family_name
type: Property
type: DatatypeProperty
comment: The family name of some person.
domain: Person
range: Literal
term status: archaic
range: Resource
domain: Thing
domain: SpatialThing
domain: Resource
domain: Agent

Date Submitted
sub property of: Date
type: Property
range: Literal
comment: Date of submission of the resource.
Date Modified: 2008-01-14
issued: 2002-07-13
description: Examples of resources to which a Date Submitted may be relevant are a thesis (submitted to a university department) or an article (submitted to a journal).
Has Version: dateSubmitted-002
type: Thing
date: 2002-07-13
date: 2008-01-14
Relation: dateSubmitted-002
range: Resource

Is Format Of
Has Version: isFormatOf-003
Date Modified: 2008-01-14
issued: 2000-07-11
sub property of: Relation
type: Property
note: This term is intended to be used with non-literal values as defined in the DCMI Abstract Model (http://dublincore.org/documents/abstract-model/). As of December 2007, the DCMI Usage Board is seeking a way to express this intention with a formal range declaration.
comment: A related resource that is substantially the same as the described resource, but in another format.
date: 2000-07-11
date: 2008-01-14
Relation: isFormatOf-003

Marks
type: DatatypeProperty
comment: The subject musical work or its movement has instruction mark(s) of tempo and/or expression
sub property of: Description
domain: Musical Work
range: Literal
type: Property
range: Resource
domain: Thing
domain: Resource

Mediator
type: Property
range: Agent Class
issued: 2001-05-21
Has Version: mediator-003
Date Modified: 2008-01-14
comment: An entity that mediates access to the resource and for whom the resource is intended or useful.
description: In an educational context, a mediator might be a parent, teacher, teaching assistant, or care-giver.
sub property of: Audience
type: Thing
date: 2001-05-21
date: 2008-01-14
Relation: mediator-003
range: Resource
range: Class

Program Line
type: DatatypeProperty
comment: The subject musical event presents a musical work as its program. Literal version of #program.
sub property of: Description
domain: Musical Event
range: Literal
type: Property
range: Resource
domain: Thing
domain: Resource

Coverage
description: Spatial topic and spatial applicability may be a named place or a location specified by its geographic coordinates. Temporal topic may be a named period, date, or date range. A jurisdiction may be a named administrative entity or a geographic place to which the resource applies. Recommended best practice is to use a controlled vocabulary such as the Thesaurus of Geographic Names [TGN]. Where appropriate, named places or time periods can be used in preference to numeric identifiers such as sets of coordinates or date ranges.
Has Version: coverage-006
issued: 1999-07-02
Date Modified: 2008-01-14
type: Property
comment: The spatial or temporal topic of the resource, the spatial applicability of the resource, or the jurisdiction under which the resource is relevant.
note: A second property with the same name as this property has been declared in the dcterms: namespace (http://purl.org/dc/terms/). See the Introduction to the document "DCMI Metadata Terms" (http://dublincore.org/documents/dcmi-terms/) for an explanation.
type: Thing
date: 1999-07-02
date: 2008-01-14
Relation: coverage-006

Subject
description: Typically, the subject will be represented using keywords, key phrases, or classification codes. Recommended best practice is to use a controlled vocabulary.
Has Version: subject-007
issued: 1999-07-02
Date Modified: 2012-06-14
type: Property
comment: The topic of the resource.
note: A second property with the same name as this property has been declared in the dcterms: namespace (http://purl.org/dc/terms/). See the Introduction to the document "DCMI Metadata Terms" (http://dublincore.org/documents/dcmi-terms/) for an explanation.
type: Thing
date: 1999-07-02
date: 2012-06-14
Relation: subject-007

Format
description: Examples of dimensions include size and duration. Recommended best practice is to use a controlled vocabulary such as the list of Internet Media Types [MIME].
Has Version: format-007
issued: 1999-07-02
Date Modified: 2008-01-14
type: Property
comment: The file format, physical medium, or dimensions of the resource.
note: A second property with the same name as this property has been declared in the dcterms: namespace (http://purl.org/dc/terms/). See the Introduction to the document "DCMI Metadata Terms" (http://dublincore.org/documents/dcmi-terms/) for an explanation.
type: Thing
date: 1999-07-02
date: 2008-01-14
Relation: format-007

RFC 1766
Has Version: RFC1766-003
issued: 2000-07-11
Date Modified: 2008-01-14
type: Datatype
comment: The set of tags, constructed according to RFC 1766, for the identification of languages.
date: 2000-07-11
date: 2008-01-14
Relation: RFC1766-003
type: Class

MSN chat ID
sub property of: nickname
type: InverseFunctionalProperty
comment: An MSN chat ID
domain: Agent
type: DatatypeProperty
term status: testing
type: Property
range: Literal
type: ObjectProperty
range: Resource
domain: Thing
domain: Resource

Is Referenced By
Date Modified: 2008-01-14
issued: 2000-07-11
sub property of: Relation
note: This term is intended to be used with non-literal values as defined in the DCMI Abstract Model (http://dublincore.org/documents/abstract-model/). As of December 2007, the DCMI Usage Board is seeking a way to express this intention with a formal range declaration.
comment: A related resource that references, cites, or otherwise points to the described resource.
type: Property
Has Version: isReferencedBy-003
date: 2000-07-11
date: 2008-01-14
Relation: isReferencedBy-003

DCMI Point
Has Version: Point-003
issued: 2000-07-11
Date Modified: 2008-01-14
type: Datatype
comment: The set of points in space defined by their geographic coordinates according to the DCMI Point Encoding Scheme.
date: 2000-07-11
date: 2008-01-14
Relation: Point-003
type: Class

Requires
Has Version: requires-003
type: Property
comment: A related resource that is required by the described resource to support its function, delivery, or coherence.
issued: 2000-07-11
sub property of: Relation
note: This term is intended to be used with non-literal values as defined in the DCMI Abstract Model (http://dublincore.org/documents/abstract-model/). As of December 2007, the DCMI Usage Board is seeking a way to express this intention with a formal range declaration.
Date Modified: 2008-01-14
date: 2000-07-11
date: 2008-01-14
Relation: requires-003

Rights
range: Rights Statement
issued: 2008-01-14
description: Typically, rights information includes a statement about various property rights associated with the resource, including intellectual property rights.
comment: Information about rights held in and over the resource.
Date Modified: 2008-01-14
type: Property
Has Version: rightsT-001
sub property of: Rights
type: Thing
date: 2008-01-14
Relation: rightsT-001
range: Resource

Subject
Has Version: subjectT-002
Date Modified: 2012-06-14
description: Typically, the subject will be represented using keywords, key phrases, or classification codes. Recommended best practice is to use a controlled vocabulary.
issued: 2008-01-14
sub property of: Subject
type: Property
note: This term is intended to be used with non-literal values as defined in the DCMI Abstract Model (http://dublincore.org/documents/abstract-model/). As of December 2007, the DCMI Usage Board is seeking a way to express this intention with a formal range declaration.
comment: The topic of the resource.
type: Thing
date: 2008-01-14
date: 2012-06-14
Relation: subjectT-002

sha1sum of a personal mailbox URI name
type: Property
type: InverseFunctionalProperty
type: DatatypeProperty
comment: The sha1sum of the URI of an Internet mailbox associated with exactly one owner, the first owner of the mailbox.
domain: Agent
range: Literal
term status: testing
type: ObjectProperty
range: Resource
domain: Thing
domain: Resource

Contributor
description: Examples of a Contributor include a person, an organization, or a service. Typically, the name of a Contributor should be used to indicate the entity.
Has Version: contributor-006
issued: 1999-07-02
Date Modified: 2008-01-14
type: Property
comment: An entity responsible for making contributions to the resource.
note: A second property with the same name as this property has been declared in the dcterms: namespace (http://purl.org/dc/terms/). See the Introduction to the document "DCMI Metadata Terms" (http://dublincore.org/documents/dcmi-terms/) for an explanation.
type: Thing
date: 1999-07-02
date: 2008-01-14
Relation: contributor-006

Rights Holder
Has Version: rightsHolder-002
issued: 2004-06-14
Date Modified: 2008-01-14
type: Property
comment: A person or organization owning or managing rights over the resource.
range: Agent
date: 2004-06-14
date: 2008-01-14
Relation: rightsHolder-002
range: Resource
range: Thing

Spatial Coverage
type: Property
range: Location
comment: Spatial characteristics of the resource.
issued: 2000-07-11
Date Modified: 2008-01-14
Has Version: spatial-003
sub property of: Coverage
date: 2000-07-11
date: 2008-01-14
Relation: spatial-003
range: Location, Period, or Jurisdiction
range: Resource

Publisher
Date Modified: 2010-10-11
issued: 2008-01-14
range: Agent
comment: An entity responsible for making the resource available.
Has Version: publisherT-001
type: Property
description: Examples of a Publisher include a person, an organization, or a service.
sub property of: Publisher
type: Thing
date: 2008-01-14
date: 2010-10-11
Relation: publisherT-001
range: Resource
range: Thing

logo
type: Property
type: ObjectProperty
type: InverseFunctionalProperty
comment: A logo representing some thing.
domain: Thing
range: Thing
term status: testing
range: Resource
domain: Resource

http://lodlaundromat.org/.well-known/genid/samples/jena///predicate//1db5ec77e444f4f38af2fda329ad1aa6/1db5ec77e444f4f38af2fda329ad1aa6#29
type: Example
comment: A simple description of a concert.
comment: 演奏会の簡単な記述例。 @ja
Prefix: m:
Code: <dc:date>2008-02-11</dc:date> <foaf:name>Masato Osada</foaf:name> <foaf:name>orchestra 'do svidanya'</foaf:name> <dc:title>Symphony No.11 g-minor</dc:title> op.103
Example of: Music Vocabulary
type: Thing

see other
type: Property
sub property of: seeAlso

MeSH
Has Version: MESH-003
issued: 2000-07-11
Date Modified: 2008-01-14
type: VocabularyEncodingScheme
comment: The set of labeled concepts specified by the Medical Subject Headings.
date: 2000-07-11
date: 2008-01-14
Relation: MESH-003

http://lodlaundromat.org/.well-known/genid/samples/jena///predicate//1db5ec77e444f4f38af2fda329ad1aa6/1db5ec77e444f4f38af2fda329ad1aa6#30
type: Example
comment: Another description of a concert with its title, date, program and venue. See also examples in the definition of 'performer' for more erabolate model (the preferred domain of this property is m:Performance, not m:Concert).
comment: ある演奏会の名称、日時、プログラム、会場の記述例。より精密なモデルの案として、'performer'の定義セクションにある例も参照。 @ja
Prefix: m:
Image: 'circles and arrows' graphical representation of this example
Code: <dc:title>Tokyo Green Symphony Orchestra 12th Concert</dc:title> <dc:date>2003-11-02T14:00+09:00</dc:date> <m:conductor foaf:name="Yuri Nitta"/> <foaf:name>Tomoko Kawada</foaf:name> <m:performs rdf:nodeID="p1"/> <m:Orchestra foaf:name="Tokyo Green Symphony Orchestra"/> <m:composer foaf:name="Bruch"/> <dc:title>Violin Concerto No.1 g minor</dc:title> op.26 <m:composer foaf:name="Brahms"/> <dc:title>Symphony No.2 D major</dc:title> op.73 <dc:title>Sumida Triphony</dc:title>
Example of: Music Vocabulary
type: Thing

account name
type: Property
type: DatatypeProperty
comment: Indicates the name (identifier) associated with this online account.
domain: Online Account
range: Literal
term status: testing
range: Resource
domain: Thing
domain: Resource

Identifier
comment: An unambiguous reference to the resource within a given context.
description: Recommended best practice is to identify the resource by means of a string conforming to a formal identification system.
note: A second property with the same name as this property has been declared in the dcterms: namespace (http://purl.org/dc/terms/). See the Introduction to the document "DCMI Metadata Terms" (http://dublincore.org/documents/dcmi-terms/) for an explanation.
Date Modified: 2008-01-14
type: DatatypeProperty
type: Property
issued: 1999-07-02
Has Version: identifier-006
type: Thing
date: 1999-07-02
date: 2008-01-14
Relation: identifier-006

Example vocabulary
type: Ontology
imports: dliser.rdf
comment: Vocabulary to include sample codes in a schema. Can work with XSLT (http://purl.org/net/ns/ns-schema.xsl) to present schema as XHTML list with examples.
comment: スキーマにサンプルコードを埋め込むための語彙。XSLTを使って、XHTMLの中で例を表示させることができる。 @ja
created: 2003-07-04
modified: 2007-12-13
version info: Version 0.35
creator: 神崎正英
date: 2007-12-13
type: Thing
date: 2003-07-04

jabber ID
type: Property
type: DatatypeProperty
type: InverseFunctionalProperty
comment: A jabber ID for something.
domain: Agent
range: Literal
term status: testing
type: ObjectProperty
range: Resource
domain: Thing
domain: Resource

Ontology annotation DLiser vocabulary
comment: Vocabulary to define some annotation properties as subproperties of common terms. Because owl:Ontology resource cannot have properties other than annotation, these terms are defined as owl:AnnotationProperty type in dliser.rdf that is to be imported. However, some RDF application might want those properties to be related to well known terms such as Dublin Core. Hence this vocabulary redefines these properties as ordinary RDF/OWL terms and subProperty of others.
comment: オントロジーのアノテーションに用いるプロパティを、汎用プロパティと関連付けるための回避策としての語彙 @ja
created: 2007-10-08
modified: 2007-11-07
version info: Version 0.12
creator: 神崎正英
date: 2007-11-07
type: Thing
date: 2007-10-08

Format
Has Version: formatT-001
type: Property
description: Examples of dimensions include size and duration. Recommended best practice is to use a controlled vocabulary such as the list of Internet Media Types [MIME].
Date Modified: 2008-01-14
comment: The file format, physical medium, or dimensions of the resource.
issued: 2008-01-14
sub property of: Format
range: Media Type or Extent
type: Thing
date: 2008-01-14
Relation: formatT-001
range: Resource

LCSH
Has Version: LCSH-003
issued: 2000-07-11
Date Modified: 2008-01-14
type: VocabularyEncodingScheme
comment: The set of labeled concepts specified by the Library of Congress Subject Headings.
date: 2000-07-11
date: 2008-01-14
Relation: LCSH-003

age
type: Property
type: FunctionalProperty
type: DatatypeProperty
comment: The age in years of some agent.
domain: Agent
range: Literal
term status: unstable
range: Resource
domain: Thing
domain: Resource

H dur
type: Key
Alternative Title: B major
comment: Major key based on B, whose key signature has 5 sharps.
description: B major
type: Thing
title: B major

e moll
type: Key
Alternative Title: E minor
comment: Minor key based on E, whose key signature has 1 sharp.
description: E minor
type: Thing
title: E minor

gis moll
type: Key
Alternative Title: G-Sharp minor
comment: Minor key based on G sharp, whose key signature has 5 sharps.
description: G sharp minor
type: Thing
title: G-Sharp minor

http://lodlaundromat.org/.well-known/genid/samples/jena///predicate//1db5ec77e444f4f38af2fda329ad1aa6/1db5ec77e444f4f38af2fda329ad1aa6#24
type: Example
Code: <m:composer foaf:name="Shubert"/> <dc:title>Symohony No.7 'Unfinished'</dc:title> D.759 <dcterms:created>1822-01</dcterms:created> <dc:date>1865-12-17</dc:date> <cal:location>Wien Musikfereinsall</cal:location>
type: Thing

License
comment: A legal document giving official permission to do something with the resource.
type: Property
range: License Document
sub property of: Rights
issued: 2004-06-14
Date Modified: 2008-01-14
Has Version: license-002
date: 2004-06-14
date: 2008-01-14
Relation: license-002
range: Rights Statement
range: Resource

'circles and arrows' graphical representation of this example
type: Image
type: Document
type: Thing

Description
Date Modified: 2008-01-14
Has Version: description-006
note: A second property with the same name as this property has been declared in the dcterms: namespace (http://purl.org/dc/terms/). See the Introduction to the document "DCMI Metadata Terms" (http://dublincore.org/documents/dcmi-terms/) for an explanation.
comment: An account of the resource.
type: Property
issued: 1999-07-02
type: DatatypeProperty
description: Description may include but is not limited to: an abstract, a table of contents, a graphical representation, or a free-text account of the resource.
type: Thing
date: 1999-07-02
date: 2008-01-14
Relation: description-006

firstName
type: Property
type: DatatypeProperty
comment: The first name of a person.
domain: Person
range: Literal
term status: testing
range: Resource
domain: Thing
domain: SpatialThing
domain: Resource
domain: Agent

Type
Has Version: typeT-001
sub property of: Type
description: Recommended best practice is to use a controlled vocabulary such as the DCMI Type Vocabulary [DCMITYPE]. To describe the file format, physical medium, or dimensions of the resource, use the Format element.
Date Modified: 2008-01-14
range: Class
type: Property
comment: The nature or genre of the resource.
issued: 2008-01-14
type: Thing
date: 2008-01-14
Relation: typeT-001
range: Resource

ISO 3166
Has Version: ISO3166-004
issued: 2000-07-11
Date Modified: 2008-01-14
type: Datatype
comment: The set of codes listed in ISO 3166-1 for the representation of names of countries.
date: 2000-07-11
date: 2008-01-14
Relation: ISO3166-004
type: Class

Contributor
comment: An entity responsible for making contributions to the resource.
description: Examples of a Contributor include a person, an organization, or a service.
type: Property
Date Modified: 2010-10-11
issued: 2008-01-14
sub property of: Contributor
range: Agent
Has Version: contributorT-001
type: Thing
date: 2008-01-14
date: 2010-10-11
Relation: contributorT-001
range: Resource
range: Thing

status
type: Property
type: DatatypeProperty
comment: A string expressing what the user is happy for the general public (normally) to know about their current activity.
domain: Agent
range: Literal
term status: unstable
range: Resource
domain: Thing
domain: Resource

gender
type: Property
type: FunctionalProperty
type: DatatypeProperty
comment: The gender of this Agent (typically but not necessarily 'male' or 'female').
domain: Agent
range: Literal
term status: testing
range: Resource
domain: Thing
domain: Resource

myersBriggs
type: Property
type: DatatypeProperty
comment: A Myers Briggs (MBTI) personality classification.
domain: Person
range: Literal
term status: testing
range: Resource
domain: Thing
domain: SpatialThing
domain: Resource
domain: Agent

DCMI Period
Has Version: Period-003
issued: 2000-07-11
Date Modified: 2008-01-14
type: Datatype
comment: The set of time intervals defined by their limits according to the DCMI Period Encoding Scheme.
date: 2000-07-11
date: 2008-01-14
Relation: Period-003
type: Class

ais moll
type: Key
Alternative Title: A-Sharp minor
comment: Minor key based on A sharp, whose key signature has 7 sharps.
description: A sharp minor
type: Thing
title: A-Sharp minor

Date Modified
Date Modified: 2008-01-14
sub property of: Date
type: Property
range: Literal
issued: 2000-07-11
comment: Date on which the resource was changed.
Has Version: modified-003
date: 2000-07-11
date: 2008-01-14
Relation: modified-003
range: Resource

Date Accepted
Date Modified: 2008-01-14
range: Literal
sub property of: Date
comment: Date of acceptance of the resource.
type: Property
description: Examples of resources to which a Date Accepted may be relevant are a thesis (accepted by a university department) or an article (accepted by a journal).
Has Version: dateAccepted-002
issued: 2002-07-13
type: Thing
date: 2002-07-13
date: 2008-01-14
Relation: dateAccepted-002
range: Resource

Audience Education Level
Has Version: educationLevel-002
issued: 2002-07-13
Date Modified: 2008-01-14
type: Property
comment: A class of entity, defined in terms of progression through an educational or training context, for which the described resource is intended.
range: Agent Class
sub property of: Audience
date: 2002-07-13
date: 2008-01-14
Relation: educationLevel-002
range: Resource
range: Class

description
type: Property
sub property of: Description

D dur
type: Key
Alternative Title: D major
comment: Major key based on D, whose key signature has 2 sharps.
description: D major
type: Thing
title: D major

f moll
type: Key
Alternative Title: F minor
comment: Minor key based on F, whose key signature has 4 flats.
description: F minor
type: Thing
title: F minor

Has Version
Has Version: hasVersion-003
sub property of: Relation
comment: A related resource that is a version, edition, or adaptation of the described resource.
Date Modified: 2008-01-14
note: This term is intended to be used with non-literal values as defined in the DCMI Abstract Model (http://dublincore.org/documents/abstract-model/). As of December 2007, the DCMI Usage Board is seeking a way to express this intention with a formal range declaration.
issued: 2000-07-11
type: Property
date: 2000-07-11
date: 2008-01-14
Relation: hasVersion-003