DataLink
type: Class
comment: Link Association.
subclass of: LikeableAssociation

LinkReview
type: Class
comment: Link Review.
subclass of: LikeableAssociation

OV
type: Class
comment: Observation Value.
subclass of: ObservationValue
subclass of: QuantityValue

Quantity
type: Class
comment: Observed property (Quantity).
subclass of: Property
subclass of: QuantityKind

TSMap
type: Class
comment: Versions of a same observed Property (Quantity) which vary across time and space, as captured by the sensor's observed values.

activityEnd
type: DatatypeProperty
comment: Relationship among a LinkActivity and the end datetime of the time range which it refers to.
domain: LinkActivity
range: dateTime

activityStart
type: DatatypeProperty
comment: Relationship among an Activity and the start datetime of the time range which it refers to.
domain: LinkActivity
range: dateTime

linkActivityValue
type: DatatypeProperty
comment: Relationship among a LinkActivity and the amount of packets received in the time range specified by the predicates :startDateTime and :endDateTime
domain: LinkActivity
range: integer

tEnd
type: DatatypeProperty
comment: Datetime after which a given entity and all the triples referred to it, are not valid anymore.
range: dateTime

tStart
type: DatatypeProperty
comment: Datetime at which a given entity and all the triples referred to it, start to be valid.
range: dateTime

uom
type: ObjectProperty
comment: Unit of Measurement in use on a specific device or sensor or sensing device
range: Unit
sub property of: unit

SPITFIRE Ontology
creator: Alexandre Passant
creator: me
rights: Copyright 2010 - 2012 SPITFIRE.
license: copyright-software-20021231.html
type: Ontology
comment: Please report any error to myriam.leggieri_at_deri.org
comment: This ontology describes sensors, observations, and related concepts. It also describes events and their correlations. The final aim is to support a better description of sensor context.
comment: This ontology is developed by DERI ( http://www.deri.ie ) for the SPITFIRE project ( http://spitfire-project.eu ) . It is based on the alignment among the W3C Semantic Sensor Networks Incubator Group (SSN-XG) ontology, the Dolce-DnS Ultralite ontology and the Event Model F ontology.