related pub
range: Thing
domain: Thing
type: ObjectProperty
comment: Any publications providing relevant information
range: Publication-Reference
type: Property
domain: Resource
range: Resource

Bundle
subclass of: Thing
subclass of: Resource
type: Class
comment: A bundle contains URIs that are deemed to be the same under some context

Method of Instruction
subclass of: Resource
Has Version: MethodOfInstruction-001
issued: 2008-01-14
type: Class
comment: A process that is used to engender knowledge, attitudes, and skills.
date: 2008-01-14
Relation: MethodOfInstruction-001

detailed description
type: Property
type: DatatypeProperty
comment: A detailed description of the mechanism (sufficient to be able to re-create the mechanism)
domain: Resilience Mechanism
range: string
sub property of: comment
domain: Thing
domain: Resource
domain: Technology
range: Resource

Resilience Concept
subclass of: Thing
subclass of: Resource
type: Class
comment: Resilience concepts are notions which can be applied to the approach which has been taken in building a resilient system

relates to new wg
range: Thing
domain: Thing
type: Property
type: ObjectProperty
comment: The new ReSIST WP2 working group(s) (Assessability, Diversity, Evolvability and Usability) that this mechanism relates to
domain: Resilience Mechanism
range: Project
domain: Resource
domain: Technology
range: Resource

formal description pub
range: Thing
domain: Thing
type: ObjectProperty
comment: A publication providing a formal description of the mechanism
domain: Resilience Mechanism
range: Publication-Reference
type: Property
domain: Resource
domain: Technology
range: Resource

Rights Statement
subclass of: Resource
Has Version: RightsStatement-001
issued: 2008-01-14
type: Class
comment: A statement about the intellectual property rights (IPR) held in or over a Resource, a legal document giving official permission to do something with a resource, or a statement about access rights.
date: 2008-01-14
Relation: RightsStatement-001

technical feature
subclass of: Resource
subclass of: Thing
type: Class
comment: A technical feature of a void:Dataset, such as a supported RDF serialization format.

Linguistic System
subclass of: Resource
description: Examples include written, spoken, sign, and computer languages.
Has Version: LinguisticSystem-001
issued: 2008-01-14
type: Class
comment: A system of signs, symbols, sounds, gestures, or rules used in communication.
date: 2008-01-14
Relation: LinguisticSystem-001

Agent Class
subclass of: Resource
description: Examples of Agent Class include groups seen as classes, such as students, women, charities, lecturers.
Has Version: AgentClass-003
issued: 2008-01-14
Date Modified: 2012-06-14
type: Class
comment: A group of agents.
subclass of: Class
date: 2008-01-14
date: 2012-06-14
Relation: AgentClass-003

Resilience Metadata
subclass of: Thing
subclass of: Resource
type: Class
comment: This class encapsulates a piece of resilience metadata about a mechanism

dataset description
subclass of: Resource
subclass of: Thing
type: Class
comment: A web resource whose foaf:primaryTopic or foaf:topics include void:Datasets.
subclass of: Document

Policy
subclass of: Resource
Has Version: Policy-001
issued: 2008-01-14
type: Class
comment: A plan or course of action by an authority, intended to influence and determine decisions, actions, and other matters.
date: 2008-01-14
Relation: Policy-001

mechanism objectives
type: Property
type: DatatypeProperty
comment: The objectives of this resilience mechanism
domain: Resilience Mechanism
range: string
domain: Thing
domain: Resource
domain: Technology
range: Resource

Mechanism Category
subclass of: Thing
subclass of: Resource
type: Class
comment: Mechanism categories are broad classifications of different types of mechanism

Method of Accrual
subclass of: Resource
Has Version: MethodOfAccrual-001
issued: 2008-01-14
type: Class
comment: A method by which resources are added to a collection.
date: 2008-01-14
Relation: MethodOfAccrual-001

Provenance Statement
subclass of: Resource
Has Version: ProvenanceStatement-001
issued: 2008-01-14
type: Class
comment: A statement of any changes in ownership and custody of a resource since its creation that are significant for its authenticity, integrity, and interpretation.
date: 2008-01-14
Relation: ProvenanceStatement-001

Period of Time
subclass of: Resource
Has Version: PeriodOfTime-001
issued: 2008-01-14
type: Class
comment: An interval of time that is named or defined by its start and end dates.
subclass of: Location, Period, or Jurisdiction
date: 2008-01-14
Relation: PeriodOfTime-001

Standard
subclass of: Resource
Has Version: Standard-001
issued: 2008-01-14
type: Class
comment: A basis for comparison; a reference point against which other things can be evaluated.
date: 2008-01-14
Relation: Standard-001

has knowledge requirement
range: Thing
domain: Thing
type: Property
type: ObjectProperty
comment: Knowledge that is required in order to use the mechanism
domain: Resilience Mechanism
range: Knowledge
domain: Resource
domain: Technology
range: Resource

linkset
subclass of: Resource
subclass of: Thing
type: Class
comment: A collection of RDF links between two void:Datasets.
subclass of: dataset

Location
subclass of: Resource
Has Version: Location-001
issued: 2008-01-14
type: Class
comment: A spatial region or named place.
subclass of: Location, Period, or Jurisdiction
date: 2008-01-14
Relation: Location-001

faq pub
range: Thing
domain: Thing
type: ObjectProperty
comment: A publication providing frequently asked questions (and answers) about the mechanism
domain: Resilience Mechanism
range: Publication-Reference
type: Property
domain: Resource
domain: Technology
range: Resource

Bibliographic Resource
subclass of: Resource
Has Version: BibliographicResource-001
issued: 2008-01-14
type: Class
comment: A book, article, or other documentary resource.
date: 2008-01-14
Relation: BibliographicResource-001

has infrastructure requirement
range: Thing
domain: Thing
type: ObjectProperty
comment: An infrastructure requirement that is needed to use the mechanism
domain: Resilience Mechanism
range: Technology
type: Property
domain: Resource
domain: Technology
range: Resource

diversity comment
type: Property
type: DatatypeProperty
comment: Comment about how the mechanism relates to the ReSIST WP2 working group on diversity
domain: Resilience Mechanism
range: string
domain: Thing
domain: Resource
domain: Technology
range: Resource

dataset
subclass of: Resource
subclass of: Thing
type: Class
comment: A set of RDF triples that are published, maintained or aggregated by a single provider.

diagrams pub
range: Thing
domain: Thing
type: ObjectProperty
comment: A publication providing diagrammatic representations of the mechanism
domain: Resilience Mechanism
range: Publication-Reference
type: Property
domain: Resource
domain: Technology
range: Resource

has failure mode
range: Thing
domain: Thing
type: ObjectProperty
comment: The ways in which the resilience mechanism can fail
domain: Resilience Mechanism
range: Failure
type: Property
domain: Resource
domain: Technology
range: Resource

Physical Medium
subclass of: Resource
description: Examples include paper, canvas, or DVD.
Has Version: PhysicalMedium-001
issued: 2008-01-14
type: Class
comment: A physical material or carrier.
subclass of: Media Type
date: 2008-01-14
Relation: PhysicalMedium-001

has type
range: Thing
domain: Thing
type: ObjectProperty
comment: The type of this piece of resilience metadata
domain: Resilience Metadata
range: Resilience Metadata Type
type: Property
domain: Resource
range: Resource

has associated project
range: Thing
domain: Thing
type: Property
type: ObjectProperty
comment: A project that has been involved in the development of this resilience mechanism
domain: Resilience Mechanism
range: Project
domain: Resource
domain: Technology
range: Resource

Media Type or Extent
subclass of: Resource
Has Version: MediaTypeOrExtent-001
issued: 2008-01-14
type: Class
comment: A media type or extent.
date: 2008-01-14
Relation: MediaTypeOrExtent-001

Source
sub property of: Relation
description: The described resource may be derived from the related resource in whole or in part. Recommended best practice is to identify the related resource by means of a string conforming to a formal identification system.
note: This term is intended to be used with non-literal values as defined in the DCMI Abstract Model (http://dublincore.org/documents/abstract-model/). As of December 2007, the DCMI Usage Board is seeking a way to express this intention with a formal range declaration.
comment: A related resource from which the described resource is derived.
type: Property
sub property of: Source
issued: 2008-01-14
Date Modified: 2008-01-14
Has Version: sourceT-001
date: 2008-01-14
Relation: sourceT-001

Canonical URI
range: Thing
domain: Thing
type: ObjectProperty
comment: The Canonical URI that should be used for all URIs in its bundle
type: Property
domain: Resource
range: Resource

applies to tehcnology
range: Thing
domain: Thing
type: Property
type: ObjectProperty
comment: Indicates technolgies to which this mechanism may be applied
domain: Resilience Mechanism
range: Technology
domain: Resource
domain: Technology
range: Resource

relates to concept
range: Thing
domain: Thing
type: Property
type: ObjectProperty
comment: The key concepts involved in the mechanism
domain: Resilience Mechanism
range: Resilience Concept
domain: Resource
domain: Technology
range: Resource

Duplicate
range: Thing
domain: Thing
type: ObjectProperty
comment: A duplicate is a URI that denotes the same resource under some context
type: Property
domain: Resource
range: Resource

has definition
type: Property
type: DatatypeProperty
comment: The definition for the type of resilience metadata
domain: Resilience Metadata Type
range: string
sub property of: comment
domain: Resource
domain: Thing
range: Resource

has mechanism category
type: Property
type: DatatypeProperty
comment: Applicable mechanism categories, eg Process/Architecture/Tool
domain: Resilience Mechanism
range: Mechanism Category
domain: Thing
domain: Resource
domain: Technology
range: Thing
range: Resource

Coreference Data
range: Thing
domain: Thing
type: Property
type: ObjectProperty
comment: The Bundle that contains duplicate URIs for this resource
range: Bundle
domain: Resource
range: Resource

Jurisdiction
subclass of: Resource
Has Version: Jurisdiction-001
issued: 2008-01-14
type: Class
comment: The extent or range of judicial, law enforcement, or other authority.
subclass of: Location, Period, or Jurisdiction
date: 2008-01-14
Relation: Jurisdiction-001

License Document
subclass of: Resource
Has Version: LicenseDocument-001
issued: 2008-01-14
type: Class
comment: A legal document giving official permission to do something with a Resource.
subclass of: Rights Statement
date: 2008-01-14
Relation: LicenseDocument-001

detailed description pub
range: Thing
domain: Thing
type: Property
type: ObjectProperty
comment: A publication providing a detailed description of the mechanism (sufficient to be able to re-create the mechanism)
domain: Resilience Mechanism
range: Publication-Reference
domain: Resource
domain: Technology
range: Resource

Agent
subclass of: Resource
description: Examples of Agent include person, organization, and software agent.
Has Version: Agent-001
issued: 2008-01-14
type: Agent Class
type: Class
comment: A resource that acts or has the power to act.
date: 2008-01-14
Relation: Agent-001

File Format
subclass of: Resource
type: Property
description: Examples include the formats defined by the list of Internet Media Types.
Has Version: FileFormat-001
issued: 2008-01-14
type: Class
comment: A digital resource format.
subclass of: Media Type
date: 2008-01-14
Relation: FileFormat-001

applications pub
range: Thing
domain: Thing
type: ObjectProperty
comment: A publication providing examples of the use of the mechanism
domain: Resilience Mechanism
range: Publication-Reference
type: Property
domain: Resource
domain: Technology
range: Resource

has component
type: Property
range: Thing
domain: Thing
type: ObjectProperty
comment: The components making up the mechanism
domain: Resilience Mechanism
range: Technology
domain: Resource
domain: Technology
range: Resource

Size or Duration
subclass of: Resource
description: Examples include a number of pages, a specification of length, width, and breadth, or a period in hours, minutes, and seconds.
Has Version: SizeOrDuration-001
issued: 2008-01-14
type: Class
comment: A dimension or extent, or a time taken to play or execute.
subclass of: Media Type or Extent
date: 2008-01-14
Relation: SizeOrDuration-001

addresses threat to resilience
type: Property
range: Thing
domain: Thing
type: ObjectProperty
comment: The threats to resilience which the mechanism aims to address
domain: Resilience Mechanism
range: Threats-To-Dependable-And-Secure-Systems
domain: Resource
domain: Technology
range: Resource

has resilience metadata
range: Thing
domain: Thing
type: ObjectProperty
comment: An instance of resilience metadata associated with the mechanism
domain: Resilience Mechanism
range: Resilience Metadata
type: Property
domain: Resource
domain: Technology
range: Resource

ontology pub
range: Thing
domain: Thing
type: ObjectProperty
comment: A publication providing an ontology of concepts relating to the mechanism
domain: Resilience Mechanism
range: Publication-Reference
type: Property
domain: Resource
domain: Technology
range: Resource

Creator
sub property of: maker
sub property of: Contributor
Date Modified: 2010-10-11
comment: An entity primarily responsible for making the resource.
Has Version: creatorT-002
equivalent property: maker
issued: 2008-01-14
sub property of: Creator
type: Property
description: Examples of a Creator include a person, an organization, or a service.
range: Agent
date: 2008-01-14
date: 2010-10-11
Relation: creatorT-002
range: Resource

Knowledge
subclass of: Resource
subclass of: Thing
type: Class
comment: This class encapsulates a body of knowledge

Resilience Mechanism
subclass of: Thing
subclass of: Resource
type: Class
comment: This class encapsulates a mechanism designed to improve the resilience of a computer based system
subclass of: Technology

has additional requirements
type: Property
type: DatatypeProperty
comment: A textual description of additional requirements or prerequisites not otherwise captured within the provided properies
domain: Resilience Mechanism
range: string
domain: Thing
domain: Resource
domain: Technology
range: Resource

submitted by
type: Property
range: Thing
domain: Thing
type: ObjectProperty
comment: The ReSIST Project member who has submitted and is the point of contact for this resilience mechanism
domain: Resilience Mechanism
range: Person
domain: Resource
domain: Technology
range: Resource

Media Type
subclass of: Resource
Has Version: MediaType-001
issued: 2008-01-14
type: Class
comment: A file format or physical medium.
subclass of: Media Type or Extent
date: 2008-01-14
Relation: MediaType-001

Resilience Metadata Type
subclass of: Resource
subclass of: Thing
type: Class
comment: This class encapsulates a type of resilience metadata about a mechanism

relates to old wg
type: Property
range: Thing
domain: Thing
type: ObjectProperty
comment: The old ReSIST WP2 working group(s) (Arch, Algo, Socio, Verif and Eval) that this mechanism relates to
domain: Resilience Mechanism
range: Project
domain: Resource
domain: Technology
range: Resource

has application domain
type: Property
range: Thing
domain: Thing
type: ObjectProperty
comment: Application domains that the mechanism applies to
domain: Resilience Mechanism
range: Research-Interest
domain: Resource
domain: Technology
range: Resource

Location, Period, or Jurisdiction
subclass of: Resource
Has Version: LocationPeriodOrJurisdiction-001
issued: 2008-01-14
type: Class
comment: A location, period of time, or jurisdiction.
date: 2008-01-14
Relation: LocationPeriodOrJurisdiction-001

Physical Resource
subclass of: Resource
Has Version: PhysicalResource-001
issued: 2008-01-14
type: Class
comment: A material thing.
date: 2008-01-14
Relation: PhysicalResource-001

Frequency
subclass of: Resource
Has Version: Frequency-001
issued: 2008-01-14
type: Class
comment: A rate at which something recurs.
date: 2008-01-14
Relation: Frequency-001

has related mechanism
type: Property
range: Thing
domain: Thing
type: ObjectProperty
comment: Other resilience mechanisms that are related to this one (for example N-Version Programming is related to Recovery Blocks as they have the same purpose)
domain: Resilience Mechanism
range: Resilience Mechanism
domain: Resource
domain: Technology
range: Resource
range: Technology

Metadata Acquisition Method
subclass of: Resource
subclass of: Thing
type: Class
comment: A method by which metadata can be acquired

Instructional Method
description: Instructional Method will typically include ways of presenting instructional materials or conducting instructional activities, patterns of learner-to-learner and learner-to-instructor interactions, and mechanisms by which group and individual levels of learning are measured. Instructional methods include all aspects of the instruction and learning processes from planning and implementation through evaluation and feedback.
Has Version: instructionalMethod-002
issued: 2005-06-13
Date Modified: 2008-01-14
type: Property
comment: A process, used to engender knowledge, attitudes and skills, that the described resource is designed to support.
range: Method of Instruction
date: 2005-06-13
date: 2008-01-14
Relation: instructionalMethod-002
range: Resource

Date Accepted
Date Modified: 2008-01-14
range: Literal
sub property of: Date
comment: Date of acceptance of the resource.
type: Property
description: Examples of resources to which a Date Accepted may be relevant are a thesis (accepted by a university department) or an article (accepted by a journal).
Has Version: dateAccepted-002
issued: 2002-07-13
date: 2002-07-13
date: 2008-01-14
Relation: dateAccepted-002
range: Resource

Access Rights
range: Rights Statement
type: Property
issued: 2003-02-15
comment: Information about who can access the resource or an indication of its security status.
description: Access Rights may include information regarding access or restrictions based on privacy, security, or other policies.
sub property of: Rights
Date Modified: 2008-01-14
Has Version: accessRights-002
date: 2003-02-15
date: 2008-01-14
Relation: accessRights-002
range: Resource

Publisher
description: Examples of a Publisher include a person, an organization, or a service. Typically, the name of a Publisher should be used to indicate the entity.
Has Version: publisher-006
issued: 1999-07-02
Date Modified: 2008-01-14
type: Property
comment: An entity responsible for making the resource available.
note: A second property with the same name as this property has been declared in the dcterms: namespace (http://purl.org/dc/terms/). See the Introduction to the document "DCMI Metadata Terms" (http://dublincore.org/documents/dcmi-terms/) for an explanation.
date: 1999-07-02
date: 2008-01-14
Relation: publisher-006

UDC
Has Version: UDC-003
issued: 2000-07-11
Date Modified: 2008-01-14
type: VocabularyEncodingScheme
comment: The set of conceptual resources specified by the Universal Decimal Classification.
date: 2000-07-11
date: 2008-01-14
Relation: UDC-003

LCC
Has Version: LCC-003
issued: 2000-07-11
Date Modified: 2008-01-14
type: VocabularyEncodingScheme
comment: The set of conceptual resources specified by the Library of Congress Classification.
date: 2000-07-11
date: 2008-01-14
Relation: LCC-003

Bibliographic Citation
Has Version: bibliographicCitation-002
description: Recommended practice is to include sufficient bibliographic detail to identify the resource as unambiguously as possible.
range: Literal
domain: Bibliographic Resource
comment: A bibliographic reference for the resource.
type: Property
sub property of: Identifier
issued: 2003-02-15
Date Modified: 2008-01-14
date: 2003-02-15
date: 2008-01-14
Relation: bibliographicCitation-002
range: Resource
domain: Resource

Vocabulary of Interlinked Datasets (VoID)
Date Created: 2010-01-26
preferred namespace uri: http://rdfs.org/ns/void#
preferred namespace prefix: void
type: SemanticAsset
part of: vocab.deri.ie
Type: Ontology
creator: Michael Hausenblas
creator: Jun Zhao
description: The Vocabulary of Interlinked Datasets (VoID) is an RDF Schema vocabulary for expressing metadata about RDF datasets. It is intended as a bridge between the publishers and users of RDF data, with applications ranging from data discovery to cataloging and archiving of datasets. This document provides a formal definition of the new RDF classes and properties introduced for VoID. It is a companion to the main specification document for VoID, Describing Linked Datasets with the VoID Vocabulary.
status: UnderDevelopment
type: Ontology
publisher: Digital Enterprise Research Institute, NUI Galway
creator: Keith Alexander
creator: Richard Cyganiak
Date Modified: 2011-03-06
date: 2011-03-06
date: 2010-01-26

Coverage
description: Spatial topic and spatial applicability may be a named place or a location specified by its geographic coordinates. Temporal topic may be a named period, date, or date range. A jurisdiction may be a named administrative entity or a geographic place to which the resource applies. Recommended best practice is to use a controlled vocabulary such as the Thesaurus of Geographic Names [TGN]. Where appropriate, named places or time periods can be used in preference to numeric identifiers such as sets of coordinates or date ranges.
Has Version: coverage-006
issued: 1999-07-02
Date Modified: 2008-01-14
type: Property
comment: The spatial or temporal topic of the resource, the spatial applicability of the resource, or the jurisdiction under which the resource is relevant.
note: A second property with the same name as this property has been declared in the dcterms: namespace (http://purl.org/dc/terms/). See the Introduction to the document "DCMI Metadata Terms" (http://dublincore.org/documents/dcmi-terms/) for an explanation.
date: 1999-07-02
date: 2008-01-14
Relation: coverage-006

ISO 3166
Has Version: ISO3166-004
issued: 2000-07-11
Date Modified: 2008-01-14
type: Datatype
comment: The set of codes listed in ISO 3166-1 for the representation of names of countries.
date: 2000-07-11
date: 2008-01-14
Relation: ISO3166-004
type: Class

W3C-DTF
Has Version: W3CDTF-003
issued: 2000-07-11
Date Modified: 2008-01-14
type: Datatype
comment: The set of dates and times constructed according to the W3C Date and Time Formats Specification.
date: 2000-07-11
date: 2008-01-14
Relation: W3CDTF-003
type: Class

number of properties
type: Property
type: DatatypeProperty
comment: The total number of distinct properties in a void:Dataset. In other words, the number of distinct resources that occur in the predicate position of triples in the dataset.
domain: dataset
range: integer
domain: Resource
domain: Thing
range: decimal
range: Resource

Target
type: Property
comment: One of the two datasets linked by the Linkset.
domain: linkset
range: dataset
domain: dataset
domain: Resource
domain: Thing
range: Resource
range: Thing

Audience
Has Version: audience-003
issued: 2001-05-21
Date Modified: 2008-01-14
type: Property
comment: A class of entity for whom the resource is intended or useful.
range: Agent Class
date: 2001-05-21
date: 2008-01-14
Relation: audience-003
range: Resource
range: Class

Rights Holder
Has Version: rightsHolder-002
issued: 2004-06-14
Date Modified: 2008-01-14
type: Property
comment: A person or organization owning or managing rights over the resource.
range: Agent
date: 2004-06-14
date: 2008-01-14
Relation: rightsHolder-002
range: Resource

License
comment: A legal document giving official permission to do something with the resource.
type: Property
range: License Document
sub property of: Rights
issued: 2004-06-14
Date Modified: 2008-01-14
Has Version: license-002
date: 2004-06-14
date: 2008-01-14
Relation: license-002
range: Rights Statement
range: Resource

Mediator
type: Property
range: Agent Class
issued: 2001-05-21
Has Version: mediator-003
Date Modified: 2008-01-14
comment: An entity that mediates access to the resource and for whom the resource is intended or useful.
description: In an educational context, a mediator might be a parent, teacher, teaching assistant, or care-giver.
sub property of: Audience
date: 2001-05-21
date: 2008-01-14
Relation: mediator-003
range: Resource
range: Class

Has Version
Has Version: hasVersion-003
sub property of: Relation
comment: A related resource that is a version, edition, or adaptation of the described resource.
Date Modified: 2008-01-14
note: This term is intended to be used with non-literal values as defined in the DCMI Abstract Model (http://dublincore.org/documents/abstract-model/). As of December 2007, the DCMI Usage Board is seeking a way to express this intention with a formal range declaration.
issued: 2000-07-11
type: Property
date: 2000-07-11
date: 2008-01-14
Relation: hasVersion-003

Mean Time Between Failure Metadata
type: Resilience Metadata Type
has definition: A measure of the mean time between failure of a mechanism
subclass of: Reliability Metadata
comment: A measure of the mean time between failure of a mechanism
type: Thing
type: Class

NLM
Has Version: NLM-002
issued: 2005-06-13
Date Modified: 2008-01-14
type: VocabularyEncodingScheme
comment: The set of conceptual resources specified by the National Library of Medicine Classification.
date: 2005-06-13
date: 2008-01-14
Relation: NLM-002

class
type: Property
type: FunctionalProperty
comment: The rdfs:Class that is the rdf:type of all entities in a class-based partition.
domain: dataset
range: Class
domain: Resource
domain: Thing
range: Resource

Last Updated
type: DatatypeProperty
domain: Bundle
comment: The last update of this bundle
type: Property
domain: Thing
domain: Resource

has value
type: DatatypeProperty
comment: The value or formula for this specific piece of resilience metadata
domain: Resilience Metadata
range: string
type: Property
domain: Thing
domain: Resource
range: Resource

Date Valid
type: Property
range: Literal
issued: 2000-07-11
sub property of: Date
comment: Date (often a range) of validity of a resource.
Date Modified: 2008-01-14
Has Version: valid-003
date: 2000-07-11
date: 2008-01-14
Relation: valid-003
range: Resource

number of triples
type: Property
type: DatatypeProperty
comment: The total number of triples contained in a void:Dataset.
domain: dataset
range: integer
domain: Resource
domain: Thing
range: decimal
range: Resource

Identifier
description: Recommended best practice is to identify the resource by means of a string conforming to a formal identification system.
Has Version: identifier-006
issued: 1999-07-02
Date Modified: 2008-01-14
type: Property
comment: An unambiguous reference to the resource within a given context.
note: A second property with the same name as this property has been declared in the dcterms: namespace (http://purl.org/dc/terms/). See the Introduction to the document "DCMI Metadata Terms" (http://dublincore.org/documents/dcmi-terms/) for an explanation.
date: 1999-07-02
date: 2008-01-14
Relation: identifier-006

Language
issued: 1999-07-02
note: A second property with the same name as this property has been declared in the dcterms: namespace (http://purl.org/dc/terms/). See the Introduction to the document "DCMI Metadata Terms" (http://dublincore.org/documents/dcmi-terms/) for an explanation.
Has Version: language-007
description: Recommended best practice is to use a controlled vocabulary such as RFC 4646 [RFC4646].
type: Property
comment: A language of the resource.
Date Modified: 2008-01-14
date: 1999-07-02
date: 2008-01-14
Relation: language-007

Requires
Has Version: requires-003
type: Property
comment: A related resource that is required by the described resource to support its function, delivery, or coherence.
issued: 2000-07-11
sub property of: Relation
note: This term is intended to be used with non-literal values as defined in the DCMI Abstract Model (http://dublincore.org/documents/abstract-model/). As of December 2007, the DCMI Usage Board is seeking a way to express this intention with a formal range declaration.
Date Modified: 2008-01-14
date: 2000-07-11
date: 2008-01-14
Relation: requires-003

property partition
type: Property
comment: A subset of a void:Dataset that contains only the triples of a certain rdf:Property.
domain: dataset
range: dataset
sub property of: has subset
domain: Resource
domain: Thing
range: Resource
range: Thing

Replaces
Has Version: replaces-003
note: This term is intended to be used with non-literal values as defined in the DCMI Abstract Model (http://dublincore.org/documents/abstract-model/). As of December 2007, the DCMI Usage Board is seeking a way to express this intention with a formal range declaration.
Date Modified: 2008-01-14
comment: A related resource that is supplanted, displaced, or superseded by the described resource.
sub property of: Relation
type: Property
issued: 2000-07-11
date: 2000-07-11
date: 2008-01-14
Relation: replaces-003

MeSH
Has Version: MESH-003
issued: 2000-07-11
Date Modified: 2008-01-14
type: VocabularyEncodingScheme
comment: The set of labeled concepts specified by the Medical Subject Headings.
date: 2000-07-11
date: 2008-01-14
Relation: MESH-003

Is Version Of
note: This term is intended to be used with non-literal values as defined in the DCMI Abstract Model (http://dublincore.org/documents/abstract-model/). As of December 2007, the DCMI Usage Board is seeking a way to express this intention with a formal range declaration.
Has Version: isVersionOf-003
sub property of: Relation
type: Property
comment: A related resource of which the described resource is a version, edition, or adaptation.
issued: 2000-07-11
description: Changes in version imply substantive changes in content rather than differences in format.
Date Modified: 2008-01-14
date: 2000-07-11
date: 2008-01-14
Relation: isVersionOf-003

Audience Education Level
Has Version: educationLevel-002
issued: 2002-07-13
Date Modified: 2008-01-14
type: Property
comment: A class of entity, defined in terms of progression through an educational or training context, for which the described resource is intended.
range: Agent Class
sub property of: Audience
date: 2002-07-13
date: 2008-01-14
Relation: educationLevel-002
range: Resource
range: Class

Coverage
issued: 2008-01-14
comment: The spatial or temporal topic of the resource, the spatial applicability of the resource, or the jurisdiction under which the resource is relevant.
Has Version: coverageT-001
Date Modified: 2008-01-14
sub property of: Coverage
type: Property
range: Location, Period, or Jurisdiction
description: Spatial topic and spatial applicability may be a named place or a location specified by its geographic coordinates. Temporal topic may be a named period, date, or date range. A jurisdiction may be a named administrative entity or a geographic place to which the resource applies. Recommended best practice is to use a controlled vocabulary such as the Thesaurus of Geographic Names [TGN]. Where appropriate, named places or time periods can be used in preference to numeric identifiers such as sets of coordinates or date ranges.
date: 2008-01-14
Relation: coverageT-001
range: Resource

DCMI Point
Has Version: Point-003
issued: 2000-07-11
Date Modified: 2008-01-14
type: Datatype
comment: The set of points in space defined by their geographic coordinates according to the DCMI Point Encoding Scheme.
date: 2000-07-11
date: 2008-01-14
Relation: Point-003
type: Class

Identifier
sub property of: Identifier
range: Literal
Has Version: identifierT-001
description: Recommended best practice is to identify the resource by means of a string conforming to a formal identification system.
issued: 2008-01-14
type: Property
comment: An unambiguous reference to the resource within a given context.
Date Modified: 2008-01-14
date: 2008-01-14
Relation: identifierT-001
range: Resource

Date Created
sub property of: Date
range: Literal
Date Modified: 2008-01-14
comment: Date of creation of the resource.
type: Property
Has Version: created-003
issued: 2000-07-11
date: 2000-07-11
date: 2008-01-14
Relation: created-003
range: Resource

Provenance
description: The statement may include a description of any changes successive custodians made to the resource.
Has Version: provenance-002
issued: 2004-09-20
Date Modified: 2008-01-14
type: Property
comment: A statement of any changes in ownership and custody of the resource since its creation that are significant for its authenticity, integrity, and interpretation.
range: Provenance Statement
date: 2004-09-20
date: 2008-01-14
Relation: provenance-002
range: Resource

DCMI Metadata Terms - other
Date Modified: 2012-06-14
publisher: DCMI
date: 2012-06-14

www.aktors.org
locale: en_US
type: website
title: Turning Shoe Information to Knowledge of Technology and Deals
description: Take a look at Nike and Adidas Shoe technology, and use Finish Line coupons to save money on athletic shoes and performance apparel
site name: Aktors

number of documents
type: Property
type: DatatypeProperty
comment: The total number of documents, for datasets that are published as a set of individual documents, such as RDF/XML documents or RDFa-annotated web pages. Non-RDF documents, such as web pages in HTML or images, are usually not included in this count. This property is intended for datasets where the total number of triples or entities is hard to determine. void:triples or void:entities should be preferred where practical.
domain: dataset
range: integer
domain: Resource
domain: Thing
range: decimal
range: Resource

open search description
type: Property
comment: An OpenSearch description document for a free-text search service over a void:Dataset.
domain: dataset
range: Document
domain: Resource
domain: Thing
range: Resource

Subject
description: Typically, the subject will be represented using keywords, key phrases, or classification codes. Recommended best practice is to use a controlled vocabulary.
Has Version: subject-007
issued: 1999-07-02
Date Modified: 2012-06-14
type: Property
comment: The topic of the resource.
note: A second property with the same name as this property has been declared in the dcterms: namespace (http://purl.org/dc/terms/). See the Introduction to the document "DCMI Metadata Terms" (http://dublincore.org/documents/dcmi-terms/) for an explanation.
date: 1999-07-02
date: 2012-06-14
Relation: subject-007

vocabulary
type: Property
comment: A vocabulary that is used in the dataset.
domain: dataset
domain: Resource
domain: Thing

Format
Has Version: formatT-001
type: Property
description: Examples of dimensions include size and duration. Recommended best practice is to use a controlled vocabulary such as the list of Internet Media Types [MIME].
Date Modified: 2008-01-14
comment: The file format, physical medium, or dimensions of the resource.
issued: 2008-01-14
sub property of: Format
range: Media Type or Extent
date: 2008-01-14
Relation: formatT-001
range: Resource

example resource of dataset
type: Property
domain: dataset
range: Resource
domain: Resource
domain: Thing

has acquisition method
type: DatatypeProperty
comment: The way in which the resilience metadata should be acquired
domain: Resilience Metadata
range: string
type: Property
domain: Thing
domain: Resource
range: Resource

Spatial Coverage
type: Property
range: Location
comment: Spatial characteristics of the resource.
issued: 2000-07-11
Date Modified: 2008-01-14
Has Version: spatial-003
sub property of: Coverage
date: 2000-07-11
date: 2008-01-14
Relation: spatial-003
range: Location, Period, or Jurisdiction
range: Resource

ISO 639-2
Has Version: ISO639-2-003
issued: 2000-07-11
Date Modified: 2008-01-14
type: Datatype
comment: The three-letter alphabetic codes listed in ISO639-2 for the representation of names of languages.
date: 2000-07-11
date: 2008-01-14
Relation: ISO639-2-003
type: Class

has an URI look-up endpoint at
type: Property
comment: Defines a simple URI look-up protocol for accessing a dataset.
domain: dataset
domain: Resource
domain: Thing

Is Format Of
Has Version: isFormatOf-003
Date Modified: 2008-01-14
issued: 2000-07-11
sub property of: Relation
type: Property
note: This term is intended to be used with non-literal values as defined in the DCMI Abstract Model (http://dublincore.org/documents/abstract-model/). As of December 2007, the DCMI Usage Board is seeking a way to express this intention with a formal range declaration.
comment: A related resource that is substantially the same as the described resource, but in another format.
date: 2000-07-11
date: 2008-01-14
Relation: isFormatOf-003

Alternative Title
sub property of: Title
type: Property
Date Modified: 2010-10-11
range: Literal
issued: 2000-07-11
description: The distinction between titles and alternative titles is application-specific.
Has Version: alternative-003
comment: An alternative name for the resource.
date: 2000-07-11
date: 2010-10-11
Relation: alternative-003
range: Resource

number of entities
type: Property
type: DatatypeProperty
comment: The total number of entities that are described in a void:Dataset.
domain: dataset
range: integer
domain: Resource
domain: Thing
range: decimal
range: Resource

Language
Date Modified: 2008-01-14
type: Property
Has Version: languageT-001
sub property of: Language
description: Recommended best practice is to use a controlled vocabulary such as RFC 4646 [RFC4646].
issued: 2008-01-14
comment: A language of the resource.
range: Linguistic System
date: 2008-01-14
Relation: languageT-001
range: Resource

Relation
description: Recommended best practice is to identify the related resource by means of a string conforming to a formal identification system.
Has Version: relation-006
issued: 1999-07-02
Date Modified: 2008-01-14
type: Property
comment: A related resource.
note: A second property with the same name as this property has been declared in the dcterms: namespace (http://purl.org/dc/terms/). See the Introduction to the document "DCMI Metadata Terms" (http://dublincore.org/documents/dcmi-terms/) for an explanation.
date: 1999-07-02
date: 2008-01-14
Relation: relation-006

Creator
description: Examples of a Creator include a person, an organization, or a service. Typically, the name of a Creator should be used to indicate the entity.
Has Version: creator-006
issued: 1999-07-02
Date Modified: 2008-01-14
type: Property
comment: An entity primarily responsible for making the resource.
note: A second property with the same name as this property has been declared in the dcterms: namespace (http://purl.org/dc/terms/). See the Introduction to the document "DCMI Metadata Terms" (http://dublincore.org/documents/dcmi-terms/) for an explanation.
date: 1999-07-02
date: 2008-01-14
Relation: creator-006

Format
description: Examples of dimensions include size and duration. Recommended best practice is to use a controlled vocabulary such as the list of Internet Media Types [MIME].
Has Version: format-007
issued: 1999-07-02
Date Modified: 2008-01-14
type: Property
comment: The file format, physical medium, or dimensions of the resource.
note: A second property with the same name as this property has been declared in the dcterms: namespace (http://purl.org/dc/terms/). See the Introduction to the document "DCMI Metadata Terms" (http://dublincore.org/documents/dcmi-terms/) for an explanation.
date: 1999-07-02
date: 2008-01-14
Relation: format-007

Date
issued: 2008-01-14
comment: A point or period of time associated with an event in the lifecycle of the resource.
description: Date may be used to express temporal information at any level of granularity. Recommended best practice is to use an encoding scheme, such as the W3CDTF profile of ISO 8601 [W3CDTF].
Has Version: dateT-001
Date Modified: 2008-01-14
type: Property
range: Literal
sub property of: Date
date: 2008-01-14
Relation: dateT-001
range: Resource

in dataset
type: Property
comment: Points to the void:Dataset that a document is a part of.
domain: Document
range: dataset
domain: Resource
range: Resource
range: Thing

feature
type: Property
domain: dataset
range: technical feature
domain: Resource
domain: Thing
range: Thing
range: Resource

Subjects Target
type: Property
type: FunctionalProperty
comment: The dataset describing the subjects of triples contained in the Linkset.
domain: linkset
range: dataset
sub property of: Target
domain: Resource
domain: Thing
domain: dataset
range: Resource
range: Thing

Temporal Coverage
sub property of: Coverage
Has Version: temporal-003
type: Property
issued: 2000-07-11
Date Modified: 2008-01-14
range: Period of Time
comment: Temporal characteristics of the resource.
date: 2000-07-11
date: 2008-01-14
Relation: temporal-003
range: Location, Period, or Jurisdiction
range: Resource

has unit
type: DatatypeProperty
comment: An indication of the units used to record a resilience metadata value
domain: Resilience Metadata
range: string
type: Property
domain: Thing
domain: Resource
range: Resource

Abstract
Has Version: abstract-003
issued: 2000-07-11
Date Modified: 2008-01-14
type: Property
comment: A summary of the resource.
sub property of: Description
date: 2000-07-11
date: 2008-01-14
Relation: abstract-003

ReSIST Resilience Mechanisms Ontology
type: Ontology
description: The ReSIST Resilience Mechanisms Ontology represents metadata oriented descriptions of resilience mechanisms as part of the resilience-explicit computing section of work within the ReSIST project
version info: 0.2
creator: Zoe Andrews
creator: Ian Millard
created: 2007-05-09
imports: portal

Is Part Of
issued: 2000-07-11
type: Property
sub property of: Relation
Date Modified: 2008-01-14
note: This term is intended to be used with non-literal values as defined in the DCMI Abstract Model (http://dublincore.org/documents/abstract-model/). As of December 2007, the DCMI Usage Board is seeking a way to express this intention with a formal range declaration.
Has Version: isPartOf-003
comment: A related resource in which the described resource is physically or logically included.
date: 2000-07-11
date: 2008-01-14
Relation: isPartOf-003

RFC 5646
description: RFC 5646 obsoletes RFC 4646.
Has Version: RFC5646-001
issued: 2010-10-11
type: Datatype
comment: The set of tags constructed according to RFC 5646 for the identification of languages.
date: 2010-10-11
Relation: RFC5646-001
type: Class

root resource
type: Property
comment: A top concept or entry point for a void:Dataset that is structured in a tree-like fashion. All resources in a dataset can be reached by following links from its root resources in a small number of steps.
domain: dataset
domain: Resource
domain: Thing

Source
description: The described resource may be derived from the related resource in whole or in part. Recommended best practice is to identify the related resource by means of a string conforming to a formal identification system.
Has Version: source-006
issued: 1999-07-02
Date Modified: 2008-01-14
type: Property
comment: A related resource from which the described resource is derived.
note: A second property with the same name as this property has been declared in the dcterms: namespace (http://purl.org/dc/terms/). See the Introduction to the document "DCMI Metadata Terms" (http://dublincore.org/documents/dcmi-terms/) for an explanation.
date: 1999-07-02
date: 2008-01-14
Relation: source-006

Description
description: Description may include but is not limited to: an abstract, a table of contents, a graphical representation, or a free-text account of the resource.
Has Version: description-006
issued: 1999-07-02
Date Modified: 2008-01-14
type: Property
comment: An account of the resource.
note: A second property with the same name as this property has been declared in the dcterms: namespace (http://purl.org/dc/terms/). See the Introduction to the document "DCMI Metadata Terms" (http://dublincore.org/documents/dcmi-terms/) for an explanation.
date: 1999-07-02
date: 2008-01-14
Relation: description-006

RFC 1766
Has Version: RFC1766-003
issued: 2000-07-11
Date Modified: 2008-01-14
type: Datatype
comment: The set of tags, constructed according to RFC 1766, for the identification of languages.
date: 2000-07-11
date: 2008-01-14
Relation: RFC1766-003
type: Class

Calculated from Metadata
type: Metadata Acquisition Method
comment: Method of calculating metadata values as a result of other metadata
type: Thing

Date Submitted
sub property of: Date
type: Property
range: Literal
comment: Date of submission of the resource.
Date Modified: 2008-01-14
issued: 2002-07-13
description: Examples of resources to which a Date Submitted may be relevant are a thesis (submitted to a university department) or an article (submitted to a journal).
Has Version: dateSubmitted-002
date: 2002-07-13
date: 2008-01-14
Relation: dateSubmitted-002
range: Resource

property
type: Property
type: FunctionalProperty
comment: The rdf:Property that is the predicate of all triples in a property-based partition.
domain: dataset
range: Property
domain: Resource
domain: Thing
range: Resource

LCSH
Has Version: LCSH-003
issued: 2000-07-11
Date Modified: 2008-01-14
type: VocabularyEncodingScheme
comment: The set of labeled concepts specified by the Library of Congress Subject Headings.
date: 2000-07-11
date: 2008-01-14
Relation: LCSH-003

Resilience Tool
type: Mechanism Category
comment: A category of Resilience Mechanisms which are tools
type: Thing

a link predicate
type: Property
domain: linkset
range: Property
domain: dataset
domain: Resource
domain: Thing
range: Resource

DCMI Box
Has Version: Box-003
issued: 2000-07-11
Date Modified: 2008-01-14
type: Datatype
comment: The set of regions in space defined by their geographic coordinates according to the DCMI Box Encoding Scheme.
date: 2000-07-11
date: 2008-01-14
Relation: Box-003
type: Class

IMT
Has Version: IMT-004
issued: 2000-07-11
Date Modified: 2008-01-14
type: VocabularyEncodingScheme
comment: The set of media types specified by the Internet Assigned Numbers Authority.
date: 2000-07-11
date: 2008-01-14
Relation: IMT-004

Relation
note: This term is intended to be used with non-literal values as defined in the DCMI Abstract Model (http://dublincore.org/documents/abstract-model/). As of December 2007, the DCMI Usage Board is seeking a way to express this intention with a formal range declaration.
comment: A related resource.
description: Recommended best practice is to identify the related resource by means of a string conforming to a formal identification system.
Has Version: relationT-001
type: Property
sub property of: Relation
issued: 2008-01-14
Date Modified: 2008-01-14
date: 2008-01-14
Relation: relationT-001

http://lodlaundromat.org/17714688a41ffdc6c4b8d6d6fe627c4f
creator: ReSIST Project
Source: resilience-mechanism-65b5cef4
Date Created: 2015-02-09T03:41:40
Coreference Data: resilience-mechanism-65b5cef4
type: Ontology
type: Thing
date: 2015-02-09T03:41:40

resilience-mechanism-65b5cef4
addresses threat to resilience: Non-Deliberate-Fault
addressess-generic-area-of-interest: Non-Malicious-Fault
relates to new wg: resist wg divers
addressess-generic-area-of-interest: Availability
addressess-generic-area-of-interest: Reliability
has application domain: J.2.5
has application domain: J.2.0
addresses threat to resilience: Permanent-Fault
has related mechanism: id
has application domain: J.3.2
addresses threat to resilience: Transient-Fault
has mechanism category: mechanism-category-5c57c5d5
has-title: BFT - Practical Byzantine Fault Tolerance
has related mechanism: resilience-mechanism-59726624
addresses threat to resilience: Hardware-Fault
addresses threat to resilience: Malicious-Fault
addresses threat to resilience: Accidental-Fault
has application domain: J.7.4
addresses threat to resilience: Software-Fault
addresses threat to resilience: Human-Made-Fault
addresses threat to resilience: Development-Fault
addresses threat to resilience: Omission-Fault
addresses threat to resilience: Content-And-Timing-Failure
has application domain: J.1.0
has mechanism category: mechanism-category-cc11ff2f
addressess-generic-area-of-interest: Inconsistent-Failures
addresses threat to resilience: Timing-Failure
has component: technology-830ab2bf
addressess-generic-area-of-interest: Inconsistent-Error
has related mechanism: resilience-mechanism-ca383a29
relates to concept: resilience-concept-45a75e44
addresses threat to resilience: Unsignalled-Failure
addressess-generic-area-of-interest: Robustness
addressess-generic-area-of-interest: Compensation
has component: technology-5f6756ea
has knowledge requirement: knowledge-5f6756ea
addressess-generic-area-of-interest: Content-Error
has application domain: J.1.3
relates to concept: resilience-concept-c7c29966
has mechanism category: Resilience Architecture
addressess-generic-area-of-interest: Fault-Masking
addressess-generic-area-of-interest: Consistent-Error
has associated project: resist
relates to concept: resilience-concept-5ea14f41
has component: technology-29334252
addressess-generic-area-of-interest: Single-Error
has application domain: J.2.6
addressess-generic-area-of-interest: Timing-Error
applies to tehcnology: technology-bc9403e1
relates to old wg: resist wg algo
has component: technology-87fd6ba4
has additional requirements: The mechanism needs to make a synchrony assumption in order to provide liveness; otherwise it could be used to implement consensus in an asynchronous system, which is not possible. Liveness is guaranteed, i.e., clients eventually receive replies to their requests, provided at most floor((n-1)/3) replicas are faulty and delay(t) does not grow faster than t indefinitely. Here, delay(t) is the time between the moment t when a message is sent for the first time and the moment when it is received by its destination (assuming the sender keeps retransmitting the message until it is received). This is a rather weak synchrony assumption that is likely to be true in any real system provided network faults are eventually repaired, yet it enables the mechanism to circumvent the impossibility result.
addresses threat to resilience: Deliberate-Fault
type: Resilience Mechanism
addresses threat to resilience: Halt-Failure
detailed description pub: resource-CS184040
addresses threat to resilience: Non-Malicious-Fault
diversity comment: In order to cope with Byzantine failure modes, a consensus-based system requires 3m+1 replicas in order to tolerate m independent faults. Various forms of diversity and replication can be used to ensure that faults are independent, depending on the fault hypothesis, but in the worst case, both software and hardware diversity is needed in order to cope with malicious faults.
addressess-generic-area-of-interest: Malicious-Fault
has application domain: J.7.2
relates to concept: resilience-concept-b6fb8914
has application domain: J.3.1
relates to concept: resilience-concept-3df9b5c7
has application domain: J.7.0
has component: technology-1731f1ce
mechanism objectives: A practical implementation of Byzantine Fault Tolerance that can be used in asynchronous environments like the Internet. The mechanism guarantees safety, but needs to make a weak synchrony assumption in order to guarantee liveness.
has application domain: J.7.6
addresses threat to resilience: Inconsistent-Failures
addresses threat to resilience: Incompetence-Fault
has knowledge requirement: knowledge-597e821d
has knowledge requirement: knowledge-a41bb914
has component: technology-bc9403e1
addressess-generic-area-of-interest: Concurrent-Detection
submitted by: robert stroud
addresses threat to resilience: Consistent-Failures
detailed description: This paper describes a new replication algorithm that is able to tolerate Byzantine faults. We believe that Byzantine-fault-tolerant algorithms will be increasingly important in the future because malicious attacks and software errors are increasingly common and can cause faulty nodes to exhibit arbitrary behavior. Whereas previous algorithms assumed a synchronous system or were too slow to be used in practice, the algorithm described in this paper is practical: it works in asynchronous environments like the Internet and incorporates several important optimizations that improve the response time of previous algorithms by more than an order of magnitude. We implemented a Byzantine-fault-tolerant NFS service using our algorithm and measured its performance. The results show that our service is only 3% slower than a standard unreplicated NFS.
addressess-generic-area-of-interest: Integrity
type: Thing
comment: This paper describes a new replication algorithm that is able to tolerate Byzantine faults. We believe that Byzantine-fault-tolerant algorithms will be increasingly important in the future because malicious attacks and software errors are increasingly common and can cause faulty nodes to exhibit arbitrary behavior. Whereas previous algorithms assumed a synchronous system or were too slow to be used in practice, the algorithm described in this paper is practical: it works in asynchronous environments like the Internet and incorporates several important optimizations that improve the response time of previous algorithms by more than an order of magnitude. We implemented a Byzantine-fault-tolerant NFS service using our algorithm and measured its performance. The results show that our service is only 3% slower than a standard unreplicated NFS.
type: Technology

Title
Has Version: titleT-002
issued: 2008-01-14
Date Modified: 2010-10-11
type: Property
comment: A name given to the resource.
range: Literal
sub property of: Title
date: 2008-01-14
date: 2010-10-11
Relation: titleT-002
range: Resource

Talis
type: Agent
member: Keith Alexander

Data Dump
type: Property
comment: An RDF dump, partial or complete, of a void:Dataset.
domain: dataset
range: Resource
domain: Resource
domain: Thing

Digital Enterprise Research Institute, NUI Galway
type: Agent
member: Richard Cyganiak

distinct objects
type: Property
type: DatatypeProperty
comment: The total number of distinct objects in a void:Dataset. In other words, the number of distinct resources that occur in the object position of triples in the dataset. Literals are included in this count.
domain: dataset
range: integer
domain: Resource
domain: Thing
range: decimal
range: Resource

Medium
range: Physical Medium
comment: The material or physical carrier of the resource.
domain: Physical Resource
issued: 2000-07-11
type: Property
Has Version: medium-003
sub property of: Format
Date Modified: 2008-01-14
date: 2000-07-11
date: 2008-01-14
Relation: medium-003
range: Media Type or Extent
range: Resource
domain: Resource
range: Media Type

Subject
Has Version: subjectT-002
Date Modified: 2012-06-14
description: Typically, the subject will be represented using keywords, key phrases, or classification codes. Recommended best practice is to use a controlled vocabulary.
issued: 2008-01-14
sub property of: Subject
type: Property
note: This term is intended to be used with non-literal values as defined in the DCMI Abstract Model (http://dublincore.org/documents/abstract-model/). As of December 2007, the DCMI Usage Board is seeking a way to express this intention with a formal range declaration.
comment: The topic of the resource.
date: 2008-01-14
date: 2012-06-14
Relation: subjectT-002

Type
Has Version: typeT-001
sub property of: Type
description: Recommended best practice is to use a controlled vocabulary such as the DCMI Type Vocabulary [DCMITYPE]. To describe the file format, physical medium, or dimensions of the resource, use the Format element.
Date Modified: 2008-01-14
range: Class
type: Property
comment: The nature or genre of the resource.
issued: 2008-01-14
date: 2008-01-14
Relation: typeT-001
range: Resource

has URI regular expression pattern
type: Property
comment: Defines a regular expression pattern matching URIs in the dataset.
domain: dataset
domain: Resource
domain: Thing

Date Modified
Date Modified: 2008-01-14
sub property of: Date
type: Property
range: Literal
issued: 2000-07-11
comment: Date on which the resource was changed.
Has Version: modified-003
date: 2000-07-11
date: 2008-01-14
Relation: modified-003
range: Resource

TGN
Has Version: TGN-003
issued: 2000-07-11
Date Modified: 2008-01-14
type: VocabularyEncodingScheme
comment: The set of places specified by the Getty Thesaurus of Geographic Names.
date: 2000-07-11
date: 2008-01-14
Relation: TGN-003

URI
Has Version: URI-003
issued: 2000-07-11
Date Modified: 2008-01-14
type: Datatype
comment: The set of identifiers constructed according to the generic syntax for Uniform Resource Identifiers as specified by the Internet Engineering Task Force.
date: 2000-07-11
date: 2008-01-14
Relation: URI-003
type: Class

distinct subjects
type: Property
type: DatatypeProperty
comment: The total number of distinct subjects in a void:Dataset. In other words, the number of distinct resources that occur in the subject position of triples in the dataset.
domain: dataset
range: integer
domain: Resource
domain: Thing
range: decimal
range: Resource

Keith Alexander
type: Person

Contributor
description: Examples of a Contributor include a person, an organization, or a service. Typically, the name of a Contributor should be used to indicate the entity.
Has Version: contributor-006
issued: 1999-07-02
Date Modified: 2008-01-14
type: Property
comment: An entity responsible for making contributions to the resource.
note: A second property with the same name as this property has been declared in the dcterms: namespace (http://purl.org/dc/terms/). See the Introduction to the document "DCMI Metadata Terms" (http://dublincore.org/documents/dcmi-terms/) for an explanation.
date: 1999-07-02
date: 2008-01-14
Relation: contributor-006

Conforms To
issued: 2001-05-21
Date Modified: 2008-01-14
range: Standard
sub property of: Relation
comment: An established standard to which the described resource conforms.
Has Version: conformsTo-003
type: Property
date: 2001-05-21
date: 2008-01-14
Relation: conformsTo-003
range: Resource

Rights
range: Rights Statement
issued: 2008-01-14
description: Typically, rights information includes a statement about various property rights associated with the resource, including intellectual property rights.
comment: Information about rights held in and over the resource.
Date Modified: 2008-01-14
type: Property
Has Version: rightsT-001
sub property of: Rights
date: 2008-01-14
Relation: rightsT-001
range: Resource

RFC 3066
description: RFC 3066 has been obsoleted by RFC 4646.
Has Version: RFC3066-002
issued: 2002-07-13
Date Modified: 2008-01-14
type: Datatype
comment: The set of tags constructed according to RFC 3066 for the identification of languages.
date: 2002-07-13
date: 2008-01-14
Relation: RFC3066-002
type: Class

usability comment
type: DatatypeProperty
comment: Comment about how the mechanism relates to the ReSIST WP2 working group on usability
domain: Resilience Mechanism
range: string
type: Property
domain: Thing
domain: Resource
domain: Technology
range: Resource

Department of Zoology, University of Oxford
type: Agent
member: Jun Zhao

Coreference Ontology
type: Ontology
description: The coreference ontology is used in the Consistent Reference Service at www.rkbexplorer.com and elsewhere to manage coreference between URIs
version info: 0.1
created: 2008-06-18
creator: ReSIST NoE

has subset
type: Property
domain: dataset
range: dataset
domain: Resource
domain: Thing
range: Resource
range: Thing

Accrual Policy
Has Version: accrualPolicy-003
issued: 2005-06-13
Date Modified: 2010-10-11
type: Property
comment: The policy governing the addition of items to a collection.
domain: Collection
range: Policy
date: 2005-06-13
date: 2010-10-11
Relation: accrualPolicy-003
domain: Resource
range: Resource

Michael Hausenblas
type: Person

DCMI Period
Has Version: Period-003
issued: 2000-07-11
Date Modified: 2008-01-14
type: Datatype
comment: The set of time intervals defined by their limits according to the DCMI Period Encoding Scheme.
date: 2000-07-11
date: 2008-01-14
Relation: Period-003
type: Class

evolvability comment
type: DatatypeProperty
comment: Comment about how the mechanism relates to the ReSIST WP2 working group on evolvability
domain: Resilience Mechanism
range: string
type: Property
domain: Thing
domain: Resource
domain: Technology
range: Resource

DDC
Has Version: DDC-003
issued: 2000-07-11
Date Modified: 2008-01-14
type: VocabularyEncodingScheme
comment: The set of conceptual resources specified by the Dewey Decimal Classification.
date: 2000-07-11
date: 2008-01-14
Relation: DDC-003

Has Part
type: Property
Date Modified: 2008-01-14
issued: 2000-07-11
comment: A related resource that is included either physically or logically in the described resource.
note: This term is intended to be used with non-literal values as defined in the DCMI Abstract Model (http://dublincore.org/documents/abstract-model/). As of December 2007, the DCMI Usage Board is seeking a way to express this intention with a formal range declaration.
sub property of: Relation
Has Version: hasPart-003
date: 2000-07-11
date: 2008-01-14
Relation: hasPart-003

Date
description: Date may be used to express temporal information at any level of granularity. Recommended best practice is to use an encoding scheme, such as the W3CDTF profile of ISO 8601 [W3CDTF].
Has Version: date-006
issued: 1999-07-02
Date Modified: 2008-01-14
type: Property
comment: A point or period of time associated with an event in the lifecycle of the resource.
note: A second property with the same name as this property has been declared in the dcterms: namespace (http://purl.org/dc/terms/). See the Introduction to the document "DCMI Metadata Terms" (http://dublincore.org/documents/dcmi-terms/) for an explanation.
date: 1999-07-02
date: 2008-01-14
Relation: date-006

Accrual Periodicity
Has Version: accrualPeriodicity-003
issued: 2005-06-13
Date Modified: 2010-10-11
type: Property
comment: The frequency with which items are added to a collection.
domain: Collection
range: Frequency
date: 2005-06-13
date: 2010-10-11
Relation: accrualPeriodicity-003
domain: Resource
range: Resource

ISO 639-3
Has Version: ISO639-3-001
issued: 2008-01-14
type: Datatype
comment: The set of three-letter codes listed in ISO 639-3 for the representation of names of languages.
date: 2008-01-14
Relation: ISO639-3-001
type: Class

Rights
description: Typically, rights information includes a statement about various property rights associated with the resource, including intellectual property rights.
Has Version: rights-006
issued: 1999-07-02
Date Modified: 2008-01-14
type: Property
comment: Information about rights held in and over the resource.
note: A second property with the same name as this property has been declared in the dcterms: namespace (http://purl.org/dc/terms/). See the Introduction to the document "DCMI Metadata Terms" (http://dublincore.org/documents/dcmi-terms/) for an explanation.
date: 1999-07-02
date: 2008-01-14
Relation: rights-006

Is Required By
comment: A related resource that requires the described resource to support its function, delivery, or coherence.
type: Property
Date Modified: 2008-01-14
sub property of: Relation
note: This term is intended to be used with non-literal values as defined in the DCMI Abstract Model (http://dublincore.org/documents/abstract-model/). As of December 2007, the DCMI Usage Board is seeking a way to express this intention with a formal range declaration.
Has Version: isRequiredBy-003
issued: 2000-07-11
date: 2000-07-11
date: 2008-01-14
Relation: isRequiredBy-003

Jun Zhao
type: Person

Description
description: Description may include but is not limited to: an abstract, a table of contents, a graphical representation, or a free-text account of the resource.
Has Version: descriptionT-001
issued: 2008-01-14
Date Modified: 2008-01-14
type: Property
comment: An account of the resource.
sub property of: Description
date: 2008-01-14
Relation: descriptionT-001

URI space
type: Property
type: DatatypeProperty
comment: A URI that is a common string prefix of all the entity URIs in a void:Dataset.
domain: dataset
range: Literal
domain: Resource
domain: Thing
range: Resource

Has Format
issued: 2000-07-11
Date Modified: 2008-01-14
type: Property
comment: A related resource that is substantially the same as the pre-existing described resource, but in another format.
Has Version: hasFormat-003
sub property of: Relation
note: This term is intended to be used with non-literal values as defined in the DCMI Abstract Model (http://dublincore.org/documents/abstract-model/). As of December 2007, the DCMI Usage Board is seeking a way to express this intention with a formal range declaration.
date: 2000-07-11
date: 2008-01-14
Relation: hasFormat-003

has a SPARQL endpoint at
type: Property
domain: dataset
domain: Resource
domain: Thing

Objects Target
type: Property
type: FunctionalProperty
comment: The dataset describing the objects of the triples contained in the Linkset.
domain: linkset
range: dataset
sub property of: Target
domain: Resource
domain: Thing
domain: dataset
range: Resource
range: Thing

Date Available
comment: Date (often a range) that the resource became or will become available.
issued: 2000-07-11
Has Version: available-003
sub property of: Date
Date Modified: 2008-01-14
type: Property
range: Literal
date: 2000-07-11
date: 2008-01-14
Relation: available-003
range: Resource

description of variants
type: DatatypeProperty
comment: A textual description of possible variants of this mechanism to inform domain experts
domain: Resilience Mechanism
range: string
type: Property
domain: Thing
domain: Resource
domain: Technology
range: Resource

LiDRC
type: Agent
member: Michael Hausenblas

class partition
type: Property
comment: A subset of a void:Dataset that contains only the entities of a certain rdfs:Class.
domain: dataset
range: dataset
sub property of: has subset
domain: Resource
domain: Thing
range: Resource
range: Thing

RFC 4646
description: RFC 4646 obsoletes RFC 3066.
Has Version: RFC4646-001
issued: 2008-01-14
type: Datatype
comment: The set of tags constructed according to RFC 4646 for the identification of languages.
date: 2008-01-14
Relation: RFC4646-001
type: Class

Is Replaced By
type: Property
sub property of: Relation
note: This term is intended to be used with non-literal values as defined in the DCMI Abstract Model (http://dublincore.org/documents/abstract-model/). As of December 2007, the DCMI Usage Board is seeking a way to express this intention with a formal range declaration.
Date Modified: 2008-01-14
issued: 2000-07-11
Has Version: isReplacedBy-003
comment: A related resource that supplants, displaces, or supersedes the described resource.
date: 2000-07-11
date: 2008-01-14
Relation: isReplacedBy-003

Table Of Contents
Has Version: tableOfContents-003
issued: 2000-07-11
Date Modified: 2008-01-14
type: Property
comment: A list of subunits of the resource.
sub property of: Description
date: 2000-07-11
date: 2008-01-14
Relation: tableOfContents-003

Dublin Core Metadata Element Set, Version 1.1
Date Modified: 2012-06-14
publisher: DCMI
date: 2012-06-14

Title
Has Version: title-006
issued: 1999-07-02
Date Modified: 2008-01-14
type: Property
comment: A name given to the resource.
note: A second property with the same name as this property has been declared in the dcterms: namespace (http://purl.org/dc/terms/). See the Introduction to the document "DCMI Metadata Terms" (http://dublincore.org/documents/dcmi-terms/) for an explanation.
date: 1999-07-02
date: 2008-01-14
Relation: title-006

Resilience Architecture
type: Mechanism Category
comment: A category of Resilience Mechanisms which are architectures
type: Thing

Resilience Process
type: Mechanism Category
comment: A category of Resilience Mechanisms which are processes
type: Thing

Publisher
Date Modified: 2010-10-11
issued: 2008-01-14
range: Agent
comment: An entity responsible for making the resource available.
Has Version: publisherT-001
type: Property
description: Examples of a Publisher include a person, an organization, or a service.
sub property of: Publisher
date: 2008-01-14
date: 2010-10-11
Relation: publisherT-001
range: Resource

Observed by Outsider
type: Metadata Acquisition Method
comment: Method of acquiring metadata by observing the behaviour of the mechanism
type: Thing

Type
description: Recommended best practice is to use a controlled vocabulary such as the DCMI Type Vocabulary [DCMITYPE]. To describe the file format, physical medium, or dimensions of the resource, use the Format element.
Has Version: type-006
issued: 1999-07-02
Date Modified: 2008-01-14
type: Property
comment: The nature or genre of the resource.
note: A second property with the same name as this property has been declared in the dcterms: namespace (http://purl.org/dc/terms/). See the Introduction to the document "DCMI Metadata Terms" (http://dublincore.org/documents/dcmi-terms/) for an explanation.
date: 1999-07-02
date: 2008-01-14
Relation: type-006

DCMI Type Vocabulary
Has Version: DCMIType-005
issued: 2000-07-11
Date Modified: 2012-06-14
type: VocabularyEncodingScheme
comment: The set of classes specified by the DCMI Type Vocabulary, used to categorize the nature or genre of the resource.
date: 2000-07-11
date: 2012-06-14
Relation: DCMIType-005

Extent
type: Property
comment: The size or duration of the resource.
issued: 2000-07-11
range: Size or Duration
Has Version: extent-003
Date Modified: 2008-01-14
sub property of: Format
date: 2000-07-11
date: 2008-01-14
Relation: extent-003
range: Media Type or Extent
range: Resource

Reliability Metadata
type: Resilience Metadata Type
has definition: A piece of resilience metadata which is related to the reliability characteristics of a mechanism
comment: A piece of resilience metadata which is related to the reliability characteristics of a mechanism
type: Thing
type: Class

Accrual Method
Has Version: accrualMethod-003
issued: 2005-06-13
Date Modified: 2010-10-11
type: Property
comment: The method by which items are added to a collection.
domain: Collection
range: Method of Accrual
date: 2005-06-13
date: 2010-10-11
Relation: accrualMethod-003
domain: Resource
range: Resource

References
type: Property
note: This term is intended to be used with non-literal values as defined in the DCMI Abstract Model (http://dublincore.org/documents/abstract-model/). As of December 2007, the DCMI Usage Board is seeking a way to express this intention with a formal range declaration.
issued: 2000-07-11
Date Modified: 2008-01-14
sub property of: Relation
Has Version: references-003
comment: A related resource that is referenced, cited, or otherwise pointed to by the described resource.
date: 2000-07-11
date: 2008-01-14
Relation: references-003

Contributor
comment: An entity responsible for making contributions to the resource.
description: Examples of a Contributor include a person, an organization, or a service.
type: Property
Date Modified: 2010-10-11
issued: 2008-01-14
sub property of: Contributor
range: Agent
Has Version: contributorT-001
date: 2008-01-14
date: 2010-10-11
Relation: contributorT-001
range: Resource

classes
type: Property
type: DatatypeProperty
comment: The total number of distinct classes in a void:Dataset. In other words, the number of distinct resources occuring as objects of rdf:type triples in the dataset.
domain: dataset
range: integer
domain: Resource
domain: Thing
range: decimal
range: Resource

Date Copyrighted
range: Literal
type: Property
sub property of: Date
comment: Date of copyright.
issued: 2002-07-13
Date Modified: 2008-01-14
Has Version: dateCopyrighted-002
date: 2002-07-13
date: 2008-01-14
Relation: dateCopyrighted-002
range: Resource

Observed by Mechanism
type: Metadata Acquisition Method
comment: Method of acquiring metadata internally within the mechanism
type: Thing

Date Issued
range: Literal
sub property of: Date
comment: Date of formal issuance (e.g., publication) of the resource.
Has Version: issued-003
Date Modified: 2008-01-14
type: Property
issued: 2000-07-11
date: 2000-07-11
date: 2008-01-14
Relation: issued-003
range: Resource

assessability comment
type: DatatypeProperty
comment: Comment about how the mechanism relates to the ReSIST WP2 working group on assessability
domain: Resilience Mechanism
range: string
type: Property
domain: Thing
domain: Resource
domain: Technology
range: Resource

Richard Cyganiak
type: Person

Is Referenced By
Date Modified: 2008-01-14
issued: 2000-07-11
sub property of: Relation
note: This term is intended to be used with non-literal values as defined in the DCMI Abstract Model (http://dublincore.org/documents/abstract-model/). As of December 2007, the DCMI Usage Board is seeking a way to express this intention with a formal range declaration.
comment: A related resource that references, cites, or otherwise points to the described resource.
type: Property
Has Version: isReferencedBy-003
date: 2000-07-11
date: 2008-01-14
Relation: isReferencedBy-003

has description
type: DatatypeProperty
comment: A description of this resource
range: string
sub property of: comment
type: Property
range: Resource