The Music Ontology
date: $Date: 2010/11/28 17:08:19 $
description: The Music Ontology Specification provides main concepts and properties fo describing music (i.e. artists, albums and tracks) on the Semantic Web. This document contains a RDF description of the Music Ontology.
type: Ontology
imports: event.owl
imports: keys.owl
imports: terms
imports: core
imports: http://purl.org/vocab/bio/0.1/
imports: time
imports: http://xmlns.com/foaf/0.1/
version info: Revision: 2.1.5
maker: me
maker: moustaki
maker: fgiasson

analogue signal
level: 2
type: Class
comment: An analog signal.
subclass of: signal
disjoint with: digital signal
term status: stable

arrangement
level: 2
type: Class
comment: An arrangement event. Takes as agent the arranger, and produces a score (informational object, not the actually published score).
subclass of: Event
term status: stable

arranger
level: 2
type: Class
subclass of: Agent
equivalent class: http://lodlaundromat.org/.well-known/genid/1705ed01643751b07afe8eb08396b729#1
term status: unstable

audio file
level: 1
type: Class
comment: An audio file, which may be available on a local file system or through http, ftp, etc.
subclass of: Medium
subclass of: Document
term status: unstable

CD
level: 1
type: Class
comment: Compact Disc used as medium to record a musical manifestation.
subclass of: Medium
term status: unstable

composer
level: 2
type: Class
subclass of: Agent
equivalent class: http://lodlaundromat.org/.well-known/genid/1705ed01643751b07afe8eb08396b729#2
term status: unstable

composition
level: 2
type: Class
comment: A composition event. Takes as agent the composer himself. It produces a MusicalWork, or a MusicalExpression (when the initial "product" is a score, for example), or both...
subclass of: Event
term status: stable

conductor
level: 2
type: Class
subclass of: Agent
equivalent class: http://lodlaundromat.org/.well-known/genid/1705ed01643751b07afe8eb08396b729#3
term status: unstable

corporate body
level: 1
type: Class
comment: Organization or group of individuals and/or other organizations involved in the music market.
subclass of: Organization
term status: stable

DAT
level: 1
type: Class
comment: Digital Audio Tape used as medium to record a musical manifestation.
subclass of: Medium
term status: unstable

DCC
level: 1
type: Class
comment: Digital Compact Cassette used as medium to record a musical manifestation.
subclass of: Medium
term status: unstable

DVDA
level: 1
type: Class
comment: DVD-Audio used as medium to record a musical manifestation.
subclass of: Medium
term status: unstable

digital signal
level: 2
type: Class
comment: A digital signal
subclass of: signal
disjoint with: analogue signal
term status: stable

ED2K
level: 1
type: Class
comment: Something available on the E-Donkey peer-2-peer filesharing network
subclass of: Medium
term status: unstable

Festival
level: 2
type: Class
comment: A festival - musical/artistic event lasting several days, like Glastonbury, Rock Am Ring... We migth decompose this event (which is in fact just a classification of the space/time region related to a particular festival) using hasSubEvent in several performances at different space/time.
subclass of: Event
term status: stable

Genre
level: 2
type: Class
comment: An expressive style of music. Any taxonomy can be plug-in here. You can either define a genre by yourself, like this: :mygenre a mo:Genre; dc:title "electro rock". Or you can refer to a DBPedia genre (such as http://dbpedia.org/resource/Baroque_music), allowing semantic web clients to access easily really detailed structured information about the genre you are refering to.
term status: stable

Instrument
level: 2
type: Class
comment: Any of various devices or contrivances that can be used to produce musical tones or sound. Any taxonomy can be used to subsume this concept. The default one is one extracted by Ivan Herman from the Musicbrainz instrument taxonomy, conforming to SKOS. This concept holds a seeAlso link towards this taxonomy.
term status: stable

instrumentation
level: 2
type: Class
comment: Instrumentation deals with the techniques of writing music for a specific instrument, including the limitations of the instrument, playing techniques and idiomatic handling of the instrument.
subclass of: arrangement
term status: stable

label
level: 1
type: Class
comment: Trade name of a company that produces musical works or expression of musical works.
subclass of: corporate body
term status: stable

libretto
level: 2
type: Class
comment: Libretto
subclass of: musical expression
term status: stable

listened
level: 2
type: Class
subclass of: Agent
equivalent class: http://lodlaundromat.org/.well-known/genid/1705ed01643751b07afe8eb08396b729#4
term status: unstable

lyrics
level: 2
type: Class
comment: Lyrics
subclass of: musical expression
term status: stable

MD
level: 1
type: Class
comment: Mini Disc used as medium to record a musical manifestation.
subclass of: Medium
term status: unstable

MagneticTape
level: 1
type: Class
comment: Magnetic analogue tape used as medium to record a musical manifestation.
subclass of: Medium
term status: unstable

Medium
level: 1
type: Class
comment: A means or instrumentality for storing or communicating musical manifestation.
subclass of: MusicalItem
term status: unstable

membership
level: 1
type: Class
comment: A membership event, where one or several people belongs to a group during a particular time period.
subclass of: Event
term status: testing

movement
level: 2
type: Class
comment: A movement is a self-contained part of a musical work. While individual or selected movements from a composition are sometimes performed separately, a performance of the complete work requires all the movements to be performed in succession. Often a composer attempts to interrelate the movements thematically, or sometimes in more subtle ways, in order that the individual movements exert a cumulative effect. In some forms, composers sometimes link the movements, or ask for them to be played without a pause between them.
subclass of: musical work
term status: unstable

music artist
level: 1
type: Class
comment: A person or a group of people (or a computer :-) ), whose musical creative work shows sensitivity and imagination
subclass of: Agent
term status: stable

music group
level: 1
type: Class
comment: Group of musicians, or musical ensemble, usually popular or folk, playing parts of or improvising off of a musical arrangement.
subclass of: music artist
subclass of: Group
term status: stable

musical expression
level: 1
type: Class
comment: The intellectual or artistic realization of a work in the form of alpha-numeric, musical, or choreographic notation, sound, etc., or any combination of such forms. For example: Work #1 Franz Schubert's Trout quintet * Expression #1 the composer's score * Expression #2 sound issued from the performance by the Amadeus Quartet and Hephzibah Menuhin on piano * Expression #3 sound issued from the performance by the Cleveland Quartet and Yo-Yo Ma on the cello * . . . . The Music Ontology defines the following sub-concepts of a MusicalExpression, which should be used instead of MusicalExpression itself: Score (the result of an arrangement), Sound (produced during a performance), Signal. However, it is possible to stick to FRBR and bypass the worflow mechanism this ontology defines by using the core FRBR properties on such objects. But it is often better to use events to interconnect such expressions (allowing to go deeply into the production process - `this performer was playing this particular instrument at that particular time').
subclass of: Expression
term status: unstable

MusicalItem
level: 1
type: Class
comment: A single exemplar of a musical expression. For example, it could be a single exemplar of a CD. This is normally an single object (a CD) possessed by somebody. From the FRBR final report: The entity defined as item is a concrete entity. It is in many instances a single physical object (e.g., a copy of a one-volume monograph, a single audio cassette, etc.). There are instances, however, where the entity defined as item comprises more than one physical object (e.g., a monograph issued as two separately bound volumes, a recording issued on three separate compact discs, etc.). In terms of intellectual content and physical form, an item exemplifying a manifestation is normally the same as the manifestation itself. However, variations may occur from one item to another, even when the items exemplify the same manifestation, where those variations are the result of actions external to the intent of the producer of the manifestation (e.g., damage occurring after the item was produced, binding performed by a library, etc.).
term status: unstable

musical manifestation
level: 1
type: Class
comment: This entity is related to the edition/production/publication of a musical expression (musical manifestation are closely related with the music industry (their terms, concepts, definitions, methods (production, publication, etc.), etc.) From the FRBR final report: The entity defined as manifestation encompasses a wide range of materials, including manuscripts, books, periodicals, maps, posters, sound recordings, films, video recordings, CD-ROMs, multimedia kits, etc. As an entity, manifestation represents all the physical objects that bear the same characteristics, in respect to both intellectual content and physical form. Work #1 J. S. Bach's Six suites for unaccompanied cello * Expression #1 sound issued during the performance by Janos Starker recorded in 1963 and 1965 o Manifestation #1 recordings released on 33 1/3 rpm sound discs in 1965 by Mercury o Manifestation #2 recordings re-released on compact disc in 1991 by Mercury * Expression #2 sound issued during the performances by Yo-Yo Ma recorded in 1983 o Manifestation #1 recordings released on 33 1/3 rpm sound discs in 1983 by CBS Records o Manifestation #2 recordings re-released on compact disc in 1992 by CBS Records Changes that occur deliberately or even inadvertently in the production process that affect the copies result, strictly speaking, in a new manifestation. A manifestation resulting from such a change may be identified as a particular "state" or "issue" of the publication. Changes that occur to an individual copy after the production process is complete (e.g., the loss of a page, rebinding, etc.) are not considered to result in a new manifestation. That copy is simply considered to be an exemplar (or item) of the manifestation that deviates from the copy as produced. With the entity defined as manifestation we can describe the physical characteristics of a set of items and the characteristics associated with the production and distribution of that set of items that may be important factors in enabl…
subclass of: Manifestation
term status: stable

musical work
level: 2
type: Class
comment: Distinct intellectual or artistic musical creation. From the FRBR final report: A work is an abstract entity; there is no single material object one can point to as the work. We recognize the work through individual realizations or expressions of the work, but the work itself exists only in the commonality of content between and among the various expressions of the work. When we speak of Homer's Iliad as a work, our point of reference is not a particular recitation or text of the work, but the intellectual creation that lies behind all the various expressions of the work. For example: work #1 J. S. Bach's The art of the fugue
subclass of: Work
term status: stable

orchestration
level: 2
type: Class
comment: Orchestration includes, in addition to instrumentation, the handling of groups of instruments and their balance and interaction.
subclass of: arrangement
term status: stable

performance
level: 2
type: Class
comment: A performance event. It might include as agents performers, engineers, conductors, or even listeners. It might include as factors a score, a MusicalWork, musical instruments. It might produce a sound:-)
subclass of: Event
term status: stable

performer
level: 2
type: Class
subclass of: Agent
equivalent class: http://lodlaundromat.org/.well-known/genid/1705ed01643751b07afe8eb08396b729#5
term status: unstable

published libretto
level: 2
type: Class
comment: A published libretto
subclass of: musical manifestation
term status: stable

published lyrics
level: 2
type: Class
comment: Published lyrics, as a book or as a text file, for example
subclass of: musical manifestation
term status: stable

published score
level: 2
type: Class
comment: A published score (subclass of MusicalManifestation)
subclass of: musical manifestation
term status: stable

record
level: 1
type: Class
comment: A published record (manifestation which first aim is to render the product of a recording)
subclass of: musical manifestation
term status: stable

recording
level: 2
type: Class
comment: A recording event. Takes a sound as a factor to produce a signal (analog or digital). The location of such events (if any) is the actual location of the corresponding microphone or the "recording device".
subclass of: Event
term status: stable

recording session
level: 2
type: Class
comment: A set of performances/recordings/mastering events. This event can be decomposed in its constituent events using event:sub_event
subclass of: Event
term status: testing

release
level: 1
type: Class
comment: A specific release, with barcode, box, liner notes, cover art, and a number of records
subclass of: musical manifestation
term status: testing

release event
level: 1
type: Class
comment: A release event, in a particular place (e.g. a country) at a particular time. Other factors of this event might include cover art, liner notes, box, etc. or a release grouping all these.
subclass of: Event
term status: testing

release status
level: 1
type: Class
comment: Musical manifestation release status.
term status: stable

Release type
level: 1
type: Class
comment: Release type of a particular manifestation, such as "album" or "interview"...
term status: stable

SACD
level: 1
type: Class
comment: Super Audio Compact Disc used as medium to record a musical manifestation.
subclass of: Medium
term status: unstable

score
level: 2
type: Class
comment: Here, we are dealing with the informational object (the MusicalExpression), not the actually "published" score. This may be, for example, the product of an arrangement process.
subclass of: musical expression
term status: stable

Show
level: 2
type: Class
comment: A show - a musical event lasting several days, in a particular venue. Examples can be "The Magic Flute" at the Opera Bastille, August 2005, or a musical in the west end...
subclass of: Event
term status: stable

signal
level: 1
type: Class
comment: A subclass of MusicalExpression, representing a signal, for example a master signal produced by a performance and a recording.
subclass of: musical expression
term status: stable

signal group
level: 1
type: Class
comment: A musical expression representing a group of signals, for example a set of masters resulting from a whole recording/mastering session.
subclass of: musical expression
term status: testing

solo music artist
level: 1
type: Class
comment: Single person whose musical creative work shows sensitivity and imagination.
subclass of: music artist
subclass of: Person
term status: stable

sound
level: 2
type: Class
comment: A subclass of MusicalExpression, representing a sound. Realisation of a MusicalWork during a musical Performance.
subclass of: Event
subclass of: musical expression
term status: stable

sound engineer
level: 2
type: Class
subclass of: Agent
equivalent class: http://lodlaundromat.org/.well-known/genid/1705ed01643751b07afe8eb08396b729#6
term status: unstable

Stream
level: 1
type: Class
comment: Transmission over a network used as medium to broadcast a musical manifestation
subclass of: Medium
term status: unstable

Torrent
level: 1
type: Class
comment: Something available on the Bittorrent peer-2-peer filesharing network
subclass of: Medium
term status: unstable

rack
level: 1
type: Class
comment: A track on a particular record
subclass of: musical manifestation
term status: stable

transcription
level: 2
type: Class
comment: Transcription event
subclass of: Event
term status: testing

Vinyl
level: 1
type: Class
comment: Vinyl used as medium to record a musical manifestation
subclass of: Medium
term status: unstable

activity end
level: 1
type: DatatypeProperty
comment: Relates an artist to a date at which its activity ended
domain: music artist
range: date
term status: testing

activity start
level: 1
type: DatatypeProperty
comment: Relates an artist to a date at which its activity started
domain: music artist
range: date
term status: testing

album
description: One or more track issued together. This is a type of MusicalManifestation defined by the musical industry.
level: 1
type: Release type

amazon_asin
level: 1
type: ObjectProperty
comment: Used to link a work or the expression of a work to its corresponding Amazon ASINs page.
domain: http://lodlaundromat.org/.well-known/genid/1705ed01643751b07afe8eb08396b729#7
range: Document
sub property of: isPrimaryTopicOf
term status: stable

arranged in
level: 2
type: ObjectProperty
comment: Associates a work to an arrangement event where it was arranged
domain: musical work
range: arrangement
sub property of: isFactorOf
inverse of: arrangement of
term status: unstable

arrangement of
level: 2
type: ObjectProperty
comment: Associates an arrangement event to a work
domain: arrangement
range: musical work
sub property of: factor
inverse of: arranged in
term status: unstable

audio book
description: Book read by a narrator without music. This is a type of MusicalManifestation defined by the musical industry.
level: 1
type: Release type

availableAs
type: ObjectProperty
equivalent property: available as
term status: deprecated

available as
level: 1
type: ObjectProperty
comment: Relates a musical manifestation to a musical item (this album, and my particular cd). By using this property, there is no assumption on wether the full content is available on the linked item. To be explicit about this, you can use a sub-property, such as mo:item (the full manifestation is available on that item) or mo:preview (only a part of the manifestation is available on that item). This is a subproperty of frbr:examplar.
domain: musical manifestation
range: MusicalItem
sub property of: exemplar
term status: stable

biography
level: 1
type: ObjectProperty
comment: Used to link an artist to their online biography.
domain: music artist
range: Document
sub property of: isPrimaryTopicOf
term status: stable

bitsPerSample
level: 1
type: DatatypeProperty
type: FunctionalProperty
comment: Associates a digital signal to the number a bits used to encode one sample. Range is xsd:int.
domain: digital signal
range: int
term status: stable

bootleg
description: An unofficial/underground musical work or the expression of a musical work that was not sanctioned by the artist and/or the corporate body.
level: 1
type: release status

bpm
level: 2
type: DatatypeProperty
comment: Indicates the BPM of a MusicalWork or a particular Performance Beats per minute: the pace of music measured by the number of beats occurring in 60 seconds.
domain: http://lodlaundromat.org/.well-known/genid/1705ed01643751b07afe8eb08396b729#12
range: float
term status: stable

catalogue number
level: 1
type: DatatypeProperty
comment: Links a release with the corresponding catalogue number
domain: release
range: string
sub property of: universally unique identifier
term status: testing

channels
level: 1
type: DatatypeProperty
type: FunctionalProperty
comment: Associates a signal to the number of channels it holds (mono --> 1, stereo --> 2). Range is xsd:int.
domain: signal
range: int
term status: stable

collaborated_with
level: 1
type: ObjectProperty
type: SymmetricProperty
comment: Used to relate two collaborating people on a work.
domain: Agent
range: Agent
term status: unstable

compilation
description: Collection of previously released manifestations of a musical expression by one or more artists. This is a type of MusicalManifestation defined by the musical industry.
level: 1
type: Release type

compilation_of
level: 1
type: ObjectProperty
comment: Indicates that a musical manifestation is a compilation of several Signals.
domain: musical manifestation
range: signal
term status: unstable

compiled
level: 1
type: ObjectProperty
comment: Used to relate an person or a group of person who compiled the manifestation of a musical work.
domain: music artist
range: musical manifestation
inverse of: compiler
term status: unstable

compiler
level: 1
type: ObjectProperty
comment: Used to relate the manifestation of a musical work to a person or a group of person who compiled it.
domain: musical manifestation
range: music artist
inverse of: compiled
term status: unstable

composed in
level: 2
type: ObjectProperty
comment: Associates a MusicalWork to the Composition event pertaining to its creation. For example, I might use this property to associate the Magic Flute to its composition event, occuring during 1782 and having as a mo:composer Mozart.
domain: musical work
range: composition
sub property of: producedIn
inverse of: produced work
term status: unstable

composer
level: 2
type: ObjectProperty
comment: Associates a composition event to the actual composer. For example, this property could link the event corresponding to the composition of the Magic Flute in 1782 to Mozart himself (who obviously has a FOAF profile:-) ).
domain: composition
range: Agent
sub property of: agent
term status: stable

conducted
level: 2
type: ObjectProperty
comment: Relates agents to the performances they were conducting
domain: Agent
range: performance
sub property of: isAgentIn
sub property of: event
inverse of: conductor
term status: unstable

conductor
level: 2
type: ObjectProperty
comment: Relates a performance to the conductor involved
domain: performance
range: Agent
sub property of: agent
inverse of: conducted
term status: stable

contains_sample_from
level: 1
type: ObjectProperty
comment: Relates a signal to another signal, which has been sampled.
sub property of: derived from
term status: unstable

derived from
level: 1
type: ObjectProperty
comment: A related signal from which the described signal is derived.
domain: signal
range: signal
sub property of: source
term status: testing

discography
level: 1
type: ObjectProperty
comment: Used to links an artist to an online discography of their musical works. The discography should provide a summary of each released musical work of the artist.
domain: music artist
range: Document
sub property of: isPrimaryTopicOf
term status: stable

discogs
level: 1
type: ObjectProperty
comment: Used to link a musical work or the expression of a musical work, an artist or a corporate body to to its corresponding Discogs page.
domain: http://lodlaundromat.org/.well-known/genid/1705ed01643751b07afe8eb08396b729#16
range: Document
sub property of: isPrimaryTopicOf
term status: stable

djmix_of
level: 1
type: ObjectProperty
comment: Indicates that all (or most of) the tracks of a musical work or the expression of a musical work were mixed together from all (or most of) the tracks from another musical work or the expression of a musical work to form a so called DJ-Mix. The tracks might have been altered by pitching (so that the tempo of one track matches the tempo of the following track) and fading (so that one track blends in smoothly with the other). If the tracks have been more substantially altered, the "mo:remix" relationship type is more appropriate.
sub property of: derived from
term status: unstable

djmixed
level: 1
type: ObjectProperty
comment: Used to relate an artist who djmixed a musical work or the expression of a musical work. The artist usually selected the tracks, chose their sequence, and slightly changed them by fading (so that one track blends in smoothly with the other) or pitching (so that the tempo of one track matches the tempo of the following track). This applies to a 'Mixtape' in which all tracks were DJ-mixed together into one single long track.
domain: music artist
range: signal
inverse of: djmixed_by
term status: unstable

djmixed_by
level: 1
type: ObjectProperty
comment: Used to relate a work or the expression of a work to an artist who djmixed it. The artist usually selected the tracks, chose their sequence, and slightly changed them by fading (so that one track blends in smoothly with the other) or pitching (so that the tempo of one track matches the tempo of the following track). This applies to a 'Mixtape' in which all tracks were DJ-mixed together into one single long track.
domain: signal
range: music artist
inverse of: djmixed
term status: unstable

download
level: 1
type: ObjectProperty
comment: This property can be used to link from a person to the website where they make their works available, or from a manifestation (a track or an album, for example) to a web page where it is available for download. It is better to use one of the three sub-properties instead of this one in order to specify wether the content can be accessed for free (mo:freedownload), if it is just free preview material (mo:previewdownload), or if it can be accessed for some money (mo:paiddownload) (this includes links to the Amazon store, for example). This property MUST be used only if the content is just available through a web page (holding, for example a Flash application) - it is better to link to actual content directly through the use of mo:available_as and mo:Stream, mo:Torrent or mo:ED2K, etc. Therefore, Semantic Web user agents that don't know how to read HTML and even less to rip streams from Flash applications can still access the audio content.
domain: http://lodlaundromat.org/.well-known/genid/1705ed01643751b07afe8eb08396b729#22
range: Document
sub property of: isPrimaryTopicOf
term status: stable

duration
level: 1
comment: The duration of a track or a signal in ms
domain: http://lodlaundromat.org/.well-known/genid/1705ed01643751b07afe8eb08396b729#26
range: float
type: DatatypeProperty
term status: testing

ean
level: 1
type: DatatypeProperty
comment: The European Article Number (EAN) is a universal identifier for products, commonly printed in form of barcodes on them. The numbers represented by those codes can either be 8 or 13 digits long, with the 13-digit-version being most common. EANs form a superset of the North American Universal Product Code (UPC) as every UPC can be made an EAN by adding a leading zero to it. Additionally every EAN is also a Japanese Article Number (JAN). The identifiers were formerly assigned by EAN International which merged with Uniform Code Council (UCC, the guys behind the UPCs) and Electronic Commerce Council of Canada (ECCC) to become GS1.
domain: release
range: string
sub property of: gtin
term status: testing

encodes
level: 1
type: ObjectProperty
comment: Relates a MusicalItem (a track on a particular CD, an audio file, a stream somewhere) to the signal it encodes. This is usually a lower-resolution version of the master signal (issued from a Recording event).
domain: MusicalItem
range: signal
term status: unstable

encoding
level: 1
type: DatatypeProperty
comment: Method used to convert analog electronic signals into digital format such as "MP3 CBR @ 128kbps", "OGG @ 160kbps", "FLAC", etc.
domain: audio file
range: Literal
term status: unstable

engineer
level: 2
type: ObjectProperty
comment: Relates a performance or a recording to the engineer involved
domain: http://lodlaundromat.org/.well-known/genid/1705ed01643751b07afe8eb08396b729#29
range: Agent
sub property of: agent
inverse of: engineered
term status: stable

engineered
level: 2
type: ObjectProperty
comment: Relates agents to the performances/recordings they were engineering in
domain: Agent
range: http://lodlaundromat.org/.well-known/genid/1705ed01643751b07afe8eb08396b729#33
sub property of: isAgentIn
sub property of: event
inverse of: engineer
term status: unstable

ep
description: An EP
level: 1
type: Release type

eventHomePage
type: ObjectProperty
equivalent property: event homepage
term status: deprecated

event homepage
level: 2
type: ObjectProperty
comment: Links a particular event to a web page
domain: Event
range: Document
sub property of: isPrimaryTopicOf
term status: stable

exchange_item
level: 1
type: ObjectProperty
comment: A person, a group of person or an organization exchanging an exemplar of a single manifestation.
domain: Agent
range: Item
term status: stable

fanpage
level: 1
type: ObjectProperty
comment: Used to link an artist to a fan-created webpage devoted to that artist.
domain: music artist
range: Document
sub property of: isPrimaryTopicOf
term status: stable

free download
level: 1
type: ObjectProperty
comment: This property can be used to link from a person to the website where they make their works available, or from a manifestation (a track or an album, for example) to a web page where it is available for free download. This property MUST be used only if the content is just available through a web page (holding, for example a Flash application) - it is better to link to actual content directly through the use of mo:available_as and mo:Stream, mo:Torrent or mo:ED2K, etc. Therefore, Semantic Web user agents that don't know how to read HTML and even less to rip streams from Flash applications can still access the audio content.
domain: http://lodlaundromat.org/.well-known/genid/1705ed01643751b07afe8eb08396b729#37
range: Document
sub property of: download
sub property of: isPrimaryTopicOf
term status: stable

freedownload
type: ObjectProperty
equivalent property: free download
term status: deprecated

genre
level: 2
type: ObjectProperty
comment: Associates an event (like a performance or a recording) to a particular musical genre. Further version of this property may also include works and scores in the domain.
domain: http://lodlaundromat.org/.well-known/genid/1705ed01643751b07afe8eb08396b729#41
range: Genre
sub property of: genre
term status: stable

GRid
level: 1
type: DatatypeProperty
comment: The Global Release Identifier (GRid) is a system for uniquely identifying Releases of music over electronic networks (that is, online stores where you can buy music as digital files). As that it can be seen as the equivalent of the BarCode (or more correctly the GTIN) as found on physical releases of music. Like the ISRC (a code for identifying single recordings as found on releases) it was developed by the IFPI but it does not appear to be a standard of the ISO.
domain: release
range: string
sub property of: universally unique identifier
term status: testing

group
level: 1
type: ObjectProperty
comment: Relates a membership event with the corresponding group
domain: membership
range: Group
term status: testing

gtin
level: 1
type: DatatypeProperty
comment: GTIN is a grouping term for EANs and UPCs. In common speech those are called barcodes although the barcodes are just a representation of those identifying numbers.
domain: release
range: string
term status: testing

has track
type: ObjectProperty
equivalent property: track
term status: deprecated

headliner
level: 2
type: ObjectProperty
comment: Relates a performance to the headliner(s) involved
sub property of: performer
term status: testing

homepage
level: 1
type: ObjectProperty
comment: Links an artist, a record, etc. to a corresponding web page
domain: http://lodlaundromat.org/.well-known/genid/1705ed01643751b07afe8eb08396b729#52
range: Document
sub property of: isPrimaryTopicOf
term status: stable

image
level: 1
type: ObjectProperty
comment: Indicates a pictorial image (JPEG, GIF, PNG, Etc.) of a musical work, the expression of a musical work, the manifestation of a work or the examplar of a manifestation.
domain: http://lodlaundromat.org/.well-known/genid/1705ed01643751b07afe8eb08396b729#58
range: Image
sub property of: depiction
term status: stable

imdb
level: 1
type: ObjectProperty
comment: Used to link an artist, a musical work or the expression of a musical work to their equivalent page on IMDb, the InternetMovieDatabase.
domain: http://lodlaundromat.org/.well-known/genid/1705ed01643751b07afe8eb08396b729#64
range: Document
sub property of: isPrimaryTopicOf
term status: stable

instrument
level: 2
type: ObjectProperty
comment: Relates a performance to a musical instrument involved
domain: performance
range: Instrument
sub property of: factor
term status: stable

has interpeter
level: 1
type: ObjectProperty
comment: Adds an involved music artist, who interpreted, remixed, or otherwise modified an existing signal, which resulted in the signal that is here the subject of this relation.
domain: signal
range: music artist
term status: testing

interview
description: Recording of the questioning of a person. This is a type of MusicalManifestation defined by the musical industry.
level: 1
type: Release type

ipi
level: 1
type: DatatypeProperty
comment: The Interested Parties Information Code (IPI) is an ISO standard similar to ISBNs for identifying the people or groups with some involvement with a particular musical work / compositions.
domain: music artist
range: string
sub property of: universally unique identifier
term status: testing

ismn
level: 1
type: DatatypeProperty
comment: The International Standard Music Number (ISMN) is an ISO standard similar to ISBNs for identifying printed music publications
domain: http://lodlaundromat.org/.well-known/genid/1705ed01643751b07afe8eb08396b729#70
range: string
sub property of: universally unique identifier
term status: testing

isrc
level: 1
type: DatatypeProperty
comment: The ISRC (International Standard Recording Code) is the international identification system for sound recordings and music videorecordings. Each ISRC is a unique and permanent identifier for a specific recording which can be permanently encoded into a product as its digital fingerprint. Encoded ISRC provide the means to automatically identify recordings for royalty payments.
domain: signal
range: string
sub property of: universally unique identifier
term status: stable

iswc
level: 1
type: DatatypeProperty
comment: Links a musical work to the corresponding ISWC number
domain: musical work
range: string
sub property of: universally unique identifier
term status: testing

item
level: 1
type: ObjectProperty
comment: Relates a musical manifestation to a musical item (this album, and my particular cd) holding the entire manifestation, and not just a part of it.
domain: musical manifestation
range: MusicalItem
sub property of: available as
term status: testing

key
level: 2
type: ObjectProperty
comment: Indicated the key used by the musicians during a performance, or the key of a MusicalWork. Any of 24 major or minor diatonic scales that provide the tonal framework for a piece of music.
domain: http://lodlaundromat.org/.well-known/genid/1705ed01643751b07afe8eb08396b729#74
range: Key
term status: stable

label
level: 1
type: ObjectProperty
comment: Associates a release event with the label releasing the record
domain: http://lodlaundromat.org/.well-known/genid/1705ed01643751b07afe8eb08396b729#78
range: label
term status: testing

lc
level: 1
type: DatatypeProperty
comment: The Label Code (LC) was introduced in 1977 by the IFPI (International Federation of Phonogram and Videogram Industries) in order to unmistakably identify the different record labels (see Introduction, Record labels) for rights purposes. The Label Code consists historically of 4 figures, presently being extended to 5 figures, preceded by LC and a dash (e.g. LC-0193 = Electrola; LC-0233 = His Master's Voice). Note that the number of countries using the LC is limited, and that the code given on the item is not always accurate.
domain: label
range: string
sub property of: universally unique identifier
term status: testing

level
type: AnnotationProperty
comment: This annotation property associates to a particular Music Ontology term the corresponding expressiveness level. These levels can be: - 1: Only editorial/Musicbrainz type information - 2: Workflow information - 3: Even decomposition This property is mainly used for specification generation.

licence
level: 1
type: ObjectProperty
comment: Used to link a work or the expression of a work to the license under which they can be manipulated (downloaded, modified, etc). This is usually used to link to a Creative Commons licence.
domain: http://lodlaundromat.org/.well-known/genid/1705ed01643751b07afe8eb08396b729#81
range: License
term status: stable

listened
level: 2
type: ObjectProperty
comment: Relates agents to the performances they were listening in
domain: Agent
range: performance
sub property of: isAgentIn
sub property of: event
inverse of: listener
term status: unstable

listener
level: 2
type: ObjectProperty
comment: Relates a performance to the listener involved
domain: performance
range: Agent
sub property of: agent
inverse of: listened
term status: stable

live
description: A musical manifestation that was recorded live. This is a type of MusicalManifestation defined by the musical industry.
level: 1
type: Release type

lyrics
level: 2
type: ObjectProperty
comment: Associates lyrics with a musical work
domain: musical work
range: lyrics
term status: testing

mailorder
level: 1
type: ObjectProperty
comment: Used to link a musical work or the expression of a musical work to a website where people can buy a copy of the musical manifestation.
domain: http://lodlaundromat.org/.well-known/genid/1705ed01643751b07afe8eb08396b729#85
range: Document
sub property of: isPrimaryTopicOf
term status: stable

mashup_of
level: 1
type: ObjectProperty
comment: Indicates that musical works or the expressions of a musical work were mashed up on this album or track. This means that two musical works or the expressions of a musical work by different artists are mixed together, over each other, or otherwise combined into a single musical work (usually by a third artist, the remixer).
sub property of: derived from
term status: unstable

has media type
level: 1
type: ObjectProperty
comment: The mediatype (file format or MIME type, or physical medium) of a musical manifestation, e.g. a MP3, CD or vinyl.
domain: musical manifestation
range: MediaType
sub property of: format
term status: testing

medley_of
level: 1
type: ObjectProperty
comment: Indicates that a musical expression is a medley of several other musical expressions. This means that the orignial musical expression were rearranged to create a new musical expression in the form of a medley.
sub property of: derived from
term status: unstable

member
level: 1
type: ObjectProperty
comment: Indicates a member of a musical group
domain: music group
range: Agent
sub property of: member
term status: stable

member_of
level: 1
type: ObjectProperty
comment: Inverse of the foaf:member property
domain: Agent
range: Group
inverse of: member
term status: unstable

membership
level: 1
type: ObjectProperty
comment: Relates an agent with related membership events
domain: Agent
range: membership
term status: testing

meter
level: 2
type: DatatypeProperty
comment: Associates a musical work or a score with its meter
domain: http://lodlaundromat.org/.well-known/genid/1705ed01643751b07afe8eb08396b729#89
term status: testing

has_movement
level: 2
type: ObjectProperty
comment: Indicates that a musical work has movements
domain: musical work
range: movement
term status: unstable

movement number
level: 2
type: DatatypeProperty
comment: Indicates the position of a movement in a musical work.
domain: movement
range: int
term status: unstable

musicbrainz
level: 1
type: ObjectProperty
comment: Linking an agent, a track or a record to its corresponding Musicbrainz page.
domain: http://lodlaundromat.org/.well-known/genid/1705ed01643751b07afe8eb08396b729#92
range: Document
sub property of: isPrimaryTopicOf
term status: stable

Musicbrainz GUID
level: 1
type: DatatypeProperty
comment: Links an object to the corresponding Musicbrainz identifier
domain: http://lodlaundromat.org/.well-known/genid/1705ed01643751b07afe8eb08396b729#97
sub property of: universally unique identifier
term status: testing

musicmoz
level: 1
type: ObjectProperty
comment: Used to link an artist, a musical work or the expression of a musical work to its corresponding MusicMoz page.
domain: http://lodlaundromat.org/.well-known/genid/1705ed01643751b07afe8eb08396b729#105
range: Document
sub property of: isPrimaryTopicOf
term status: stable

myspace
level: 1
type: ObjectProperty
comment: Used to link a person to its corresponding MySpace page.
domain: Agent
range: Document
sub property of: isPrimaryTopicOf
term status: stable

official
description: Any musical work or the expression of a musical work officially sanctioned by the artist and/or their corporate body.
level: 1
type: release status

olga
level: 1
type: ObjectProperty
comment: Used to link a track to a tabulature file for track in the On-Line Guitar Archive.
domain: rack
range: Document
sub property of: isPrimaryTopicOf
term status: stable

onlinecommunity
level: 1
type: ObjectProperty
comment: Used to link a person with an online community web page like a blog, a wiki, a forum, a livejournal page, Etc.
domain: Agent
range: Document
sub property of: isPrimaryTopicOf
term status: stable

opus
level: 2
type: DatatypeProperty
comment: Used to define a creative work, especially a musical composition numbered to designate the order of a composer's works.
domain: musical work
range: Literal
term status: stable

origin
level: 1
type: ObjectProperty
comment: Relates an artist to its geographic origin
domain: music artist
range: SpatialThing
term status: testing

other_release_of
level: 1
type: ObjectProperty
type: SymmetricProperty
comment: Indicates that two musical manifestations are essentially the same.
domain: musical manifestation
range: musical manifestation
term status: unstable

paid download
level: 1
type: ObjectProperty
comment: Provide a link from an artist to a web page where all of that artist's musical work is available for some money, or a link from a manifestation (record/track, for example) to a web page providing a paid access to this manifestation.
domain: http://lodlaundromat.org/.well-known/genid/1705ed01643751b07afe8eb08396b729#110
range: Document
sub property of: download
sub property of: isPrimaryTopicOf
term status: stable

paiddownload
type: ObjectProperty
equivalent property: paid download
term status: deprecated

performance of
level: 2
type: ObjectProperty
comment: Associates a Performance to a musical work or an arrangement that is being used as a factor in it. For example, I might use this property to attach the Magic Flute musical work to a particular Performance.
domain: performance
range: http://lodlaundromat.org/.well-known/genid/1705ed01643751b07afe8eb08396b729#114
sub property of: factor
inverse of: performed in
term status: unstable

performed
level: 2
type: ObjectProperty
comment: Relates agents to the performances they were performing in
domain: Agent
range: performance
sub property of: isAgentIn
sub property of: event
inverse of: performer
term status: unstable

performed in
level: 2
type: ObjectProperty
comment: Associates a Musical Work or an Score to Performances in which they were a factor. For example, I might use this property in order to associate the Magic Flute to a particular performance at the Opera Bastille last year.
domain: http://lodlaundromat.org/.well-known/genid/1705ed01643751b07afe8eb08396b729#117
range: performance
sub property of: isFactorOf
inverse of: performance of
term status: unstable

performer
level: 2
type: ObjectProperty
comment: Relates a performance to the performers involved
domain: performance
range: Agent
sub property of: agent
inverse of: performed
term status: stable

possess_item
level: 1
type: ObjectProperty
comment: A person, a group of person or an organization possessing an exemplar of a single manifestation.
domain: Agent
range: Item
term status: stable

preview
level: 1
type: ObjectProperty
comment: Relates a musical manifestation to a musical item (this album, and my particular cd), which holds a preview of the manifestation (eg. one track for an album, or a snippet for a track)
domain: musical manifestation
range: MusicalItem
sub property of: available as
term status: testing

preview download
level: 1
type: ObjectProperty
comment: This property can be used to link from a person to the website where they make previews of their works available, or from a manifestation (a track or an album, for example) to a web page where a preview download is available. This property MUST be used only if the content is just available through a web page (holding, for example a Flash application) - it is better to link to actual content directly through the use of mo:available_as and mo:Stream, mo:Torrent or mo:ED2K, etc. Therefore, Semantic Web user agents that don't know how to read HTML and even less to rip streams from Flash applications can still access the audio content.
domain: http://lodlaundromat.org/.well-known/genid/1705ed01643751b07afe8eb08396b729#120
range: Document
sub property of: download
sub property of: isPrimaryTopicOf
term status: stable

primary instrument
level: 1
type: ObjectProperty
comment: Indicates that an artist primarily plays an instrument, or that a member was primarily playing a particular instrument during his membership
domain: http://lodlaundromat.org/.well-known/genid/1705ed01643751b07afe8eb08396b729#124
range: Instrument
term status: testing

produced
level: 1
type: ObjectProperty
comment: Used to relate an person or a group of person who produced the manifestation of a work.
domain: Agent
range: musical manifestation
inverse of: producer
term status: stable

produced score
level: 2
type: ObjectProperty
comment: Associates an arrangement event to a score product (score here does not refer to a published score, but more an abstract arrangement of a particular work).
domain: arrangement
range: score
sub property of: product
term status: unstable

produced signal
level: 2
type: ObjectProperty
comment: Associates a Recording to the outputted signal.
domain: recording
range: signal
sub property of: product
term status: stable

produced signal group
level: 2
type: ObjectProperty
comment: Associates a recording session with a group of master signals produced by it.
domain: recording session
range: signal group
sub property of: product
term status: testing

produced sound
level: 2
type: ObjectProperty
comment: Associates a Performance to a physical Sound that is being produced by it.
domain: performance
range: sound
sub property of: product
term status: stable

produced work
level: 2
type: ObjectProperty
comment: Associates a composition event to the produced MusicalWork. For example, this property could link the event corresponding to the composition of the Magic Flute in 1782 to the Magic Flute musical work itself. This musical work can then be used in particular performances.
domain: composition
range: musical work
sub property of: product
inverse of: composed in
term status: stable

producer
level: 1
type: ObjectProperty
comment: Used to relate the manifestation of a work to a person or a group of person who produced it.
domain: musical manifestation
range: Agent
inverse of: produced
term status: stable

producesSignal
type: ObjectProperty
equivalent property: produced signal
term status: deprecated

producesSound
type: ObjectProperty
equivalent property: produced sound
term status: deprecated

productOfComposition
type: ObjectProperty
equivalent property: composed in
term status: deprecated

promotion
description: A giveaway musical work or the expression of a musical work intended to promote an upcoming official musical work or the expression of a musical work.
level: 1
type: release status

publicationOf
type: ObjectProperty
equivalent property: publication of
term status: deprecated

publication of
level: 1
type: ObjectProperty
comment: Link a particular manifestation to the related signal, score, libretto, or lyrics
domain: musical manifestation
range: musical expression
inverse of: published as
term status: unstable

published
level: 1
type: ObjectProperty
comment: Used to relate an person or a group of person who published the manifestation of a work.
domain: Agent
range: musical manifestation
inverse of: publisher
term status: unstable

publishedAs
type: ObjectProperty
equivalent property: published as
term status: deprecated

published as
level: 1
type: ObjectProperty
comment: Links a musical expression (e.g. a signal or a score) to one of its manifestations (e.g. a track on a particular record or a published score).
domain: musical expression
range: musical manifestation
sub property of: embodiment
inverse of: publication of
term status: stable

publisher
level: 1
type: ObjectProperty
comment: Used to relate a musical manifestation to a person or a group of person who published it.
domain: musical manifestation
range: Agent
inverse of: published
term status: unstable

publishingLocation
type: ObjectProperty
equivalent property: publishingLocation
term status: deprecated

publishingLocation
level: 1
type: ObjectProperty
comment: Relates a musical manifestation to its publication location.
domain: musical manifestation
range: SpatialThing
term status: stable

puid
level: 1
type: DatatypeProperty
comment: Link a signal to the PUIDs associated with it, that is, PUID computed from MusicalItems (mo:AudioFile) derived from this signal. PUIDs (Portable Unique IDentifier) are the IDs used in the proprietary MusicDNS AudioFingerprinting system which is operated by MusicIP. Using PUIDs, one (with some luck) can identify the Signal object associated with a particular audio file, therefore allowing to access further information (on which release this track is featured? etc.). Using some more metadata one can identify the particular Track corresponding to the audio file (a track on a particular release).
domain: signal
range: string
term status: stable

released record
level: 1
type: ObjectProperty
comment: Associates a release with the records it contains. A single release can be associated with multiple records, for example for a multi-disc release.
domain: release
range: record
term status: testing

record count
level: 1
type: DatatypeProperty
comment: Associates a release with the number of records it contains, e.g. the number of discs it contains in the case of a multi-disc release.
domain: release
range: int
term status: testing

has record number
level: 1
type: DatatypeProperty
comment: Indicates the position of a record in a release (e.g. a 2xLP, etc.).
domain: record
range: nonNegativeInteger
term status: testing

has record side
level: 1
type: DatatypeProperty
comment: Associates the side on a vinyl record, where a track is located, e.g. A, B, C, etc. This property can then also be used in conjunction with mo:track_number, so that one can infer e.g. "A1", that means, track number 1 on side A.
domain: rack
range: string
term status: testing

recorded as
level: 2
type: ObjectProperty
comment: This is a shortcut property, allowing to bypass all the Sound/Recording steps. This property allows to directly link a Performance to the recorded Signal. This is recommended for "normal" users. However, advanced users wanting to express things such as the location of the microphone will have to create this shortcut as well as the whole workflow, in order to let the "normal" users access simply the, well, simple information:-) .
domain: performance
range: signal
inverse of: records
term status: stable

recorded in
level: 2
type: ObjectProperty
comment: Associates a physical Sound to a Recording event where it is being used in order to produce a signal. For example, I might use this property to associate the sound produced by a particular performance of the magic flute to a given recording, done using my cell-phone.
domain: sound
range: recording
sub property of: isFactorOf
inverse of: recorded sound
term status: unstable

recorded sound
level: 2
type: ObjectProperty
comment: Associates a Recording event to a physical Sound being recorded. For example, I might use this property to associate a given recording, done using my cell phone, to the sound produced by a particular performance of the magic flute.
domain: recording
range: sound
sub property of: factor
inverse of: recorded in
term status: stable

records
level: 2
type: ObjectProperty
comment: This is the inverse of the shortcut property recordedAs, allowing to relate directly a performance to a signal.
domain: signal
range: performance
inverse of: recordedAs
term status: unstable

release
level: 1
type: ObjectProperty
comment: Associates a release with the corresponding release event
domain: release event
range: release
sub property of: product
term status: testing

releaseStatus
type: ObjectProperty
equivalent property: release status
term status: deprecated

releaseType
type: ObjectProperty
equivalent property: release type
term status: deprecated

release status
level: 1
type: ObjectProperty
comment: Relates a musical manifestation to its release status (bootleg, ...)
domain: musical manifestation
range: release status
term status: stable

release type
level: 1
type: ObjectProperty
comment: Relates a musical manifestation to its release type (interview, spoken word, album, ...)
domain: musical manifestation
range: Release type
term status: stable

remaster_of
level: 1
type: ObjectProperty
comment: This relates two musical work or the expression of a musical work, where one is a remaster of the other. A remaster is a new version made for release from source recordings that were earlier released separately. This is usually done to improve the audio quality or adjust for more modern playback equipment. The process generally doesn't involve changing the music in any artistically important way. It may, however, result in tracks that are a few seconds longer or shorter.
sub property of: derived from
term status: unstable

remix
description: Musical manifestation that primarily contains remixed material. This is a type of MusicalManifestation defined by the musical industry.
level: 1
type: Release type

remix_of
level: 1
type: ObjectProperty
comment: Used to relate the remix of a musical work in a substantially altered version produced by mixing together individual tracks or segments of an original musical source work.
sub property of: derived from
term status: unstable

remixed
level: 1
type: ObjectProperty
comment: Used to relate an artist who remixed a musical work or the expression of a musical work. This involves taking just one other musical work and using audio editing to make it sound like a significantly different, but usually still recognisable, song. It can be used to link an artist to a single song that they remixed, or, if they remixed an entire musical work.
domain: music artist
range: signal
inverse of: remixer
term status: unstable

remixer
level: 1
type: ObjectProperty
comment: Used to relate a musical work or the expression of a musical work to an artist who remixed it. This involves taking just one other musical work and using audio editing to make it sound like a significantly different, but usually still recognisable, song. It can be used to link an artist to a single song that they remixed, or, if they remixed an entire musical work.
sub property of: has interpeter
inverse of: remixed
term status: unstable

review
level: 1
type: ObjectProperty
comment: Used to link a work or the expression of a work to a review. The review does not have to be open content, as long as it is accessible to the general internet population.
domain: http://lodlaundromat.org/.well-known/genid/1705ed01643751b07afe8eb08396b729#127
range: Document
sub property of: isPrimaryTopicOf
term status: stable

sampleRate
type: DatatypeProperty
equivalent property: sample rate
term status: deprecated

sample rate
level: 1
type: DatatypeProperty
type: FunctionalProperty
comment: Associates a digital signal to its sample rate. It might be easier to express it this way instead of defining a timeline map:-) Range is xsd:float.
domain: digital signal
range: float
term status: stable

sampled
level: 1
type: ObjectProperty
comment: Used to relate an artist who sampled a Signal.
domain: music artist
range: signal
inverse of: sampler
term status: unstable

sampledVersionOf
type: ObjectProperty
equivalent property: sampled version of
term status: deprecated

sampled version
level: 2
type: ObjectProperty
comment: Associates an analog signal with a sampled version of it
domain: analogue signal
range: digital signal
inverse of: sampled version of
term status: stable

sampled version of
level: 2
type: FunctionalProperty
type: ObjectProperty
comment: Associates a digital signal with the analog version of it
domain: digital signal
range: analogue signal
sub property of: derived from
inverse of: sampled version
term status: stable

sampler
level: 1
type: ObjectProperty
comment: Used to relate the signal of a musical work to an artist who sampled it.
sub property of: has interpeter
inverse of: sampled
term status: unstable

sell_item
level: 1
type: ObjectProperty
comment: A person, a group of person or an organization selling an exemplar of a single manifestation.
domain: Agent
range: Item
term status: stable

signal
level: 1
type: ObjectProperty
comment: Associates a group of signals with one of the signals it contains
domain: signal group
range: signal
term status: testing

signalTime
type: ObjectProperty
equivalent property: time
term status: deprecated

similar_to
level: 1
type: ObjectProperty
comment: A similarity relationships between two objects (so far, either an agent, a signal or a genre, but this could grow). This relationship is pretty general and doesn't make any assumptions on how the similarity claim was derived. Such similarity statements can come from a range of different sources (Musicbrainz similarities between artists, or coming from some automatic content analysis). However, the origin of such statements should be kept using a named graph approach - and ultimately, the documents providing such statements should attach some metadata to themselves (confidence of the claim, etc.).
domain: http://lodlaundromat.org/.well-known/genid/1705ed01643751b07afe8eb08396b729#131
range: http://lodlaundromat.org/.well-known/genid/1705ed01643751b07afe8eb08396b729#138
term status: unstable

singer
level: 2
type: ObjectProperty
comment: Relates a performance to an involved singer
domain: performance
range: Agent
sub property of: performer
term status: stable

single
description: A single or record single is a type of release, typically a recording of two tracks. In most cases, the single is a song that is released separately from an album, but it can still appear on an album.
level: 1
type: Release type

soundtrack
description: Sound recording on a narrow strip of a motion picture film. This is a type of MusicalManifestation defined by the musical industry.
level: 1
type: Release type

spoken word
description: Spoken word is a form of music or artistic performance in which lyrics, poetry, or stories are spoken rather than sung. Spoken-word is often done with a musical background, but emphasis is kept on the speaker. This is a type of MusicalManifestation defined by the musical industry.
level: 1
type: Release type

supporting_musician
level: 1
type: ObjectProperty
comment: Used to relate an artist doing long-time instrumental or vocal support for another artist.
domain: music artist
range: music artist
term status: unstable

tempo
level: 2
type: DatatypeProperty
comment: Rate of speed or pace of music. Tempo markings are traditionally given in Italian; common markings include: grave (solemn; very, very slow); largo (broad; very slow); adagio (quite slow); andante (a walking pace); moderato (moderate); allegro (fast; cheerful); vivace (lively); presto (very fast); accelerando (getting faster); ritardando (getting slower); and a tempo (in time; returning to the original pace).
domain: http://lodlaundromat.org/.well-known/genid/1705ed01643751b07afe8eb08396b729#145
range: string
term status: stable

text
level: 2
type: DatatypeProperty
comment: Associates lyrics with their text.
domain: lyrics
term status: testing

time
level: 1
type: FunctionalProperty
type: ObjectProperty
comment: Associates a Signal to a time object - its actual domain
domain: signal
range: TemporalEntity
term status: stable

track
level: 1
type: ObjectProperty
comment: Indicates a part of a musical manifestation - in this particular case, a track.
domain: record
range: rack
term status: stable

trackNum
type: DatatypeProperty
equivalent property: track number
term status: deprecated

track count
level: 1
type: DatatypeProperty
comment: The track count of a record
domain: record
range: int
term status: testing

track number
level: 1
type: DatatypeProperty
comment: Indicates the position of a track on a record medium (a CD, etc.).
domain: rack
range: nonNegativeInteger
term status: stable

translation_of
level: 1
type: ObjectProperty
comment: Indicates that a work or the expression of a work has translated or transliterated into another expression of a work.
domain: Expression
range: Expression
term status: unstable

tribute_to
level: 1
type: ObjectProperty
comment: Indicates a musical work or the expression of a musical work that is a tribute to an artist - normally consisting of music being composed by the artist but performed by other artists.
domain: musical manifestation
range: music artist
term status: unstable

trmid
level: 1
type: DatatypeProperty
comment: Indicates the TRMID of a track. TRM IDs are MusicBrainz' old AudioFingerprinting system. TRM (TRM Recognizes Music) IDs are (somewhat) unique ids that represent the audio signature of a musical piece (see AudioFingerprint).
domain: signal
range: string
term status: stable

upc
level: 1
type: DatatypeProperty
comment: UPC stands for "Universal Product Code", which was the original barcode used in the United States and Canada. The UPC (now officially EAN.UCC-12 is a numerical method of identifying products without redundancy worldwide for all types of products in the retail sector. The EAN is a superset of the original UPC increasing the digits to 13 with the prefix 0 reserved for UPC. As of 2005, manufacturers are only allowed to use the new 13-digit codes on their items, rather than having two separate numbers.
domain: release
range: string
sub property of: gtin
term status: testing

usedInPerformance
type: ObjectProperty
equivalent property: performed in
term status: deprecated

usedInRecording
type: ObjectProperty
equivalent property: recorded in
term status: deprecated

usesSound
type: ObjectProperty
equivalent property: recorded sound
term status: deprecated

usesWork
type: ObjectProperty
equivalent property: performance of
term status: deprecated

universally unique identifier
level: 1
type: DatatypeProperty
comment: Links an object to an universally unique identifier for it.
domain: Thing
sub property of: identifier
term status: testing

want_item
level: 1
type: ObjectProperty
comment: A person, a group of person or an organization wanting an exemplar of a single manifestation.
domain: Agent
range: Item
term status: stable

wikipedia
level: 1
type: ObjectProperty
comment: Used to link an work, an expression of a work, a manifestation of a work, a person, an instrument or a musical genre to its corresponding WikiPedia page. The full URL should be used, not just the WikiName.
domain: http://lodlaundromat.org/.well-known/genid/1705ed01643751b07afe8eb08396b729#149
range: Document
sub property of: isPrimaryTopicOf
term status: stable