Laser printing
subclass of: Resource
subclass of: Thing
type: Class
label: Yazıcı (bilgisayar) (Lazer yazıcılar) @tr
label: Máy in laser @vi
label: 激光打印机 @zh
describedby: Laser printing.rdf
comment: Laser printing is an electrostatic digital printing process. It very rapidly produces high-quality text and graphics (and moderate-quality photographs) by repeatedly passing a laser beam back & forth over an electron-charged, cylindrical drum, to define a differentially-charged image. The drum then selectively collects electrically-charged, powdered ink (i.e., toner), and transfers the image to the loaded paper, which is then heated in order to permanently fuse the text/imagery. As with digital photocopiers and multifunction/all-in-one inkjet printers, laser printers employ a xerographic printing process; but, laser printing differs from analog photocopiers in that the image is produced by the direct scanning of the medium across the printer's photoreceptor. This enables laser printing to copy images more quickly than most photocopiers. (Source: Wikipedia, the free encyclopedia, see http://en.wikipedia.org/wiki/Laser_printing)
subclass of: Product
subclass of: ProductOrService
label: Лазерний принтер @uk
describedby: Laser printing.ttl

The Product Types Ontology for Semantic Web-based E-Commerce
license: http://creativecommons.org/licenses/by-sa/3.0/
version info: 2015-02-20T09:55:42.340354
comment: The Product Types Ontology: Good identifiers for product types based on Wikipedia This service provides GoodRelations-compatible class definitions for any type of product or service that has an entry in the English Wikipedia. Vocabulary: http://www.productontology.org/# Namespace: http://www.productontology.org/ The Product Types Ontology is designed to be used in combination with GoodRelations, a standard vocabulary for the commercial aspects of offers. See http://purl.org/goodrelations/ for more information.
imports: v1
type: Ontology
rights: The class definition texts are taken from Wikipedia, the free encyclopedia under a Creative Commons Attribution-ShareAlike 3.0 Unported (CC BY-SA 3.0) license, see http://creativecommons.org/licenses/by-sa/3.0/. Accordingly, all ontology class definitions provided in here are available under the very same license.
subject: E-Commerce, E-Business, GoodRelations, Ontology, Wikipedia, DBPedia
title: PTO: The Product Types Ontology for Semantic Web-based E-Commerce
creator: Martin Hepp
contributor: The class abstracts and translations of labels are taken from Wikipedia, the free encyclopedia.