Coordinate reference systems
date: 2009-07-30 13:25:19.0
in dataset: void
type: Concept
deprecated: false
version info: 1
definition: Sistemas para referenciar de forma unívoca la información espacial en el espacio como una serie de coordenadas (x, y, z) y/o latitud y longitud y altura, basándose en un punto de referencia geodésico horizontal y vertical. @es
definition: Sistemas para referenciar de forma única a informação geográfica no espaço sob a forma de um conjunto de coordenadas (x, y, z) e/ou latitude e longitude e altitude, com base num datum geodésico horizontal e vertical. @pt
definition: Systems for uniquely referencing spatial information in space as a set of coordinates (x, y, z) and/or latitude and longitude and height, based on a geodetic horizontal and vertical datum.
definition: Systèmes de référencement unique des informations géographiques dans l''espace sous forme d''une série de coordonnées (x, y, z) et/ou la latitude et la longitude et l''altitude, en se fondant sur un point géodésique horizontal et vertical. @fr
narrower: AHGT
notation: SDN:P22::1
note: accepted
preferred label: Référentiels de coordonnées @fr
preferred label: Sistemas de coordenadas de referencia @es
preferred label: Sistemas de referencia @pt
top concept of: INSPIRE themes

Elevation
date: 2009-07-30 13:25:19.0
in dataset: void
type: Concept
deprecated: false
version info: 1
definition: Digital elevation models for land, ice and ocean surface. Includes terrestrial elevation, bathymetry and shoreline.
definition: Modelos digitais de terreno aplicáveis às superfícies terrestre, gelada e oceânica. Inclui a elevação terrestre, a batimetria e a linha costeira. @pt
definition: Modelos digitales de elevaciones para las superficies de tierra, hielo y mar. Se incluirán la altimetría, la batimetría y la línea de costa. @es
definition: Modèles numériques pour l''altitude des surfaces terrestres, glaciaires et océaniques. Comprend l''altitude terrestre, la bathymétrie et la ligne de rivage. @fr
narrower: Bathymetry
narrower: AHGT
narrower: ASLV
narrower: COGE
narrower: CRYS
narrower: MBAN
narrower: PREX
notation: SDN:P22::10
note: accepted
preferred label: Altitude @fr
preferred label: Elevaciones @es
top concept of: INSPIRE themes

Land cover
date: 2009-07-30 13:25:19.0
in dataset: void
type: Concept
deprecated: false
version info: 1
definition: Cobertura física e biológica da superfície terrestre, incluindo superfícies artificiais, zonas agrícolas, florestas, zonas naturais ou semi-naturais, zonas húmidas, massas de água. @pt
definition: Couverture physique et biologique de la surface terrestre, y compris les surfaces artificielles, les zones agricoles, les forêts, les zones (semi-)naturelles, les zones humides et les masses d''eau. @fr
definition: Cubierta física y biológica de la superficie de la tierra, incluidas las superficies artificiales, las zonas agrarias, los bosques, las zonas naturales o seminaturales, los humedales, las láminas de agua. @es
definition: Physical and biological cover of the earth's surface including artificial surfaces, agricultural areas, forests, (semi-)natural areas, wetlands, water bodies.
narrower: CRYS
narrower: LVEG
narrower: SBPH
narrower: SSCN
notation: SDN:P22::11
note: accepted
preferred label: Cubierta terrestre @es
preferred label: Occupation des terres @fr
preferred label: Ocupação do solo @pt
top concept of: INSPIRE themes

Orthoimagery
date: 2009-07-30 13:25:19.0
in dataset: void
type: Concept
deprecated: false
version info: 1
broader: Imagery
definition: Geo-referenced image data of the Earth's surface, from either satellite or airborne sensors.
definition: Imagens georeferenciadas da superfície terrestre recolhidas por satélite ou sensores aéreos. @pt
definition: Images géoréférencées de la surface terrestre, provenant de satellites ou de capteurs aéroportés. @fr
definition: Imágenes georreferenciadas de la superficie de la tierra, obtenidas por satélite o por sensores aerotransportados. @es
narrower: AerialImages
narrower: SatelliteImagery
narrower: COAS
narrower: R410
notation: SDN:P22::12
note: accepted
preferred label: Ortho-imagerie @fr
preferred label: Ortoimagens @pt
preferred label: Ortoimágenes @es
top concept of: INSPIRE themes

Geologia
date: 2009-07-30 13:25:19.0
in dataset: void
type: Concept
deprecated: false
version info: 1
broader: Geology
definition: Características geológicas según la composición y la estructura. Se incluirán la plataforma de roca firme, los acuíferos y la geomorfología. @es
definition: Geologia caracterizada de acordo com a composição e a estrutura. Inclui a base rochosa, os aquíferos e a geomorfologia. @pt
definition: Geology characterised according to composition and structure. Includes bedrock, aquifers and geomorphology.
definition: Géologie caractérisée en fonction de la composition et de la structure. Englobe le substratum rocheux, les aquifères et la géomorphologie. @fr
narrower: Geology
narrower: AASD
narrower: ACSR
narrower: CARS
narrower: CASD
narrower: CBSD
narrower: CCPW
narrower: CD10
narrower: CLAY
narrower: COGE
narrower: CPCN
narrower: CPSD
narrower: DBDX
narrower: DGPW
narrower: DPEV
narrower: GERA
narrower: GHDX
narrower: GRAV
narrower: GTCH
narrower: GWAM
narrower: GWCH
narrower: HAAC
narrower: HFLW
narrower: IRSP
narrower: IS4R
narrower: LIFX
narrower: LITH
narrower: MDPW
narrower: MINC
narrower: MMAN
narrower: MNGS
narrower: MTPW
narrower: NTPW
narrower: NTSD
narrower: OCPW
narrower: OGPW
narrower: OMPW
narrower: PASR
narrower: PCLM
narrower: PHSD
narrower: PHSE
narrower: RACC
narrower: RAGE
narrower: RALT
narrower: REFF
narrower: RMIN
narrower: ROGS
narrower: RPER
narrower: RPOT
narrower: RSIS
narrower: RTCO
narrower: SAGE
narrower: SALK
narrower: SAMO
narrower: SCAH
narrower: SCDO
narrower: SCOC
narrower: SDAC
narrower: SDNA
narrower: SHTA
narrower: SICO
narrower: SIPW
narrower: SPAG
narrower: SPCB
narrower: SPOL
narrower: SPRO
narrower: SR2D
narrower: SR3D
narrower: SRAD
narrower: SRFL

Statistical units
date: 2009-07-30 13:25:19.0
in dataset: void
type: Concept
deprecated: false
version info: 1
definition: Unidades para fins de divulgação ou utilização da informação estatística. @pt
definition: Unidades para la difusión o el uso de información estadística. @es
definition: Units for dissemination or use of statistical information.
definition: Unités de diffusion ou d''utilisation d''autres informations statistiques. @fr
notation: SDN:P22::14
note: accepted
preferred label: Unidades estadísticas @es
preferred label: Unidades estatísticas @pt
preferred label: Unités statistiques @fr
top concept of: INSPIRE themes

Buildings
date: 2009-07-30 13:25:19.0
in dataset: void
type: Concept
deprecated: false
version info: 1
definition: Geographical location of buildings.
definition: Localización geográfica de los edificios. @es
definition: Localização geográfica dos edifícios. @pt
definition: Situation géographique des bâtiments. @fr
narrower: MMST
notation: SDN:P22::15
note: accepted
preferred label: Bâtiments @fr
preferred label: Edificios @es
preferred label: Edifícios @pt
top concept of: INSPIRE themes

Administrative units
date: 2009-07-30 13:25:19.0
in dataset: void
type: Concept
deprecated: false
version info: 1
definition: Unidades administrativas en que se dividan las áreas en las que los Estados miembros tienen y/o ejercen derechos jurisdiccionales, a efectos de administración local, regional y nacional, separadas por límites administrativos. @es
definition: Unidades administrativas, zonas de divisão sobre as quais os Estados-Membros possuam e/ou exerçam direitos jurisdicionais, para efeitos de governação local, regional e nacional, separadas por fronteiras administrativas. @pt
definition: Units of administration, dividing areas where Member States have and/or exercise jurisdictional rights, for local, regional and national governance, separated by administrative boundaries.
definition: Unités d''administration séparées par des limites administratives et délimitant les zones dans lesquelles les États membres détiennent et/ou exercent leurs compétences, aux fins de l''administration locale, régionale et nationale. @fr
narrower: AdministrativeBoundaries
notation: SDN:P22::156
note: accepted
preferred label: Unidades administrativas @es
preferred label: Unités administratives @fr
top concept of: INSPIRE themes

Protected sites
date: 2009-07-30 13:25:19.0
in dataset: void
type: Concept
deprecated: false
version info: 1
broader: ProtectedAreas
definition: Area designated or managed within a framework of international, Community and Member States' legislation to achieve specific conservation objectives.
definition: Zonas designadas o gestionadas dentro de un marco legislativo internacional, comunitario o propio de los Estados miembros, para la consecución de unos objetivos de conservación específicos. @es
definition: Zonas designadas ou geridas no âmbito de legislação internacional, comunitária ou dos Estados-Membros para a prossecução de objectivos específicos de conservação. @pt
definition: Zone désignée ou gérée dans un cadre législatif international, communautaire ou national en vue d''atteindre des objectifs spécifiques de conservation. @fr
narrower: ProtectedAreas
narrower: MARC
notation: SDN:P22::158
note: accepted
preferred label: Lugares protegidos @es
preferred label: Sites protégés @fr
preferred label: Sítios protegidos @pt
top concept of: INSPIRE themes

Geographical names
date: 2009-07-30 13:25:19.0
in dataset: void
type: Concept
deprecated: false
version info: 1
definition: Denominações das zonas, regiões, localidades, cidades, subúrbios, pequenas cidades ou povoações, ou de qualquer entidade geográfica ou topográfica de interesse público ou histórico. @pt
definition: Names of areas, regions, localities, cities, suburbs, towns or settlements, or any geographical or topographical feature of public or historical interest.
definition: Nombres de zonas, regiones, localidades, ciudades, periferias, poblaciones o asentamientos, o cualquier rasgo geográfico o topográfico de interés público o histórico. @es
definition: Noms de zones, de régions, de localités, de grandes villes, de banlieues, de villes moyennes ou d''implantations, ou tout autre élément géographique ou topographique d''intérêt public ou historique. @fr
notation: SDN:P22::159
note: accepted
preferred label: Dénominations géographiques @fr
preferred label: Nombres geográficos @es
preferred label: Toponímia @pt
top concept of: INSPIRE themes

Soil
date: 2009-07-30 13:25:19.0
in dataset: void
type: Concept
deprecated: false
version info: 1
broader: Soils
definition: Soils and subsoil characterised according to depth, texture, structure and content of particles and organic material, stoniness, erosion, where appropriate mean slope and anticipated water storage capacity.
definition: Solo e subsolo caracterizado de acordo com a profundidade, textura, estrutura e conteúdo das partículas e material orgânico, carácter pedregoso, erosão, eventualmente declive médio e capacidade estimada de armazenamento de água. @pt
definition: Sols et sous-sol caractérisés selon leur profondeur, texture, structure et teneur en particules et en matières organiques, pierrosité, érosion, le cas échéant pente moyenne et capacité anticipée de stockage de l''eau. @fr
definition: Suelo y subsuelo, caracterizados según su profundidad, textura, estructura y contenido de partículas y material orgánico, pedregosidad, erosión y, cuando proceda, pendiente media y capacidad estimada de almacenamiento de agua. @es
narrower: Soils
narrower: GWAM
narrower: WCWT
notation: SDN:P22::16
note: accepted
preferred label: Solo @pt
preferred label: Sols @fr
preferred label: Suelo @es
top concept of: INSPIRE themes

Addresses
date: 2009-07-30 13:25:19.0
in dataset: void
type: Concept
deprecated: false
version info: 1
definition: Localisation des propriétés fondée sur les identifiants des adresses, habituellement le nom de la rue, le numéro de la maison et le code postal. @fr
definition: Localización de las propiedades, basada en identificadores de direcciones, por ejemplo, el nombre de la vía pública, el número de la finca, el código postal. @es
definition: Localização de propriedades com base em identificadores de endereço, em regra, o nome da rua, o número da porta e o código postal. @pt
definition: Location of properties based on address identifiers, usually by road name, house number, postal code.
notation: SDN:P22::160
note: accepted
preferred label: Adresses @fr
preferred label: Direcciones @es
preferred label: Endereços @pt
top concept of: INSPIRE themes

Cadastral parcels
date: 2009-07-30 13:25:19.0
in dataset: void
type: Concept
deprecated: false
version info: 1
definition: Zones définies par les registres cadastraux ou équivalents. @fr
definition: areas defined by cadastral registers or equivalent.
definition: Áreas definidas por registos cadastrais ou equivalentes. @pt
definition: Áreas determinadas por registros catastrales o equivalentes. @es
notation: SDN:P22::161
note: accepted
preferred label: Parcelas cadastrais @pt
preferred label: Parcelas catastrales @es
preferred label: Parcelles cadastrales @fr
top concept of: INSPIRE themes

Transport networks
date: 2009-07-30 13:25:19.0
in dataset: void
type: Concept
deprecated: false
version info: 1
definition: Redes de carreteras, ferrocarril, transporte aéreo y vías navegables, con sus correspondientes infraestructuras. Se incluirán las conexiones entre redes diferentes. Se incluirá también la red transeuropea de transporte, según la definición de la Decisión no 1692/96/CE del Parlamento Europeo y del Consejo, de 23 de julio de 1996, sobre las orientaciones comunitarias para el desarrollo de la red transeuropea de transporte (1), y de las futuras revisiones de dicha Decisión. @es
definition: Redes de transporte rodoviário, ferroviário, aéreo e por via navegável, e respectivas infra-estruturas. Inclui as ligações entre as diferentes redes. Inclui também a rede transeuropeia de transportes definida na Decisão n.o 1692/96/CE do Parlamento Europeu e do Conselho, de 23 de Julho de 1996, sobre as orientações comunitárias para o desenvolvimento da rede transeuropeia de transportes (1), e as futuras revisões dessa decisão. @pt
definition: Road, rail, air and water transport networks and related infrastructure. Includes links between different networks. Also includes the trans-European transport network as defined in Decision No 1692/96/EC of the European Parliament and of the Council of 23 July 1996 on Community Guidelines for the development of the trans-European transport network (1) and future revisions of that Decision. (1) OJ L 228, 9.9.1996, p. 1. Decision as last amended by Council Regulation (EC) No 1791/2006 (OJ L 363, 20.12.2006, p. 1).
definition: Réseaux routier, ferroviaire, aérien et navigable ainsi que les infrastructures associées. Sont également incluses les correspondances entre les différents réseaux, ainsi que le réseau transeuropéen de transport tel que défini dans la décision no 1692/96/CE du Parlement européen et du Conseil du 23 juillet 1996 sur les orientations communautaires pour le développement du réseau transeuropéen de transport (1) et les révisions futures de cette décision. @fr
narrower: Access
narrower: LandTransport
narrower: MarineTransport
narrower: Shipping
narrower: TRAN
notation: SDN:P22::162
note: accepted
preferred label: Redes de transporte @es
preferred label: Réseaux de transport @fr
top concept of: INSPIRE themes

Hydrography
date: 2009-07-30 13:25:19.0
in dataset: void
type: Concept
deprecated: false
version info: 1
broader: Hydrology
definition: Elementos hidrográficos, incluidas las zonas marinas y todas las otras masas de agua y elementos relacionados con ellas, así como las cuencas y subcuencas hidrográficas. Cuando proceda, según lo definido en la Directiva 2000/60/CE del Parlamento Europeo y del Consejo, de 23 de octubre de 2000, por la que se establece un marco comunitario de actuación en el ámbito de la política de aguas (2), y en forma de redes. @es
definition: Elementos hidrográficos, incluindo zonas marinhas e todas as outras massas de água e elementos com eles relacionados, incluindo bacias e sub-bacias hidrográficas. Quando adequado, de acordo com as definições da Directiva 2000/60/CE do Parlamento Europeu e do Conselho, de 23 de Outubro de 2000, que estabelece um quadro de acção comunitária no domínio da política da água (2), e sob a forma de redes. @pt
definition: Hydrographic elements, including marine areas and all other water bodies and items related to them, including river basins and sub-basins. Where appropriate, according to the definitions set out in Directive 2000/60/EC of the European Parliament and of the Council of 23 October 2000 establishing a framework for Community action in the field of water policy, and in the form of networks.
definition: Éléments hydrographiques, y compris les zones maritimes ainsi que toutes les autres masses d''eau et les éléments qui y sont liés, y compris les bassins et sous-bassins hydrographiques. Conformes, le cas échéant, aux définitions établies par la directive 2000/60/CE du Parlement européen et du Conseil du 23 octobre 2000 établissant un cadre pour une politique communautaire dans le domaine de l''eau (2) et sous forme de réseaux. @fr
narrower: Hydrology
narrower: GP001
narrower: GWAM
narrower: GWCH
narrower: LWET
narrower: MBAN
narrower: RVDS
narrower: SICO
narrower: WQBI
narrower: WVSP
notation: SDN:P22::163
note: accepted
preferred label: Hidrografia @pt
preferred label: Hidrografía @es
preferred label: Hydrographie @fr
top concept of: INSPIRE themes

Land use
date: 2009-07-30 13:25:19.0
in dataset: void
type: Concept
deprecated: false
version info: 1
broader: LandUse
definition: Caracterización del territorio, de acuerdo con su dimensión funcional o su dedicación socioeconómica actual o futura planificadas (por ejemplo, residencial, industrial, comercial, agrario, forestal, recreativo). @es
definition: Caracterização do território de acordo com a dimensão funcional ou finalidade socioeconómica planeada, presente e futura (por exemplo, residencial, industrial, comercial, agrícola, silvícola, recreativa). @pt
definition: Territoire caractérisé selon sa dimension fonctionnelle prévue ou son objet socioéconomique actuel et futur (par exemple, résidentiel, industriel, commercial, agricole, forestier, récréatif). @fr
definition: Territory characterised according to its current and future planned functional dimension or socio-economic purpose (e.g. residential, industrial, commercial, agricultural, forestry, recreational).
narrower: LandUse
narrower: IACT
narrower: MLES
notation: SDN:P22::17
note: accepted
preferred label: Usage des sols @fr
preferred label: Uso del suelo @es
preferred label: Uso do solo @pt
related: ADUN
top concept of: INSPIRE themes

Human health and safety
date: 2009-07-30 13:25:19.0
in dataset: void
type: Concept
deprecated: false
version info: 1
definition: Distribución geográfica de la dominancia de patologías (alergias, cáncer, enfermedades respiratorias, etc.), la información que indique el efecto sobre la salud (marcadores biológicos, declive de la fertilidad, epidemias) o el bienestar humanos (cansancio, estrés, etc.) directamente vinculada con la calidad del medio ambiente (contaminación del aire, productos químicos, enrarecimiento de la capa de ozono, ruido, etc.) o indirectamente vinculada con dicha calidad (alimentos, organismos modificados genéticamente, etc.). @es
definition: Distribuição geográfica da dominância de patologias (alergias, cancros, doenças respiratórias, etc.), informações que indiquem o efeito da qualidade do ambiente sobre a saúde (biomarcadores, declínio da fertilidade, epidemias) ou sobre o bem-estar dos seres humanos (fadiga, tensão, stress, etc.) de forma directa (poluição do ar, produtos químicos, empobrecimento da camada de ozono, ruído, etc.) ou indirecta (alimentação, organismos geneticamente modificados, etc.). @pt
definition: Geographical distribution of dominance of pathologies (allergies, cancers, respiratory diseases, etc.), information indicating the effect on health (biomarkers, decline of fertility, epidemics) or well-being of humans (fatigue, stress, etc.) linked directly (air pollution, chemicals, depletion of the ozone layer, noise, etc.) or indirectly (food, genetically modified organisms, etc.) to the quality of the environment.
definition: Répartition géographique des pathologies dominantes (allergies, cancers, maladies respiratoires, etc.) liées directement (pollution de l''air, produits chimiques, appauvrissement de la couche d''ozone, bruit, etc.) ou indirectement (alimentation, organismes génétiquement modifiés, etc.) à la qualité de l''environnement, et ensemble des informations relatif à l''effet de celle-ci sur la santé des hommes (marqueurs biologiques, déclin de la fertilité, épidémies) ou leur bienêtre (fatigue, stress, etc.). @fr
narrower: CoastalDefenceStructures
narrower: CoastalErosion
narrower: Flooding
narrower: WaterQuality
narrower: BABI
narrower: BCAH
narrower: BCMT
narrower: BCOC
narrower: BCPB
narrower: BRAD
narrower: GP001
narrower: GP010
narrower: GP048
narrower: GP050
narrower: HZNV
narrower: IDIS
narrower: LITT
narrower: MDBO
narrower: OMBI
narrower: OMPW
narrower: OMWC
narrower: PEBI
narrower: PESD
narrower: PEWB
narrower: PHBI
narrower: PHSE
narrower: PHWB
narrower: PPCB
narrower: PPWC
narrower: PTOX
narrower: SPCB
notation: SDN:P22::18
note: accepted
preferred label: Salud y seguridad humanas @es
preferred label: Santé et sécurité des personnes @fr
preferred label: Saúde humana e segurança @pt
top concept of: INSPIRE themes

Utility and government services
date: 2009-07-30 13:25:19.0
in dataset: void
type: Concept
deprecated: false
version info: 1
definition: Comprend les installations d''utilité publique, tels que les égouts ou les réseaux et installations liés à la gestion des déchets, à l''approvisionnement énergétique, à l''approvisionnement en eau, ainsi que les services administratifs et sociaux publics, tels que les administrations publiques, les sites de la protection civile, les écoles et les hôpitaux. @fr
definition: Includes utility facilities such as sewage, waste management, energy supply and water supply, administrative and social governmental services such as public administrations, civil protection sites, schools and hospitals.
definition: Inclui instalações e serviços de utilidade pública, como redes de esgotos, gestão de resíduos, fornecimento de energia, abastecimento de água, serviços administrativos e sociais do Estado tais como administrações públicas, instalações da protecção civil, escolas e hospitais. @pt
definition: Incluye instalaciones de utilidad pública de alcantarillado, gestión de residuos, suministro de energía y suministro de agua, así como servicios estatales administrativos y sociales tales como administraciones públicas, sitios de protección civil, escuelas y hospitales. @es
narrower: Infrastructure
narrower: GP001
narrower: QDMD
notation: SDN:P22::19
note: accepted
preferred label: Services d''utilité publique et services publics @fr
preferred label: Servicios de utilidad pública y estatales @es
preferred label: Serviços de utilidade pública e do Estado @pt
top concept of: INSPIRE themes

Geographical grid systems
date: 2009-07-30 13:25:19.0
in dataset: void
type: Concept
deprecated: false
version info: 1
definition: Cuadrículas armonizadas multirresolución con un punto de origen común y con ubicación y tamaños de cuadrícula normalizados. @es
definition: Grille multi-résolution harmonisée avec un point d''origine commun et une localisation ainsi qu''une taille des cellules harmonisées. @fr
definition: Harmonised multi-resolution grid with a common point of origin and standardised location and size of grid cells.
definition: Quadrícula harmonizada multi-resolução com um ponto de origem comum e localização e dimensão normalizadas das células. @pt
narrower: ALAT
notation: SDN:P22::2
note: accepted
preferred label: Sistema de cuadrículas geográficas @es
preferred label: Sistemas de quadrículas geográficas @pt
preferred label: Systèmes de maillage géographique @fr
top concept of: INSPIRE themes

Environmental monitoring facilities
date: 2009-07-30 13:25:19.0
in dataset: void
type: Concept
deprecated: false
version info: 1
definition: A localização e funcionamento de instalações de monitorização do ambiente inclui a observação e medição de emissões, do estado das diferentes componentes ambientais e de outros parâmetros dos ecossistemas (biodiversidade, condições ecológicas da vegetação, etc.) pelas autoridades públicas ou por conta destas. @pt
definition: La situation et le fonctionnement des installations de suivi environnemental comprennent l''observation et la mesure des émissions, de l''état du milieu environnemental et d''autres paramètres de l''écosystème (biodiversité, conditions écologiques de la végétation, etc.) par les autorités publiques ou pour leur compte. @fr
definition: La ubicación y funcionamiento de instalaciones de observación del medio ambiente, encargadas de observar y medir emisiones, el estado del medio ambiente y otros parámetros del ecosistema (biodiversidad, condiciones ecológicas de la vegetación, etc.), por parte de las autoridades públicas o en nombre de ellas. @es
definition: Location and operation of environmental monitoring facilities includes observation and measurement of emissions, of the state of environmental media and of other ecosystem parameters (biodiversity, ecological conditions of vegetation, etc.) by or on behalf of public authorities.
narrower: CoastalMonitoring
narrower: NutrientSampleSites
narrower: CFTM
notation: SDN:P22::20
note: accepted
preferred label: Instalaciones de observación del medio ambiente @es
preferred label: Instalações de monitorização do ambiente @pt
preferred label: Installations de suivi environnemental @fr
top concept of: INSPIRE themes

Production and industrial facilities
date: 2009-07-30 13:25:19.0
in dataset: void
type: Concept
deprecated: false
version info: 1
definition: Centros de producción industrial, incluidas las instalaciones contempladas en la Directiva 96/61/CE del Consejo, de 24 de septiembre de 1996, sobre la prevención y el control integrado de la contaminación (1), e instalaciones de extracción de agua, instalaciones mineras, centros de almacenamiento. @es
definition: Industrial production sites, including installations covered by Council Directive 96/61/EC of 24 September 1996 concerning integrated pollution prevention and control (1) and water abstraction facilities, mining, storage sites.
definition: Locais de produção industrial, incluindo instalações abrangidas pela Directiva 96/61/CE do Conselho, de 24 de Setembro de 1996, relativa à prevenção e controlo integrados da poluição (1), e instalações de captação de água, minas, locais de armazenagem. @pt
definition: Sites de production industrielle, y compris les installations couvertes par la directive 96/61/CE du Conseil du 24 septembre 1996 relative à la prévention et à la réduction intégrées de la pollution (1) et les installations de captage d''eau, d''extraction minière et de stockage. @fr
narrower: ShippingPorts
notation: SDN:P22::21
note: accepted
preferred label: Instalaciones de producción e industriales @es
preferred label: Instalações industriais e de produção @pt
preferred label: Lieux de production et sites industriels @fr
top concept of: INSPIRE themes

Agriculture and aquaculture facilities
date: 2009-07-30 13:25:19.0
in dataset: void
type: Concept
deprecated: false
version info: 1
broader: Agriculture
definition: Equipamento e instalações de explorações agrícolas e aquícolas (incluindo sistemas de irrigação, estufas e viveiros, e estábulos). @pt
definition: Equipamiento e instalaciones de producción agraria (incluidos sistemas de regadío, invernaderos y establos). @es
definition: Farming equipment and production facilities (including irrigation systems, greenhouses and stables).
definition: Équipement et installations de production agricoles (y compris les systèmes d''irrigation, les serres et les étables). @fr
notation: SDN:P22::22
note: accepted
preferred label: Instalaciones agrícolas y de acuicultura @es
preferred label: Instalações agrícolas e aquícolas @pt
preferred label: Installations agricoles et aquacoles @fr
top concept of: INSPIRE themes

Population distribution - demography
date: 2009-07-30 13:25:19.0
in dataset: void
type: Concept
deprecated: false
version info: 1
broader: Population
definition: Distribución geográfica de la población referidas a una cuadrícula, región, unidad administrativa u otro tipo de unidad analítica, incluyendo las características de la población y sus niveles de actividad. @es
definition: Distribuição geográfica da população, incluindo características demográficas e níveis de actividade, agregada por quadrícula, região, unidade administrativa ou outra unidade analítica. @pt
definition: Geographical distribution of people, including population characteristics and activity levels, aggregated by grid, region, administrative unit or other analytical unit.
definition: Répartition géographique des personnes, avec les caractéristiques de population et les niveaux d''activité, regroupées par grille, région, unité administrative ou autre unité analytique. @fr
narrower: Population
notation: SDN:P22::23
note: accepted
preferred label: Distribución de la población — demografía @es
preferred label: Distribuição da população — demografia @pt
preferred label: Répartition de la population — démographie @fr
top concept of: INSPIRE themes

Area management/restriction/regulation zones and reporting units
date: 2009-07-30 13:25:19.0
in dataset: void
type: Concept
deprecated: false
version info: 1
definition: Areas managed, regulated or used for reporting at international, European, national, regional and local levels. Includes dumping sites, restricted areas around drinking water sources, nitrate-vulnerable zones, regulated fairways at sea or large inland waters, areas for the dumping of waste, noise restriction zones, prospecting and mining permit areas, river basin districts, relevant reporting units and coastal zone management areas.
definition: Zonas geridas, regulamentadas ou utilizadas para a comunicação de dados a nível internacional, europeu, nacional, regional e local. Compreende aterros, zonas de acesso restrito em torno de nascentes de água potável, zonas sensíveis aos nitratos, vias navegáveis regulamentadas no mar ou em águas interiores de grandes dimensões, zonas de descarga de resíduos, zonas de ruído condicionado, zonas autorizadas para efeitos de prospecção e extracção mineira, bacias hidrográficas, unidades de referência pertinentes e zonas abrangidas pela gestão das zonas costeiras. @pt
definition: Zonas gestionadas, reglamentadas o utilizadas para la elaboración de informes para organismos internacionales, europeos, nacionales, regionales y locales. Se incluirán vertederos, zonas restringidas alrededor de lugares de extracción de agua potable, zonas sensibles a los nitratos, rutas marítimas o por grandes vías navegables reglamentadas, zonas de vertido, zonas de restricción de ruidos, zonas de prospección o extracción minera, demarcaciones hidrográficas, las correspondientes unidades de notificación y planes de ordenación de zonas costeras. @es
definition: Zones gérées, réglementées ou utilisées pour les rapports aux niveaux international, européen, national, régional et local. Sont inclus les décharges, les zones restreintes aux alentours des sources d''eau potable, les zones vulnérables aux nitrates, les chenaux réglementés en mer ou les eaux intérieures importantes, les zones destinées à la décharge de déchets, les zones soumises à limitation du bruit, les zones faisant l''objet de permis d''exploration et d''extraction minière, les districts hydrographiques, les unités correspondantes utilisées pour les rapports et les zones de gestion du littoral. @fr
notation: SDN:P22::24
note: accepted
preferred label: Zonas de gestão/restrição/regulamentação e unidades de referência @pt
preferred label: Zonas sujetas a ordenación, a restricciones o reglamentaciones y unidades de notificación @es
preferred label: Zones de gestion, de restriction ou de réglementation et unités de déclaration @fr
top concept of: INSPIRE themes

Natural risk zones
date: 2009-07-30 13:25:19.0
in dataset: void
type: Concept
deprecated: false
version info: 1
definition: Vulnerable areas characterised according to natural hazards (all atmospheric, hydrologic, seismic, volcanic and wildfire phenomena that, because of their location, severity, and frequency, have the potential to seriously affect society), e.g. floods, landslides and subsidence, avalanches, forest fires, earthquakes, volcanic eruptions.
definition: Zonas sensíveis, caracterizadas de acordo com os riscos naturais (todos os fenómenos atmosféricos, hidrológicos, sísmicos, vulcânicos e os incêndios que, pela sua localização, gravidade e frequência, possam afectar gravemente a sociedade), como sejam inundações, deslizamentos de terras e subsidências, avalanches, incêndios florestais, sismos, erupções vulcânicas. @pt
definition: Zonas vulnerables caracterizadas por la existencia de riesgos de carácter natural (cualquier fenómeno atmosférico, hidrológico, sísmico, volcánico o incendio natural que, debido a su localización, gravedad o frecuencia, pueda afectar negativamente a la población), p. ej., inundaciones, corrimientos de tierra y hundimientos, aludes, incendios forestales, terremotos, erupciones volcánicas. @es
definition: Zones sensibles caractérisées en fonction des risques naturels (tous les phénomènes atmosphériques, hydrologiques, sismiques, volcaniques, ainsi que les feux de friche qui peuvent, en raison de leur situation, de leur gravité et de leur fréquence, nuire gravement à la société), tels qu''inondations, glissements et affaissements de terrain, avalanches, incendies de forêts, tremblements de terre et éruptions volcaniques. @fr
narrower: PASR
notation: SDN:P22::25
note: accepted
preferred label: Zonas de riesgos naturales @es
preferred label: Zonas de risco natural @pt
preferred label: Zones à risque naturel @fr
top concept of: INSPIRE themes

Atmospheric conditions
date: 2009-07-30 13:25:19.0
in dataset: void
type: Concept
deprecated: false
version info: 1
definition: Condiciones físicas de la atmósfera. Se incluirán datos espaciales basados en mediciones, modelos o en una combinación de ambos, así como los lugares de medición. @es
definition: Conditions physiques dans l''atmosphère. Comprend les données géographiques fondées sur des mesures, sur des modèles ou sur une combinaison des deux, ainsi que les lieux de mesure. @fr
definition: Condições físicas da atmosfera. Inclui dados geográficos baseados em medições, em modelos ou numa combinação de ambos, bem como os sítios de medição. @pt
definition: Physical conditions in the atmosphere. Includes spatial data based on measurements, on models or on a combination thereof and includes measurement locations.
narrower: AALK
narrower: AAMN
narrower: ACO2
narrower: AEYN
narrower: AORG
narrower: ATDP
narrower: ATEM
narrower: ATPC
narrower: ATVS
narrower: CAPH
narrower: CDTA
narrower: CHUM
narrower: CSLR
narrower: CXAA
narrower: FDMS
narrower: GP048
narrower: GP050
narrower: HFLX
narrower: HLAT
narrower: ISAT
narrower: LWRD
narrower: MTAT
narrower: OCAA
narrower: OHAT
narrower: OPBS
narrower: OZON
narrower: PHAT
narrower: RBSC
narrower: SIAT
narrower: SUAT
narrower: UVRD
narrower: VSRA
notation: SDN:P22::26
note: accepted
preferred label: Condiciones atmosféricas @es
preferred label: Conditions atmosphériques @fr
preferred label: Condições atmosféricas @pt
top concept of: INSPIRE themes

Meteorological geographical features
date: 2009-07-30 13:25:19.0
in dataset: void
type: Concept
deprecated: false
version info: 1
definition: Condiciones meteorológicas y sus mediciones; precipitaciones, temperaturas, evapotranspiración, velocidad y dirección del viento. @es
definition: Conditions météorologiques et leur mesure: précipitations, température, évapotranspiration, vitesse et direction du vent. @fr
definition: Condições atmosféricas e sua medição; precipitação, temperatura, evapotranspiração, velocidade e direcção do vento. @pt
definition: Weather conditions and their measurements; precipitation, temperature, evapotranspiration, wind speed and direction.
narrower: Climate
narrower: CHEX
narrower: CLTY
narrower: CPRP
narrower: EWSB
narrower: LSST
narrower: OMET
narrower: RWCH
narrower: WSTR
notation: SDN:P22::27
note: accepted
preferred label: Aspectos geográficos de carácter meteorológico @es
preferred label: Características geometeorológicas @pt
preferred label: Caractéristiques géographiques météorologiques @fr
related: ICHM
related: IPHY
top concept of: INSPIRE themes

Características oceanográficas
date: 2009-07-30 13:25:19.0
in dataset: void
type: Concept
deprecated: false
version info: 1
broader: Oceanography
definition: Condiciones físicas de los océanos (corrientes, salinidad, altura del oleaje, etc.). @es
definition: Conditions physiques des océans (courants, salinité, hauteur des vagues, etc.). @fr
definition: Condições físicas dos oceanos (correntes, salinidade, altura das ondas, etc.). @pt
definition: Physical conditions of oceans (currents, salinity, wave heights, etc.).
narrower: OceanCharacteristics
narrower: SeaLevelPosition
narrower: WavesAndTides
narrower: A01X
narrower: AAFX
narrower: AAWC
narrower: ABAG
narrower: ALKY
narrower: AMON
narrower: AMOX
narrower: AMUP
narrower: AQYN
narrower: ASAM
narrower: ATDP
narrower: ATPX
narrower: ATTN
narrower: AXFX
narrower: BEST
narrower: BLUM
narrower: CAKN
narrower: CARO
narrower: CBFX
narrower: CBSP
narrower: CDRU
narrower: CING
narrower: CLXX
narrower: CMFL
narrower: CNDC
narrower: COCC
narrower: CORG
narrower: CPWC
narrower: CSDE
narrower: DAAW
narrower: DALK
narrower: DCMX
narrower: DENS
narrower: DMST
narrower: DOCC
narrower: DOCU
narrower: DOXY
narrower: DSCO
narrower: EPSI
narrower: EXCO
narrower: EXCR
narrower: EXUV
narrower: F001
narrower: FDMS
narrower: FPFX
narrower: FPRT
narrower: FR11
narrower: FVLT
narrower: GOXP
narrower: GPIG
narrower: GWDR
narrower: HEAV
narrower: HEXC
narrower: HFLX
narrower: HLDE
narrower: HLWC
narrower: HMSB
narrower: IPRX
narrower: KRTS
narrower: LERR
narrower: LGCR
narrower: LRZA
narrower: LVLT
narrower: MDSV
narrower: MDWD
narrower: MDWP
narrower: MLFX

Sea regions
date: 2009-07-30 13:25:19.0
in dataset: void
type: Concept
deprecated: false
version info: 1
definition: Condiciones físicas de los mares y masas de aguas salinas, por regiones y subregiones con características comunes. @es
definition: Conditions physiques des mers et des masses d''eau salée divisées en régions et en sous-régions à caractéristiques communes. @fr
definition: Condições físicas dos mares e massas de água salinas divididas em regiões e sub-regiões com características comuns. @pt
definition: Physical conditions of seas and saline water bodies divided into regions and sub-regions with common characteristics.
narrower: GP087
narrower: WCTR
notation: SDN:P22::29
note: accepted
preferred label: Regiones marinas @es
preferred label: Regiões marinhas @pt
preferred label: Régions maritimes @fr
top concept of: INSPIRE themes

Bio-geographical regions
date: 2009-07-30 13:25:19.0
in dataset: void
type: Concept
deprecated: false
version info: 1
definition: Areas of relatively homogeneous ecological conditions with common characteristics.
definition: Zonas de condições ecológicas relativamente homogéneas com características comuns. @pt
definition: Zonas dotadas de condiciones ecológicas relativamente homogéneas con unas características comunes. @es
definition: Zones présentant des conditions écologiques relativement homogènes avec des caractéristiques communes. @fr
notation: SDN:P22::30
note: accepted
preferred label: Regiones biogeográficas @es
preferred label: Regiões biogeográficas @pt
preferred label: Régions biogéographiques @fr
top concept of: INSPIRE themes

Habitats and biotopes
date: 2009-07-30 13:25:19.0
in dataset: void
type: Concept
deprecated: false
version info: 1
definition: Geographical areas characterised by specific ecological conditions, processes, structure, and (life support) functions that physically support the organisms that live there. Includes terrestrial and aquatic areas distinguished by geographical, abiotic and biotic features, whether entirely natural or semi-natural.
definition: Zonas geográficas caracterizadas por condições ecológicas, processos, estrutura e funções (de apoio às necessidades básicas) específicos que constituem o suporte físico dos organismos que nelas vivem. Inclui zonas terrestres e aquáticas, naturais ou semi-naturais, diferenciadas pelas suas características geográficas, abióticas e bióticas. @pt
definition: Zonas geográficas caracterizadas por unas condiciones ecológicas específicas, procesos, estructuras y funciones de apoyo vital que sean soporte físico de los organismos que viven en ellas. Se incluirán zonas terrestres y acuáticas diferenciadas por sus características geográficas, abióticas y bióticas, tanto si son enteramente naturales como seminaturales. @es
definition: Zones géographiques ayant des caractéristiques écologiques particulières — conditions, processus, structures et fonctions (de maintien de la vie) — favorables aux organismes qui y vivent. Sont incluses les zones terrestres et aquatiques qui se distinguent par leurs caractéristiques géographiques, abiotiques ou biotiques, qu''elles soient naturelles ou semi-naturelles. @fr
narrower: HBCH
narrower: HBEX
notation: SDN:P22::31
note: accepted
preferred label: Habitats e biótopos @pt
preferred label: Habitats et biotopes @fr
preferred label: Hábitats y biotopos @es
top concept of: INSPIRE themes

Distribución de las especies
date: 2009-07-30 13:25:19.0
in dataset: void
type: Concept
deprecated: false
version info: 1
definition: Distribución geográfica de las especies animales y vegetales referidas a una cuadrícula, región, unidad administrativa u otro tipo de unidad analítica. @es
definition: Distribuição geográfica da ocorrência de espécies animais e vegetais agregadas por quadrícula, região, unidade administrativa ou outra unidade analítica. @pt
definition: Geographical distribution of occurrence of animal and plant species aggregated by grid, region, administrative unit or other analytical unit.
definition: Répartition géographique de l''occurrence des espèces animales et végétales regroupées par grille, région, unité administrative ou autre unité analytique. @fr
narrower: A999
narrower: AATX
narrower: ACNT
narrower: BATC
narrower: BATT
narrower: BATX
narrower: BAUC
narrower: BCOS
narrower: BDRV
narrower: BDWC
narrower: BLEN
narrower: BNTC
narrower: BNTX
narrower: BNUC
narrower: BPBP
narrower: BRDA
narrower: BRDD
narrower: CATX
narrower: CBCC
narrower: CEBH
narrower: CEMO
narrower: CEMP
narrower: CETA
narrower: CNTX
narrower: CYEU
narrower: D000
narrower: DVLP
narrower: FABD
narrower: FATM
narrower: FATX
narrower: FBAB
narrower: FBAF
narrower: FCNT
narrower: FCRT
narrower: FCST
narrower: FIBM
narrower: FNTM
narrower: FNTX
narrower: FOCA
narrower: GP004
narrower: GP005
narrower: GP012
narrower: GP018
narrower: GP025
narrower: GP067
narrower: GP068
narrower: GP069
narrower: GP079
narrower: GP080
narrower: GP085
narrower: GP088
narrower: GREF
narrower: GRZO
narrower: IALZ
narrower: IATC
narrower: IATX
narrower: INLZ
narrower: IRBO
narrower: IWAB
narrower: IWDX
narrower: LIBI
narrower: MATC
narrower: MATX
narrower: MEPH
narrower: MFAB
narrower: MFAZ
narrower: MFLZ
narrower: MFWW
narrower: MSBD
narrower: MSBO
narrower: MSEP

Energy resources
date: 2009-07-30 13:25:19.0
in dataset: void
type: Concept
deprecated: false
version info: 1
definition: Energy resources including hydrocarbons, hydropower, bio-energy, solar, wind, etc., where relevant including depth/height information on the extent of the resource.
definition: Recursos energéticos, incluindo os de hidrocarbonetos, hidroeléctricos, de bio-energias, de energia solar, eólica, etc., incluindo, quando pertinente, informação sobre as cotas de profundidade/altura do recurso. @pt
definition: Recursos energéticos: hidrocarburos, energía hidroeléctrica, bioenergía, energía solar y eólica, etc., incluyendo, cuando proceda, la información de profundidad y altura del volumen de los recursos. @es
definition: Sources d''énergie comprenant les hydrocarbures, l''énergie hydraulique, la bioénergie, l''énergie solaire, l''énergie éolienne, etc., le cas échéant accompagnées d''informations relatives à la profondeur/la hauteur de la source. @fr
narrower: CSLR
notation: SDN:P22::33
note: accepted
preferred label: Recursos energéticos @es
preferred label: Sources d''énergie @fr
top concept of: INSPIRE themes

Mineral resources
date: 2009-07-30 13:25:19.0
in dataset: void
type: Concept
deprecated: false
version info: 1
definition: Mineral resources including metal ores, industrial minerals, etc., where relevant including depth/height information on the extent of the resource.
definition: Recursos minerais, incluindo minérios metálicos, minerais industriais, etc., incluindo, quando pertinente, informação sobre as cotas de profundidade/altura do recurso. @pt
definition: Recursos minerales: minerales metalíferos, minerales industriales, etc., incluyendo, cuando proceda, la información de profundidad y altura del volumen de los recursos. @es
definition: Ressources minérales comprenant les minerais métalliques, les minéraux industriels, etc., le cas échéant accompagnées d''informations relatives à la profondeur/la hauteur de la ressource. @fr
notation: SDN:P22::34
note: accepted
preferred label: Recursos minerais @pt
preferred label: Recursos minerales @es
preferred label: Ressources minérales @fr
related: RMIN
top concept of: INSPIRE themes

INSPIRE themes
alternative: INSPIRE themes
creator: European Commission
date: 2012-11-06 02:00:10.0
description: Groupings of spatial data according to Annex I, II and III of the INSPIRE Directive [DS-D2.5] presented as a SKOS Concept Scheme to support the NETMAR semantic search client.
publisher: Natural Environment Research Council
type: ConceptScheme
version info: 2
has top concept: Coordinate reference systems
has top concept: Elevation
has top concept: Land cover
has top concept: Orthoimagery
has top concept: Geologia
has top concept: Statistical units
has top concept: Buildings
has top concept: Administrative units
has top concept: Protected sites
has top concept: Geographical names
has top concept: Soil
has top concept: Addresses
has top concept: Cadastral parcels
has top concept: Transport networks
has top concept: Hydrography
has top concept: Land use
has top concept: Human health and safety
has top concept: Utility and government services
has top concept: Geographical grid systems
has top concept: Environmental monitoring facilities
has top concept: Production and industrial facilities
has top concept: Agriculture and aquaculture facilities
has top concept: Population distribution - demography
has top concept: Area management/restriction/regulation zones and reporting units
has top concept: Natural risk zones
has top concept: Atmospheric conditions
has top concept: Meteorological geographical features
has top concept: Características oceanográficas
has top concept: Sea regions
has top concept: Bio-geographical regions
has top concept: Habitats and biotopes
has top concept: Distribución de las especies
has top concept: Energy resources
has top concept: Mineral resources