Production and industrial facilities
preferred label: Instalações industriais e de produção @pt
in dataset: void
type: Concept
definition: Centros de producción industrial, incluidas las instalaciones contempladas en la Directiva 96/61/CE del Consejo, de 24 de septiembre de 1996, sobre la prevención y el control integrado de la contaminación (1), e instalaciones de extracción de agua, instalaciones mineras, centros de almacenamiento. @es
definition: Sites de production industrielle, y compris les installations couvertes par la directive 96/61/CE du Conseil du 24 septembre 1996 relative à la prévention et à la réduction intégrées de la pollution (1) et les installations de captage d''eau, d''extraction minière et de stockage. @fr
type: Thing
note: accepted
narrower: ShippingPorts
preferred label: Instalaciones de producción e industriales @es
preferred label: Lieux de production et sites industriels @fr
top concept of: INSPIRE themes
notation: SDN:P22::21
definition: Locais de produção industrial, incluindo instalações abrangidas pela Directiva 96/61/CE do Conselho, de 24 de Setembro de 1996, relativa à prevenção e controlo integrados da poluição (1), e instalações de captação de água, minas, locais de armazenagem. @pt
date: 2009-07-30 13:25:19.0
definition: Industrial production sites, including installations covered by Council Directive 96/61/EC of 24 September 1996 concerning integrated pollution prevention and control (1) and water abstraction facilities, mining, storage sites.
version info: 1
deprecated: false

Human health and safety
narrower: CoastalDefenceStructures
top concept of: INSPIRE themes
narrower: PPWC
narrower: BCOC
narrower: PHWB
definition: Répartition géographique des pathologies dominantes (allergies, cancers, maladies respiratoires, etc.) liées directement (pollution de l''air, produits chimiques, appauvrissement de la couche d''ozone, bruit, etc.) ou indirectement (alimentation, organismes génétiquement modifiés, etc.) à la qualité de l''environnement, et ensemble des informations relatif à l''effet de celle-ci sur la santé des hommes (marqueurs biologiques, déclin de la fertilité, épidémies) ou leur bienêtre (fatigue, stress, etc.). @fr
definition: Geographical distribution of dominance of pathologies (allergies, cancers, respiratory diseases, etc.), information indicating the effect on health (biomarkers, decline of fertility, epidemics) or well-being of humans (fatigue, stress, etc.) linked directly (air pollution, chemicals, depletion of the ozone layer, noise, etc.) or indirectly (food, genetically modified organisms, etc.) to the quality of the environment.
narrower: CoastalErosion
narrower: LITT
narrower: OMPW
narrower: PEBI
type: Concept
notation: SDN:P22::18
narrower: BCAH
definition: Distribuição geográfica da dominância de patologias (alergias, cancros, doenças respiratórias, etc.), informações que indiquem o efeito da qualidade do ambiente sobre a saúde (biomarcadores, declínio da fertilidade, epidemias) ou sobre o bem-estar dos seres humanos (fadiga, tensão, stress, etc.) de forma directa (poluição do ar, produtos químicos, empobrecimento da camada de ozono, ruído, etc.) ou indirecta (alimentação, organismos geneticamente modificados, etc.). @pt
narrower: BABI
preferred label: Salud y seguridad humanas @es
narrower: BRAD
narrower: GP010
narrower: HZNV
narrower: SPCB
narrower: GP050
narrower: GP048
narrower: IDIS
note: accepted
type: Thing
narrower: PTOX
narrower: BCMT
narrower: PEWB
date: 2009-07-30 13:25:19.0
preferred label: Santé et sécurité des personnes @fr
narrower: MDBO
narrower: PESD
narrower: PHBI
narrower: WaterQuality
narrower: OMWC
narrower: Flooding
preferred label: Saúde humana e segurança @pt
narrower: PHSE
narrower: PPCB
definition: Distribución geográfica de la dominancia de patologías (alergias, cáncer, enfermedades respiratorias, etc.), la información que indique el efecto sobre la salud (marcadores biológicos, declive de la fertilidad, epidemias) o el bienestar humanos (cansancio, estrés, etc.) directamente vinculada con la calidad del medio ambiente (contaminación del aire, productos químicos, enrarecimiento de la capa de ozono, ruido, etc.) o indirectamente vinculada con dicha calidad (alimentos, organismos modificados genéticamente, etc.). @es
narrower: BCPB
narrower: GP001
narrower: OMBI
in dataset: void
version info: 1
deprecated: false

Buildings
note: accepted
definition: Situation géographique des bâtiments. @fr
narrower: MMST
preferred label: Edifícios @pt
top concept of: INSPIRE themes
definition: Geographical location of buildings.
preferred label: Edificios @es
type: Thing
date: 2009-07-30 13:25:19.0
definition: Localização geográfica dos edifícios. @pt
definition: Localización geográfica de los edificios. @es
type: Concept
preferred label: Bâtiments @fr
in dataset: void
notation: SDN:P22::15
deprecated: false
version info: 1

Transport networks
definition: Réseaux routier, ferroviaire, aérien et navigable ainsi que les infrastructures associées. Sont également incluses les correspondances entre les différents réseaux, ainsi que le réseau transeuropéen de transport tel que défini dans la décision no 1692/96/CE du Parlement européen et du Conseil du 23 juillet 1996 sur les orientations communautaires pour le développement du réseau transeuropéen de transport (1) et les révisions futures de cette décision. @fr
narrower: MarineTransport
definition: Redes de carreteras, ferrocarril, transporte aéreo y vías navegables, con sus correspondientes infraestructuras. Se incluirán las conexiones entre redes diferentes. Se incluirá también la red transeuropea de transporte, según la definición de la Decisión no 1692/96/CE del Parlamento Europeo y del Consejo, de 23 de julio de 1996, sobre las orientaciones comunitarias para el desarrollo de la red transeuropea de transporte (1), y de las futuras revisiones de dicha Decisión. @es
notation: SDN:P22::162
definition: Redes de transporte rodoviário, ferroviário, aéreo e por via navegável, e respectivas infra-estruturas. Inclui as ligações entre as diferentes redes. Inclui também a rede transeuropeia de transportes definida na Decisão n.o 1692/96/CE do Parlamento Europeu e do Conselho, de 23 de Julho de 1996, sobre as orientações comunitárias para o desenvolvimento da rede transeuropeia de transportes (1), e as futuras revisões dessa decisão. @pt
preferred label: Réseaux de transport @fr
narrower: Access
narrower: TRAN
preferred label: Redes de transporte @pt
narrower: LandTransport
type: Thing
top concept of: INSPIRE themes
definition: Road, rail, air and water transport networks and related infrastructure. Includes links between different networks. Also includes the trans-European transport network as defined in Decision No 1692/96/EC of the European Parliament and of the Council of 23 July 1996 on Community Guidelines for the development of the trans-European transport network (1) and future revisions of that Decision. (1) OJ L 228, 9.9.1996, p. 1. Decision as last amended by Council Regulation (EC) No 1791/2006 (OJ L 363, 20.12.2006, p. 1).
type: Concept
in dataset: void
narrower: Shipping
date: 2009-07-30 13:25:19.0
note: accepted
deprecated: false
version info: 1

Orthoimagery
definition: Geo-referenced image data of the Earth's surface, from either satellite or airborne sensors.
type: Concept
definition: Imagens georeferenciadas da superfície terrestre recolhidas por satélite ou sensores aéreos. @pt
narrower: COAS
date: 2009-07-30 13:25:19.0
in dataset: void
note: accepted
narrower: R410
top concept of: INSPIRE themes
preferred label: Ortho-imagerie @fr
definition: Images géoréférencées de la surface terrestre, provenant de satellites ou de capteurs aéroportés. @fr
narrower: AerialImages
narrower: SatelliteImagery
notation: SDN:P22::12
preferred label: Ortoimagens @pt
preferred label: Ortoimágenes @es
definition: Imágenes georreferenciadas de la superficie de la tierra, obtenidas por satélite o por sensores aerotransportados. @es
broader: Imagery
type: Thing
deprecated: false
version info: 1

Geographical names
type: Concept
preferred label: Dénominations géographiques @fr
definition: Denominações das zonas, regiões, localidades, cidades, subúrbios, pequenas cidades ou povoações, ou de qualquer entidade geográfica ou topográfica de interesse público ou histórico. @pt
notation: SDN:P22::159
top concept of: INSPIRE themes
note: accepted
definition: Nombres de zonas, regiones, localidades, ciudades, periferias, poblaciones o asentamientos, o cualquier rasgo geográfico o topográfico de interés público o histórico. @es
preferred label: Nombres geográficos @es
in dataset: void
date: 2009-07-30 13:25:19.0
preferred label: Toponímia @pt
type: Thing
definition: Names of areas, regions, localities, cities, suburbs, towns or settlements, or any geographical or topographical feature of public or historical interest.
definition: Noms de zones, de régions, de localités, de grandes villes, de banlieues, de villes moyennes ou d''implantations, ou tout autre élément géographique ou topographique d''intérêt public ou historique. @fr
deprecated: false
version info: 1

Administrative units
type: Concept
definition: Unidades administrativas en que se dividan las áreas en las que los Estados miembros tienen y/o ejercen derechos jurisdiccionales, a efectos de administración local, regional y nacional, separadas por límites administrativos. @es
definition: Unidades administrativas, zonas de divisão sobre as quais os Estados-Membros possuam e/ou exerçam direitos jurisdicionais, para efeitos de governação local, regional e nacional, separadas por fronteiras administrativas. @pt
preferred label: Unités administratives @fr
definition: Unités d''administration séparées par des limites administratives et délimitant les zones dans lesquelles les États membres détiennent et/ou exercent leurs compétences, aux fins de l''administration locale, régionale et nationale. @fr
in dataset: void
type: Thing
preferred label: Unidades administrativas @pt
note: accepted
narrower: AdministrativeBoundaries
date: 2009-07-30 13:25:19.0
notation: SDN:P22::156
top concept of: INSPIRE themes
definition: Units of administration, dividing areas where Member States have and/or exercise jurisdictional rights, for local, regional and national governance, separated by administrative boundaries.
deprecated: false
version info: 1

Distribuição das espécies
narrower: PCFX
narrower: BNTX
narrower: GP088
narrower: SABB
narrower: GP067
narrower: PATX
in dataset: void
preferred label: Répartition des espèces @fr
narrower: TBGZ
narrower: BAUC
narrower: BRDD
narrower: FIBM
narrower: BATX
narrower: FCNT
narrower: GP068
narrower: D000
narrower: CEMO
narrower: ZV00
narrower: IRBO
narrower: PYTT
narrower: VIRU
narrower: GP025
narrower: MSBD
related: SATM
definition: Distribuição geográfica da ocorrência de espécies animais e vegetais agregadas por quadrícula, região, unidade administrativa ou outra unidade analítica. @pt
narrower: FNTX
narrower: MSBO
narrower: IATX
narrower: GP080
narrower: FCRT
narrower: CEBH
narrower: ZADX
narrower: ZCTC
narrower: IWAB
narrower: BRDA
related: FREP
narrower: MATC
narrower: BDRV
narrower: IWDX
narrower: CETA
top concept of: INSPIRE themes
narrower: FOCA
narrower: RBHY
narrower: MATX
definition: Répartition géographique de l''occurrence des espèces animales et végétales regroupées par grille, région, unité administrative ou autre unité analytique. @fr
narrower: VATX
narrower: BCOS
narrower: GP012
narrower: BNUC
narrower: BNTC
narrower: PU02
date: 2009-07-30 13:25:19.0
narrower: GREF
narrower: GP079
narrower: FCST
narrower: ZNTP
narrower: MZBC
narrower: FABD
narrower: ZOOB
narrower: GP069
narrower: CEMP
narrower: PNFX
type: Concept
narrower: LIBI
related: SREP
narrower: ZWTX
narrower: PHYG
narrower: ZNTN
narrower: MZCT
narrower: PNTX
narrower: FBAF
narrower: MFAB
narrower: GP004
narrower: BPBP
narrower: BATC
narrower: ZATX
narrower: ACNT
narrower: SEMO
narrower: ZCTN

Geographical grid systems
note: accepted
notation: SDN:P22::2
definition: Quadrícula harmonizada multi-resolução com um ponto de origem comum e localização e dimensão normalizadas das células. @pt
preferred label: Sistemas de quadrículas geográficas @pt
date: 2009-07-30 13:25:19.0
type: Concept
top concept of: INSPIRE themes
definition: Cuadrículas armonizadas multirresolución con un punto de origen común y con ubicación y tamaños de cuadrícula normalizados. @es
preferred label: Sistema de cuadrículas geográficas @es
type: Thing
narrower: ALAT
preferred label: Systèmes de maillage géographique @fr
in dataset: void
definition: Grille multi-résolution harmonisée avec un point d''origine commun et une localisation ainsi qu''une taille des cellules harmonisées. @fr
definition: Harmonised multi-resolution grid with a common point of origin and standardised location and size of grid cells.
version info: 1
deprecated: false

Sea regions
preferred label: Regiões marinhas @pt
notation: SDN:P22::29
note: accepted
definition: Condições físicas dos mares e massas de água salinas divididas em regiões e sub-regiões com características comuns. @pt
preferred label: Regiones marinas @es
type: Concept
date: 2009-07-30 13:25:19.0
preferred label: Régions maritimes @fr
type: Thing
top concept of: INSPIRE themes
definition: Physical conditions of seas and saline water bodies divided into regions and sub-regions with common characteristics.
definition: Condiciones físicas de los mares y masas de aguas salinas, por regiones y subregiones con características comunes. @es
in dataset: void
narrower: GP087
definition: Conditions physiques des mers et des masses d''eau salée divisées en régions et en sous-régions à caractéristiques communes. @fr
narrower: WCTR
deprecated: false
version info: 1

Atmospheric conditions
in dataset: void
type: Thing
definition: Condições físicas da atmosfera. Inclui dados geográficos baseados em medições, em modelos ou numa combinação de ambos, bem como os sítios de medição. @pt
note: accepted
narrower: GP050
preferred label: Condições atmosféricas @pt
narrower: CXAA
narrower: VSRA
narrower: SIAT
date: 2009-07-30 13:25:19.0
narrower: OZON
narrower: SUAT
narrower: ATEM
narrower: GP048
preferred label: Conditions atmosphériques @fr
narrower: ACO2
narrower: AALK
narrower: CSLR
narrower: ATDP
definition: Conditions physiques dans l''atmosphère. Comprend les données géographiques fondées sur des mesures, sur des modèles ou sur une combinaison des deux, ainsi que les lieux de mesure. @fr
top concept of: INSPIRE themes
narrower: OHAT
definition: Condiciones físicas de la atmósfera. Se incluirán datos espaciales basados en mediciones, modelos o en una combinación de ambos, así como los lugares de medición. @es
notation: SDN:P22::26
narrower: AAMN
narrower: ATVS
narrower: ATPC
narrower: LWRD
narrower: AEYN
narrower: PHAT
narrower: FDMS
narrower: HLAT
definition: Physical conditions in the atmosphere. Includes spatial data based on measurements, on models or on a combination thereof and includes measurement locations.
type: Concept
narrower: OCAA
narrower: CHUM
narrower: UVRD
narrower: MTAT
narrower: RBSC
narrower: OPBS
narrower: ISAT
narrower: CDTA
narrower: CAPH
preferred label: Condiciones atmosféricas @es
narrower: HFLX
narrower: AORG
deprecated: false
version info: 1

Population distribution - demography
type: Concept
type: Thing
definition: Distribuição geográfica da população, incluindo características demográficas e níveis de actividade, agregada por quadrícula, região, unidade administrativa ou outra unidade analítica. @pt
notation: SDN:P22::23
definition: Distribución geográfica de la población referidas a una cuadrícula, región, unidad administrativa u otro tipo de unidad analítica, incluyendo las características de la población y sus niveles de actividad. @es
definition: Répartition géographique des personnes, avec les caractéristiques de population et les niveaux d''activité, regroupées par grille, région, unité administrative ou autre unité analytique. @fr
in dataset: void
definition: Geographical distribution of people, including population characteristics and activity levels, aggregated by grid, region, administrative unit or other analytical unit.
broader: Population
preferred label: Répartition de la population — démographie @fr
note: accepted
preferred label: Distribución de la población — demografía @es
narrower: Population
date: 2009-07-30 13:25:19.0
preferred label: Distribuição da população — demografia @pt
top concept of: INSPIRE themes
version info: 1
deprecated: false

Environmental monitoring facilities
narrower: NutrientSampleSites
type: Concept
definition: Location and operation of environmental monitoring facilities includes observation and measurement of emissions, of the state of environmental media and of other ecosystem parameters (biodiversity, ecological conditions of vegetation, etc.) by or on behalf of public authorities.
definition: La situation et le fonctionnement des installations de suivi environnemental comprennent l''observation et la mesure des émissions, de l''état du milieu environnemental et d''autres paramètres de l''écosystème (biodiversité, conditions écologiques de la végétation, etc.) par les autorités publiques ou pour leur compte. @fr
preferred label: Instalaciones de observación del medio ambiente @es
definition: La ubicación y funcionamiento de instalaciones de observación del medio ambiente, encargadas de observar y medir emisiones, el estado del medio ambiente y otros parámetros del ecosistema (biodiversidad, condiciones ecológicas de la vegetación, etc.), por parte de las autoridades públicas o en nombre de ellas. @es
narrower: CFTM
preferred label: Installations de suivi environnemental @fr
narrower: CoastalMonitoring
notation: SDN:P22::20
note: accepted
top concept of: INSPIRE themes
definition: A localização e funcionamento de instalações de monitorização do ambiente inclui a observação e medição de emissões, do estado das diferentes componentes ambientais e de outros parâmetros dos ecossistemas (biodiversidade, condições ecológicas da vegetação, etc.) pelas autoridades públicas ou por conta destas. @pt
type: Thing
in dataset: void
date: 2009-07-30 13:25:19.0
preferred label: Instalações de monitorização do ambiente @pt
version info: 1
deprecated: false

Land use
type: Thing
definition: Territoire caractérisé selon sa dimension fonctionnelle prévue ou son objet socioéconomique actuel et futur (par exemple, résidentiel, industriel, commercial, agricole, forestier, récréatif). @fr
preferred label: Usage des sols @fr
preferred label: Uso do solo @pt
definition: Territory characterised according to its current and future planned functional dimension or socio-economic purpose (e.g. residential, industrial, commercial, agricultural, forestry, recreational).
narrower: IACT
top concept of: INSPIRE themes
broader: LandUse
narrower: LandUse
type: Concept
definition: Caracterização do território de acordo com a dimensão funcional ou finalidade socioeconómica planeada, presente e futura (por exemplo, residencial, industrial, comercial, agrícola, silvícola, recreativa). @pt
narrower: MLES
date: 2009-07-30 13:25:19.0
notation: SDN:P22::17
definition: Caracterización del territorio, de acuerdo con su dimensión funcional o su dedicación socioeconómica actual o futura planificadas (por ejemplo, residencial, industrial, comercial, agrario, forestal, recreativo). @es
related: Administrative units
preferred label: Uso del suelo @es
note: accepted
in dataset: void
deprecated: false
version info: 1

Statistical units
notation: SDN:P22::14
in dataset: void
type: Thing
preferred label: Unidades estadísticas @es
preferred label: Unidades estatísticas @pt
definition: Unidades para la difusión o el uso de información estadística. @es
preferred label: Unités statistiques @fr
date: 2009-07-30 13:25:19.0
type: Concept
definition: Units for dissemination or use of statistical information.
definition: Unidades para fins de divulgação ou utilização da informação estatística. @pt
note: accepted
definition: Unités de diffusion ou d''utilisation d''autres informations statistiques. @fr
top concept of: INSPIRE themes
deprecated: false
version info: 1

Cadastral parcels
notation: SDN:P22::161
in dataset: void
definition: areas defined by cadastral registers or equivalent.
type: Concept
date: 2009-07-30 13:25:19.0
type: Thing
note: accepted
preferred label: Parcelas catastrales @es
definition: Áreas determinadas por registros catastrales o equivalentes. @es
definition: Zones définies par les registres cadastraux ou équivalents. @fr
definition: Áreas definidas por registos cadastrais ou equivalentes. @pt
top concept of: INSPIRE themes
preferred label: Parcelas cadastrais @pt
preferred label: Parcelles cadastrales @fr
deprecated: false
version info: 1

Land cover
definition: Cobertura física e biológica da superfície terrestre, incluindo superfícies artificiais, zonas agrícolas, florestas, zonas naturais ou semi-naturais, zonas húmidas, massas de água. @pt
notation: SDN:P22::11
preferred label: Cubierta terrestre @es
narrower: SSCN
definition: Couverture physique et biologique de la surface terrestre, y compris les surfaces artificielles, les zones agricoles, les forêts, les zones (semi-)naturelles, les zones humides et les masses d''eau. @fr
narrower: SBPH
definition: Cubierta física y biológica de la superficie de la tierra, incluidas las superficies artificiales, las zonas agrarias, los bosques, las zonas naturales o seminaturales, los humedales, las láminas de agua. @es
in dataset: void
note: accepted
preferred label: Ocupação do solo @pt
type: Concept
narrower: CRYS
date: 2009-07-30 13:25:19.0
type: Thing
top concept of: INSPIRE themes
preferred label: Occupation des terres @fr
definition: Physical and biological cover of the earth's surface including artificial surfaces, agricultural areas, forests, (semi-)natural areas, wetlands, water bodies.
narrower: LVEG
version info: 1
deprecated: false

INSPIRE themes
has top concept: Land use
publisher: Natural Environment Research Council
date: 2012-11-06 02:00:10.0
has top concept: Land cover
has top concept: Orthoimagery
has top concept: Natural risk zones
has top concept: Addresses
has top concept: Bio-geographical regions
description: Groupings of spatial data according to Annex I, II and III of the INSPIRE Directive [DS-D2.5] presented as a SKOS Concept Scheme to support the NETMAR semantic search client.
has top concept: Statistical units
creator: European Commission
has top concept: Utility and government services
has top concept: Cadastral parcels
has top concept: Transport networks
has top concept: Distribuição das espécies
has top concept: Production and industrial facilities
has top concept: Coordinate reference systems
has top concept: Buildings
has top concept: Area management/restriction/regulation zones and reporting units
has top concept: Soil
has top concept: Administrative units
has top concept: Mineral resources
has top concept: Geology
alternative: INSPIRE themes
has top concept: Atmospheric conditions
has top concept: Sea regions
has top concept: Human health and safety
has top concept: Environmental monitoring facilities
has top concept: Meteorological geographical features
has top concept: Geographical names
has top concept: Elevation
has top concept: Energy resources
has top concept: Agriculture and aquaculture facilities
has top concept: Population distribution - demography
type: ConceptScheme
has top concept: Caractéristiques géographiques océanographiques
type: Thing
has top concept: Hydrography
has top concept: Habitats and biotopes
has top concept: Geographical grid systems
has top concept: Protected sites
version info: 2

Protected sites
preferred label: Sítios protegidos @pt
definition: Zonas designadas o gestionadas dentro de un marco legislativo internacional, comunitario o propio de los Estados miembros, para la consecución de unos objetivos de conservación específicos. @es
definition: Zonas designadas ou geridas no âmbito de legislação internacional, comunitária ou dos Estados-Membros para a prossecução de objectivos específicos de conservação. @pt
date: 2009-07-30 13:25:19.0
broader: ProtectedAreas
narrower: MARC
in dataset: void
preferred label: Sites protégés @fr
narrower: ProtectedAreas
definition: Zone désignée ou gérée dans un cadre législatif international, communautaire ou national en vue d''atteindre des objectifs spécifiques de conservation. @fr
note: accepted
type: Thing
definition: Area designated or managed within a framework of international, Community and Member States' legislation to achieve specific conservation objectives.
top concept of: INSPIRE themes
preferred label: Lugares protegidos @es
notation: SDN:P22::158
type: Concept
deprecated: false
version info: 1

Mineral resources
definition: Recursos minerales: minerales metalíferos, minerales industriales, etc., incluyendo, cuando proceda, la información de profundidad y altura del volumen de los recursos. @es
type: Concept
definition: Recursos minerais, incluindo minérios metálicos, minerais industriais, etc., incluindo, quando pertinente, informação sobre as cotas de profundidade/altura do recurso. @pt
preferred label: Ressources minérales @fr
type: Thing
preferred label: Recursos minerales @es
top concept of: INSPIRE themes
notation: SDN:P22::34
note: accepted
definition: Ressources minérales comprenant les minerais métalliques, les minéraux industriels, etc., le cas échéant accompagnées d''informations relatives à la profondeur/la hauteur de la ressource. @fr
date: 2009-07-30 13:25:19.0
related: RMIN
definition: Mineral resources including metal ores, industrial minerals, etc., where relevant including depth/height information on the extent of the resource.
in dataset: void
preferred label: Recursos minerais @pt
deprecated: false
version info: 1

Habitats and biotopes
top concept of: INSPIRE themes
preferred label: Hábitats y biotopos @es
date: 2009-07-30 13:25:19.0
preferred label: Habitats et biotopes @fr
definition: Zonas geográficas caracterizadas por condições ecológicas, processos, estrutura e funções (de apoio às necessidades básicas) específicos que constituem o suporte físico dos organismos que nelas vivem. Inclui zonas terrestres e aquáticas, naturais ou semi-naturais, diferenciadas pelas suas características geográficas, abióticas e bióticas. @pt
type: Thing
definition: Zones géographiques ayant des caractéristiques écologiques particulières — conditions, processus, structures et fonctions (de maintien de la vie) — favorables aux organismes qui y vivent. Sont incluses les zones terrestres et aquatiques qui se distinguent par leurs caractéristiques géographiques, abiotiques ou biotiques, qu''elles soient naturelles ou semi-naturelles. @fr
narrower: HBEX
definition: Geographical areas characterised by specific ecological conditions, processes, structure, and (life support) functions that physically support the organisms that live there. Includes terrestrial and aquatic areas distinguished by geographical, abiotic and biotic features, whether entirely natural or semi-natural.
narrower: HBCH
in dataset: void
definition: Zonas geográficas caracterizadas por unas condiciones ecológicas específicas, procesos, estructuras y funciones de apoyo vital que sean soporte físico de los organismos que viven en ellas. Se incluirán zonas terrestres y acuáticas diferenciadas por sus características geográficas, abióticas y bióticas, tanto si son enteramente naturales como seminaturales. @es
type: Concept
note: accepted
preferred label: Habitats e biótopos @pt
notation: SDN:P22::31
version info: 1
deprecated: false

Coordinate reference systems
top concept of: INSPIRE themes
type: Thing
definition: Sistemas para referenciar de forma única a informação geográfica no espaço sob a forma de um conjunto de coordenadas (x, y, z) e/ou latitude e longitude e altitude, com base num datum geodésico horizontal e vertical. @pt
in dataset: void
notation: SDN:P22::1
preferred label: Référentiels de coordonnées @fr
date: 2009-07-30 13:25:19.0
preferred label: Sistemas de coordenadas de referencia @es
narrower: AHGT
note: accepted
definition: Systems for uniquely referencing spatial information in space as a set of coordinates (x, y, z) and/or latitude and longitude and height, based on a geodetic horizontal and vertical datum.
definition: Systèmes de référencement unique des informations géographiques dans l''espace sous forme d''une série de coordonnées (x, y, z) et/ou la latitude et la longitude et l''altitude, en se fondant sur un point géodésique horizontal et vertical. @fr
type: Concept
preferred label: Sistemas de referencia @pt
definition: Sistemas para referenciar de forma unívoca la información espacial en el espacio como una serie de coordenadas (x, y, z) y/o latitud y longitud y altura, basándose en un punto de referencia geodésico horizontal y vertical. @es
deprecated: false
version info: 1

Caractéristiques géographiques océanographiques
narrower: OXYC
narrower: PHUP
narrower: WCTR
narrower: UVRD
narrower: SPGS
type: Thing
narrower: OHWC
narrower: TCFX
narrower: CNDC
narrower: ZNLG
narrower: UPTH
narrower: PCAH
narrower: VSRW
narrower: NTSP
narrower: NUTV
narrower: WVST
narrower: PHYC
narrower: WCPH
narrower: PNFX
narrower: DAAW
narrower: GOXP
narrower: DOXY
narrower: TDIN
narrower: AQYN
narrower: CPWC
narrower: TSED
narrower: OMWC
narrower: LERR
narrower: CBSP
narrower: WVSP
narrower: LVLT
narrower: DMST
narrower: WRAD
date: 2009-07-30 13:25:19.0
narrower: OPCN
narrower: FPRT
narrower: CDRU
narrower: WavesAndTides
narrower: SVEL
narrower: DOCU
narrower: NTOT
narrower: HEXC
narrower: MTWT
narrower: AAFX
narrower: BLUM
narrower: HLDE
narrower: F001
narrower: TNRP
definition: Condiciones físicas de los océanos (corrientes, salinidad, altura del oleaje, etc.). @es
narrower: MDWD
narrower: SIGT
narrower: GPIG
narrower: ATDP
narrower: PHWB
narrower: MXLM
narrower: ASAM
narrower: SXCN
narrower: CBFX
narrower: OPFX
narrower: TDNT
narrower: SACT
narrower: FVLT
narrower: DCMX
narrower: BEST
narrower: TCNT
narrower: A01X
narrower: NOYS
type: Concept
narrower: IPRX
narrower: DSCO
narrower: EPSI
narrower: PXSP
narrower: WCOC
narrower: CMFL
narrower: TPHS
definition: Condições físicas dos oceanos (correntes, salinidade, altura das ondas, etc.). @pt
narrower: TEMP
narrower: PCHW
narrower: AMUP

Natural risk zones
type: Concept
definition: Zonas vulnerables caracterizadas por la existencia de riesgos de carácter natural (cualquier fenómeno atmosférico, hidrológico, sísmico, volcánico o incendio natural que, debido a su localización, gravedad o frecuencia, pueda afectar negativamente a la población), p. ej., inundaciones, corrimientos de tierra y hundimientos, aludes, incendios forestales, terremotos, erupciones volcánicas. @es
preferred label: Zones à risque naturel @fr
definition: Vulnerable areas characterised according to natural hazards (all atmospheric, hydrologic, seismic, volcanic and wildfire phenomena that, because of their location, severity, and frequency, have the potential to seriously affect society), e.g. floods, landslides and subsidence, avalanches, forest fires, earthquakes, volcanic eruptions.
in dataset: void
notation: SDN:P22::25
definition: Zonas sensíveis, caracterizadas de acordo com os riscos naturais (todos os fenómenos atmosféricos, hidrológicos, sísmicos, vulcânicos e os incêndios que, pela sua localização, gravidade e frequência, possam afectar gravemente a sociedade), como sejam inundações, deslizamentos de terras e subsidências, avalanches, incêndios florestais, sismos, erupções vulcânicas. @pt
definition: Zones sensibles caractérisées en fonction des risques naturels (tous les phénomènes atmosphériques, hydrologiques, sismiques, volcaniques, ainsi que les feux de friche qui peuvent, en raison de leur situation, de leur gravité et de leur fréquence, nuire gravement à la société), tels qu''inondations, glissements et affaissements de terrain, avalanches, incendies de forêts, tremblements de terre et éruptions volcaniques. @fr
top concept of: INSPIRE themes
narrower: PASR
type: Thing
preferred label: Zonas de risco natural @pt
date: 2009-07-30 13:25:19.0
preferred label: Zonas de riesgos naturales @es
note: accepted
version info: 1
deprecated: false

Agriculture and aquaculture facilities
preferred label: Instalaciones agrícolas y de acuicultura @es
date: 2009-07-30 13:25:19.0
definition: Équipement et installations de production agricoles (y compris les systèmes d''irrigation, les serres et les étables). @fr
top concept of: INSPIRE themes
definition: Farming equipment and production facilities (including irrigation systems, greenhouses and stables).
type: Concept
definition: Equipamiento e instalaciones de producción agraria (incluidos sistemas de regadío, invernaderos y establos). @es
preferred label: Installations agricoles et aquacoles @fr
in dataset: void
definition: Equipamento e instalações de explorações agrícolas e aquícolas (incluindo sistemas de irrigação, estufas e viveiros, e estábulos). @pt
notation: SDN:P22::22
note: accepted
preferred label: Instalações agrícolas e aquícolas @pt
broader: Agriculture
type: Thing
version info: 1
deprecated: false

Utility and government services
top concept of: INSPIRE themes
definition: Includes utility facilities such as sewage, waste management, energy supply and water supply, administrative and social governmental services such as public administrations, civil protection sites, schools and hospitals.
in dataset: void
definition: Incluye instalaciones de utilidad pública de alcantarillado, gestión de residuos, suministro de energía y suministro de agua, así como servicios estatales administrativos y sociales tales como administraciones públicas, sitios de protección civil, escuelas y hospitales. @es
definition: Inclui instalações e serviços de utilidade pública, como redes de esgotos, gestão de resíduos, fornecimento de energia, abastecimento de água, serviços administrativos e sociais do Estado tais como administrações públicas, instalações da protecção civil, escolas e hospitais. @pt
preferred label: Services d''utilité publique et services publics @fr
notation: SDN:P22::19
type: Concept
preferred label: Serviços de utilidade pública e do Estado @pt
narrower: GP001
type: Thing
narrower: QDMD
note: accepted
date: 2009-07-30 13:25:19.0
narrower: Infrastructure
preferred label: Servicios de utilidad pública y estatales @es
definition: Comprend les installations d''utilité publique, tels que les égouts ou les réseaux et installations liés à la gestion des déchets, à l''approvisionnement énergétique, à l''approvisionnement en eau, ainsi que les services administratifs et sociaux publics, tels que les administrations publiques, les sites de la protection civile, les écoles et les hôpitaux. @fr
deprecated: false
version info: 1

Soil
preferred label: Solo @pt
type: Concept
definition: Sols et sous-sol caractérisés selon leur profondeur, texture, structure et teneur en particules et en matières organiques, pierrosité, érosion, le cas échéant pente moyenne et capacité anticipée de stockage de l''eau. @fr
top concept of: INSPIRE themes
definition: Suelo y subsuelo, caracterizados según su profundidad, textura, estructura y contenido de partículas y material orgánico, pedregosidad, erosión y, cuando proceda, pendiente media y capacidad estimada de almacenamiento de agua. @es
definition: Solo e subsolo caracterizado de acordo com a profundidade, textura, estrutura e conteúdo das partículas e material orgânico, carácter pedregoso, erosão, eventualmente declive médio e capacidade estimada de armazenamento de água. @pt
narrower: WCWT
preferred label: Sols @fr
narrower: GWAM
in dataset: void
note: accepted
type: Thing
narrower: Soils
preferred label: Suelo @es
notation: SDN:P22::16
definition: Soils and subsoil characterised according to depth, texture, structure and content of particles and organic material, stoniness, erosion, where appropriate mean slope and anticipated water storage capacity.
broader: Soils
date: 2009-07-30 13:25:19.0
version info: 1
deprecated: false

Geology
narrower: SSTB
narrower: CD10
top concept of: INSPIRE themes
narrower: OGPW
narrower: GWCH
definition: Geologia caracterizada de acordo com a composição e a estrutura. Inclui a base rochosa, os aquíferos e a geomorfologia. @pt
narrower: MTPW
narrower: MDPW
narrower: GRAV
type: Thing
narrower: PASR
narrower: ROGS
narrower: CPCN
narrower: TADN
narrower: SAMO
narrower: CPSD
narrower: SPRO
narrower: STOM
type: Concept
broader: Geology
narrower: PHSE
narrower: SDNA
narrower: RSIS
narrower: RPER
narrower: IS4R
narrower: MINC
narrower: RMIN
narrower: OCPW
narrower: GERA
narrower: HAAC
narrower: SCDO
narrower: SPOL
narrower: CARS
narrower: MMAN
definition: Géologie caractérisée en fonction de la composition et de la structure. Englobe le substratum rocheux, les aquifères et la géomorphologie. @fr
narrower: SDAC
narrower: GTCH
narrower: SIPW
narrower: PHSD
narrower: STMP
narrower: SCAH
notation: SDN:P22::13
narrower: STCO
narrower: RALT
narrower: RAGE
narrower: SPAG
narrower: SCOC
narrower: SR3D
narrower: CBSD
narrower: COGE
narrower: IRSP
narrower: GWAM
narrower: DGPW
narrower: SHTA
narrower: RTCO
narrower: SSTR
narrower: SPCB
narrower: HFLW
in dataset: void
definition: Características geológicas según la composición y la estructura. Se incluirán la plataforma de roca firme, los acuíferos y la geomorfología. @es
narrower: REFF
date: 2009-07-30 13:25:19.0
preferred label: Géologie @fr
narrower: CLAY
narrower: SALK
narrower: NTSD
narrower: SRFL
narrower: CCPW
narrower: WCWT
narrower: SRFR
narrower: XMGS
narrower: GHDX
narrower: SRAD
narrower: CASD
narrower: ACSR
definition: Geology characterised according to composition and structure. Includes bedrock, aquifers and geomorphology.
preferred label: Geologia @pt
narrower: SAGE
narrower: AASD

Hydrography
type: Thing
narrower: GWAM
narrower: GP001
narrower: Hydrology
type: Concept
notation: SDN:P22::163
narrower: WVSP
in dataset: void
narrower: SICO
narrower: WQBI
note: accepted
narrower: GWCH
preferred label: Hidrografía @es
broader: Hydrology
narrower: RVDS
definition: Elementos hidrográficos, incluindo zonas marinhas e todas as outras massas de água e elementos com eles relacionados, incluindo bacias e sub-bacias hidrográficas. Quando adequado, de acordo com as definições da Directiva 2000/60/CE do Parlamento Europeu e do Conselho, de 23 de Outubro de 2000, que estabelece um quadro de acção comunitária no domínio da política da água (2), e sob a forma de redes. @pt
preferred label: Hydrographie @fr
narrower: MBAN
date: 2009-07-30 13:25:19.0
definition: Elementos hidrográficos, incluidas las zonas marinas y todas las otras masas de agua y elementos relacionados con ellas, así como las cuencas y subcuencas hidrográficas. Cuando proceda, según lo definido en la Directiva 2000/60/CE del Parlamento Europeo y del Consejo, de 23 de octubre de 2000, por la que se establece un marco comunitario de actuación en el ámbito de la política de aguas (2), y en forma de redes. @es
preferred label: Hidrografia @pt
definition: Hydrographic elements, including marine areas and all other water bodies and items related to them, including river basins and sub-basins. Where appropriate, according to the definitions set out in Directive 2000/60/EC of the European Parliament and of the Council of 23 October 2000 establishing a framework for Community action in the field of water policy, and in the form of networks.
definition: Éléments hydrographiques, y compris les zones maritimes ainsi que toutes les autres masses d''eau et les éléments qui y sont liés, y compris les bassins et sous-bassins hydrographiques. Conformes, le cas échéant, aux définitions établies par la directive 2000/60/CE du Parlement européen et du Conseil du 23 octobre 2000 établissant un cadre pour une politique communautaire dans le domaine de l''eau (2) et sous forme de réseaux. @fr
narrower: LWET
top concept of: INSPIRE themes
version info: 1
deprecated: false

Elevation
notation: SDN:P22::10
preferred label: Altitude @pt
definition: Digital elevation models for land, ice and ocean surface. Includes terrestrial elevation, bathymetry and shoreline.
top concept of: INSPIRE themes
in dataset: void
narrower: PREX
narrower: ASLV
narrower: MBAN
narrower: CRYS
type: Concept
type: Thing
definition: Modelos digitales de elevaciones para las superficies de tierra, hielo y mar. Se incluirán la altimetría, la batimetría y la línea de costa. @es
note: accepted
date: 2009-07-30 13:25:19.0
preferred label: Elevaciones @es
definition: Modelos digitais de terreno aplicáveis às superfícies terrestre, gelada e oceânica. Inclui a elevação terrestre, a batimetria e a linha costeira. @pt
narrower: Bathymetry
narrower: COGE
narrower: AHGT
definition: Modèles numériques pour l''altitude des surfaces terrestres, glaciaires et océaniques. Comprend l''altitude terrestre, la bathymétrie et la ligne de rivage. @fr
deprecated: false
version info: 1

Addresses
note: accepted
type: Concept
definition: Localização de propriedades com base em identificadores de endereço, em regra, o nome da rua, o número da porta e o código postal. @pt
in dataset: void
preferred label: Adresses @fr
preferred label: Direcciones @es
date: 2009-07-30 13:25:19.0
definition: Localisation des propriétés fondée sur les identifiants des adresses, habituellement le nom de la rue, le numéro de la maison et le code postal. @fr
preferred label: Endereços @pt
top concept of: INSPIRE themes
definition: Localización de las propiedades, basada en identificadores de direcciones, por ejemplo, el nombre de la vía pública, el número de la finca, el código postal. @es
type: Thing
definition: Location of properties based on address identifiers, usually by road name, house number, postal code.
notation: SDN:P22::160
deprecated: false
version info: 1

Administrative units
definition: Units of administration, dividing areas where Member States have and/or exercise jurisdictional rights, for local, regional and national governance, separated by administrative boundaries.
date: 2009-07-30 13:25:19.0
definition: Unidades administrativas, zonas de divisão sobre as quais os Estados-Membros possuam e/ou exerçam direitos jurisdicionais, para efeitos de governação local, regional e nacional, separadas por fronteiras administrativas. @pt
top concept of: INSPIRE themes
note: accepted
notation: SDN:P22::156
preferred label: Unités administratives @fr
definition: Unidades administrativas en que se dividan las áreas en las que los Estados miembros tienen y/o ejercen derechos jurisdiccionales, a efectos de administración local, regional y nacional, separadas por límites administrativos. @es
definition: Unités d''administration séparées par des limites administratives et délimitant les zones dans lesquelles les États membres détiennent et/ou exercent leurs compétences, aux fins de l''administration locale, régionale et nationale. @fr
preferred label: Unidades administrativas @pt
type: Thing
type: Concept
in dataset: void
narrower: AdministrativeBoundaries

Energy resources
type: Concept
definition: Recursos energéticos: hidrocarburos, energía hidroeléctrica, bioenergía, energía solar y eólica, etc., incluyendo, cuando proceda, la información de profundidad y altura del volumen de los recursos. @es
note: accepted
definition: Energy resources including hydrocarbons, hydropower, bio-energy, solar, wind, etc., where relevant including depth/height information on the extent of the resource.
preferred label: Sources d''énergie @fr
type: Thing
notation: SDN:P22::33
narrower: CSLR
date: 2009-07-30 13:25:19.0
definition: Recursos energéticos, incluindo os de hidrocarbonetos, hidroeléctricos, de bio-energias, de energia solar, eólica, etc., incluindo, quando pertinente, informação sobre as cotas de profundidade/altura do recurso. @pt
top concept of: INSPIRE themes
definition: Sources d''énergie comprenant les hydrocarbures, l''énergie hydraulique, la bioénergie, l''énergie solaire, l''énergie éolienne, etc., le cas échéant accompagnées d''informations relatives à la profondeur/la hauteur de la source. @fr
in dataset: void
preferred label: Recursos energéticos @pt
version info: 1
deprecated: false

Bio-geographical regions
definition: Zonas dotadas de condiciones ecológicas relativamente homogéneas con unas características comunes. @es
preferred label: Regiões biogeográficas @pt
type: Concept
date: 2009-07-30 13:25:19.0
definition: Areas of relatively homogeneous ecological conditions with common characteristics.
notation: SDN:P22::30
definition: Zonas de condições ecológicas relativamente homogéneas com características comuns. @pt
top concept of: INSPIRE themes
note: accepted
preferred label: Régions biogéographiques @fr
preferred label: Regiones biogeográficas @es
in dataset: void
type: Thing
definition: Zones présentant des conditions écologiques relativement homogènes avec des caractéristiques communes. @fr
version info: 1
deprecated: false

Meteorological geographical features
preferred label: Características geometeorológicas @pt
date: 2009-07-30 13:25:19.0
definition: Condições atmosféricas e sua medição; precipitação, temperatura, evapotranspiração, velocidade e direcção do vento. @pt
preferred label: Caractéristiques géographiques météorologiques @fr
type: Thing
narrower: Climate
narrower: RWCH
narrower: CLTY
narrower: CHEX
in dataset: void
related: IPHY
definition: Weather conditions and their measurements; precipitation, temperature, evapotranspiration, wind speed and direction.
related: ICHM
top concept of: INSPIRE themes
preferred label: Aspectos geográficos de carácter meteorológico @es
narrower: EWSB
definition: Condiciones meteorológicas y sus mediciones; precipitaciones, temperaturas, evapotranspiración, velocidad y dirección del viento. @es
narrower: OMET
narrower: LSST
note: accepted
narrower: WSTR
definition: Conditions météorologiques et leur mesure: précipitations, température, évapotranspiration, vitesse et direction du vent. @fr
notation: SDN:P22::27
narrower: CPRP
type: Concept
deprecated: false
version info: 1

Area management/restriction/regulation zones and reporting units
note: accepted
type: Thing
in dataset: void
preferred label: Zonas sujetas a ordenación, a restricciones o reglamentaciones y unidades de notificación @es
type: Concept
top concept of: INSPIRE themes
date: 2009-07-30 13:25:19.0
definition: Zonas geridas, regulamentadas ou utilizadas para a comunicação de dados a nível internacional, europeu, nacional, regional e local. Compreende aterros, zonas de acesso restrito em torno de nascentes de água potável, zonas sensíveis aos nitratos, vias navegáveis regulamentadas no mar ou em águas interiores de grandes dimensões, zonas de descarga de resíduos, zonas de ruído condicionado, zonas autorizadas para efeitos de prospecção e extracção mineira, bacias hidrográficas, unidades de referência pertinentes e zonas abrangidas pela gestão das zonas costeiras. @pt
definition: Zones gérées, réglementées ou utilisées pour les rapports aux niveaux international, européen, national, régional et local. Sont inclus les décharges, les zones restreintes aux alentours des sources d''eau potable, les zones vulnérables aux nitrates, les chenaux réglementés en mer ou les eaux intérieures importantes, les zones destinées à la décharge de déchets, les zones soumises à limitation du bruit, les zones faisant l''objet de permis d''exploration et d''extraction minière, les districts hydrographiques, les unités correspondantes utilisées pour les rapports et les zones de gestion du littoral. @fr
definition: Zonas gestionadas, reglamentadas o utilizadas para la elaboración de informes para organismos internacionales, europeos, nacionales, regionales y locales. Se incluirán vertederos, zonas restringidas alrededor de lugares de extracción de agua potable, zonas sensibles a los nitratos, rutas marítimas o por grandes vías navegables reglamentadas, zonas de vertido, zonas de restricción de ruidos, zonas de prospección o extracción minera, demarcaciones hidrográficas, las correspondientes unidades de notificación y planes de ordenación de zonas costeras. @es
preferred label: Zones de gestion, de restriction ou de réglementation et unités de déclaration @fr
definition: Areas managed, regulated or used for reporting at international, European, national, regional and local levels. Includes dumping sites, restricted areas around drinking water sources, nitrate-vulnerable zones, regulated fairways at sea or large inland waters, areas for the dumping of waste, noise restriction zones, prospecting and mining permit areas, river basin districts, relevant reporting units and coastal zone management areas.
preferred label: Zonas de gestão/restrição/regulamentação e unidades de referência @pt
notation: SDN:P22::24
version info: 1
deprecated: false