Is related to
sub property of: topObjectProperty
property disjoint with: bottomObjectProperty
type: ObjectProperty
label: Está relacionado con @es
comment: Wordt gebruikt om een bron met een teken te verbinden. Dit teken kan om het even welk type zijn zolang de representatie toegankelijk is via een URI over HTTP. NiceTag definieert tags door een eigenschap die twee bronnen verbindt. Toch kunnen veel van de onderscheiden die te vinden zijn in de IRW ontologie gebruikt worden om een meer precies beeld te krijgen van nt:TaggedResource (in het bijzonder de klasse irw:Resource). @nl
label: È connesso con @it
comment: Usato per associare una risorsa a un segno che può essere, di per sè, di qualsiasi tipo, purchè la sua rappresentazione, identificata da un URI, sia accessibile tramite il protocollo HTTP. NiceTag definisce le tag per mezzo di una proprietà che associa due risorse; l'ontologia IRW permette di comprendere più precisamente il significato di nt:TaggedResource (in particolare la classe irw:Resource). @it
label: Est relié à @fr
comment: Used to link a resource to a sign, which can itself, be of any type, provided its representation is HTTP accessible from a URI. NiceTag defines tags by means of a mere property linking two Resources; this said, the many distinctions found in IRW ontology give a more precise account of nt:TaggedResource (see in particular irw:Resource).
type: Property
comment: Utilisé pour lier une ressource à un signe qui, lui-même, peut être de n'importe quel type pourvu que sa représentation, identifiée par une URI, soit accessible via le protocole HTTP. NiceTag définit les tags au moyen d'une propriété qui relie deux Resource; toutefois, l'ontologie IRW permet de comprendre plus précisément la signification de nt:TaggedResource (en particulier la classe irw:Resource). @fr
comment: Usado para asociar un recurso a un signo que puede ser, en sí mismo, de qualquier tipo, con tal que su representación, identificada por un URI, sea accesible mediante el protocolo HTTP. NiceTag define las etiquetas por medio de una propiedad que asocia dos recursos; la ontologia IRW permite comprender con mas claridad el significaso de nt:taggedResources(en especiàl la clase irw:Resource). @es
label: Houdt verband met @nl

Lesser Copyleft
type: Requirement
type: Thing
comment: derivative works must be licensed under specified terms, with at least the same conditions as the original work; combinations with the work may be licensed under different terms

Makes me feel
sub property of: topObjectProperty
sub property of: Is related to
property disjoint with: bottomObjectProperty
type: ObjectProperty
comment: Propriété utilisée pour indiquer que le libellé d'un tag dénote/exprime une réaction émotionnelle. @fr
comment: Property used to indicate that the label of a tag denotes/expresses an emotional reaction.
label: Mi suscita @it
comment: Propriedad usada para indicar que el contenido de una etiqueta denota/expresa una reacción emocional. @es
label: Maakt dat ik me voel @nl
label: Me provoca @es
comment: Proprietà usata per indicare che il contenuto di una tag denota/esprime una reazione emotiva. @it
comment: Eigenschap die gebruikt wordt om aan te geven dat het label van een tag een emotionele reactie weergeeft of uitdrukt. @nl
type: Property
label: Produit sur moi @fr

N-tuple tag action
disjoint with: Nothing
subclass of: Item
subclass of: Tag action
subclass of: Syntactic Tag Action
subclass of: Thing
subclass of: Graph
type: Class
label: Azione di tagging con una tag n-dimensionale @it
comment: Utilisé pour décrire des actes de taguer impliquant des tags dont les libellés ont n-dimensions (double tags, triple tags, etc.). @fr
comment: Descrive azioni di tagging basate su tag n-dimensionali (doppie tag, triple tag, ecc.). @it
comment: Describes tagging involving N-tuple tags (double tags, triple tags, etc.).
label: Acte de taguer avec un tag à n-dimensions @fr
comment: Describe acciones de etiquetado que incluyan etiquetas n-dimensionales (etiquetas dobles, triples, etc.). @es
comment: Wordt gebruikt om taghandelingen te beschrijven waarbij de labels meerdere (n) dimensies kunnen hebben (dubbele tags, driedubbele tags, etc.). @nl
label: Taghandeling met n-tuple @nl
label: Acción de etiquetado con una etiqueta n-dimensional @es

Publisher
modified: 2008-01-14
issued: 1999-07-02
description: Examples of a Publisher include a person, an organization, or a service. Typically, the name of a Publisher should be used to indicate the entity.
type: Thing
type: ObjectProperty
has version: publisher-006
note: A second property with the same name as this property has been declared in the dcterms: namespace (http://purl.org/dc/terms/). See the Introduction to the document "DCMI Metadata Terms" (http://dublincore.org/documents/dcmi-terms/) for an explanation.
sub property of: topObjectProperty
property disjoint with: bottomObjectProperty
type: Property
comment: An entity responsible for making the resource available.

Assert
disjoint with: Nothing
subclass of: Item
subclass of: Tag action
subclass of: Thing
subclass of: Graph
type: Class
label: Asserter @fr
comment: Describes the action that is performed with a tag whenever it is used to assert anything about a resource.
comment: Décrit l'action que l'on accomplit avec un tag dès lors que celui-ci est utilisé pour affirmer quoi que ce soit à propos d'une ressource. @fr
label: Asserire @it
comment: Descrive l'azione che viene svolta con una tag quando questa è utilizzata per affermare qualcosa a proposito di una risorsa. @it
label: Bevestigen @nl
comment: Describe la acción realizada con una tag quando esta es usada para afirmar algo sobre un recurso. @es
comment: Beschrijft de handeling die verricht wordt met een tag wanneer deze gebruikt wordt om iets over een bron te bevestigen. @nl
label: Afirmar @es

Has for medium
sub property of: topObjectProperty
sub property of: Is related to
property disjoint with: bottomObjectProperty
type: ObjectProperty
comment: Proprietà usata quando il contenuto di una tag indica il medium a cui appartiene la rappresentazione Web della risorsa a cui si accede ("forum", "vidéo", "photo", "pagina Web", "Webservice", etc.). @it
label: Est un medium de type @fr
label: È un medium di tipo @it
domain: WebRepresentation
comment: Propriété utilisée quand le libellé d'un tag indique de quel média la représentation de la ressource à laquelle on accède ressortit ("forum", "vidéo", "photo", "page Web", "Webservice", etc.). @fr
type: Property
label: Es un medium de tipo @es
comment: Property used when the label of a tag indicates the medium which an HTTP-accessible Web representation belongs to ("forum", "video", "photo", "Webpage", "Webservice", etc.).
label: Is het medium @nl
comment: Propriedad usada cuando el contenido de una etiqueta indica el medium al que pertenece la representación Web del recurso al cual se accede ("forum", "video", "foto", "página Web", "Webservice", etc.). @es
comment: Eigenschap die gebruikt wordt wanneer het label van een tag aangeeft tot welk medium een via het web toegankelijke representatie behoort ("forum", "video", "foto", "webpagina", "webdienst", etc.) @nl

has license
type: ObjectProperty
sub property of: license
equivalent property: license
property disjoint with: bottomObjectProperty
type: Thing
sub property of: topObjectProperty
type: Property
domain: Work
range: License

Coverage
description: Spatial topic and spatial applicability may be a named place or a location specified by its geographic coordinates. Temporal topic may be a named period, date, or date range. A jurisdiction may be a named administrative entity or a geographic place to which the resource applies. Recommended best practice is to use a controlled vocabulary such as the Thesaurus of Geographic Names [TGN]. Where appropriate, named places or time periods can be used in preference to numeric identifiers such as sets of coordinates or date ranges.
type: Thing
property disjoint with: bottomObjectProperty
type: ObjectProperty
modified: 2008-01-14
has version: coverage-006
issued: 1999-07-02
note: A second property with the same name as this property has been declared in the dcterms: namespace (http://purl.org/dc/terms/). See the Introduction to the document "DCMI Metadata Terms" (http://dublincore.org/documents/dcmi-terms/) for an explanation.
sub property of: topObjectProperty
type: Property
comment: The spatial or temporal topic of the resource, the spatial applicability of the resource, or the jurisdiction under which the resource is relevant.

License
disjoint with: Nothing
equivalent class: License
subclass of: LicenseDocument
subclass of: Thing
subclass of: License
type: Class
comment: a set of requests/permissions to users of a Work, e.g. a copyright license, the public domain, information for distributors

Elicits action
sub property of: topObjectProperty
sub property of: Is related to
property disjoint with: bottomObjectProperty
type: ObjectProperty
comment: Propriété utilisée quand une ressource suscite l'accomplissement d'une action. @fr
label: Suscita l'azione @it
type: Property
comment: Propriedad usada cuando un recurso suscita la realización de una acción. @es
comment: Property used when a resource elicits an action to be performed.
label: Ontlokt de handeling @nl
label: Suscita la acción @es
comment: Proprietà usata quando una risorsa suscita lo svolgimento di un'azione. @it
comment: Eigenschap die gebruikt wordt wanneer een bron aanzet tot het verrichten van een handeling. @nl
label: Suscite l'action @fr

N-tuple tag action with machine tag syntax
subclass of: Machine tag action
type: Thing
disjoint with: Nothing
subclass of: N-tuple tag action
subclass of: Tag action
subclass of: Syntactic Tag Action
subclass of: Graph
subclass of: Thing
type: Class
subclass of: Item
label: Azione di tagging con una tag a n-dimensionale e sintassi delle machine tag @it
comment: Utilisé pour décrire un acte de taguer impliquant des tags dont les libellés ont n-dimensions et suivent la syntaxe des machine tags mais dans un contexte où des APIs semblables à celle de Flickr font défaut. @fr
comment: Descrive azioni di tagging basate su tag n-dimensionali che seguono la sintassi delle machine tag, ma in un contesto dove mancano API simili a quelle di Flickr. @it
label: Acción de etiquetado con una etiqueta n-dimensional y sintaxis de las machine tags @es
comment: Describes tagging involving N-tuple tags which follow machine tags typed syntax in acontext where Flickr-like APIs are lacking.
label: Taghandeling met een n-tuple met machinetag syntaxis @nl
comment: Describe acciones de etiquetado basadas en etiquetas n-dimensionales que siguen la sintaxis de las machine tag, pero en un contexto en el que faltan API parecidas a las de Flickr. @es
comment: Wordt gebruikt om een taghandeling te beschrijven wanneer de labels meerdere dimensies hebben en machinetag syntaxis volgen, maar er geen Flickr-gelijkende API besachikbaar is. @nl
label: Acte de taguer avec un tag à n-dimensions et syntaxe de machine tags @fr

Attribution
disjoint with: Nothing
type: Requirement
subclass of: Attribution
subclass of: Thing
type: Thing
type: Class
equivalent class: Attribution
comment: credit be given to copyright holder and/or author

Give access rights to
disjoint with: Nothing
subclass of: Item
subclass of: Tag action
subclass of: Thing
subclass of: Graph
type: Class
comment: Beschrijft de handeling die verricht wordt met een tag wanneer deze gebruikt wordt om vast te stellen aaan wie toegangsrechten tot een bron worden toegekend of ontzegd. @nl
label: Accorder des droits d'accès à @fr
label: Acordar derechos de acceso a @es
comment: Descrive l'azione che si compie con una tag quando questa è usata per definire a chi sono accordati o negati i diritti di accesso a una risorsa. @it
label: Toegangsrechten verlenen aan @nl
comment: Describes the action that is performed with a tag whenever it is used to define to whom access rights to a resource are granted or denied.
label: Accordare diritti di accesso a @it
comment: Décrit l'action que l'on accomplit avec un tag dès lors que celui-ci est utilisé pour définir les personnes auxquelles sont octroyés des droits d'accès à des ressource en ligne (permission ou refus). @fr
comment: Describe la acción que se realiza con una etiqueta cuando es usada para definir a quien son concedidos o negados derechos de acceso a un recurso.. @es

Point
disjoint with: Nothing
subclass of: Item
subclass of: Tag action
subclass of: Thing
subclass of: Graph
type: Class
comment: Décrit l'action que l'on accomplit avec un tag dès lors que celui-ci est utilisé pour faire référence à une portion spécifique de la représentation d'une ressource sur le Web (le segment d'une vidéo, un commentaire produit par les utilisateurs au pied d'un article, etc.). @fr
label: Puntare @it
label: Pointer @fr
label: Puntar @es
label: Aanwijzen @nl
comment: Beschrijft de handeling die verricht wordt met een tag wanneer deze gebruikt wordt om naar een specifiek deel van een web-representatie te verwijzen (een segment van een video, een door een gebruiker gegenereerd commentaar bij een krantenartikel, etc.). @nl
comment: Descrive l'azione che si compie con una tag quando questa è usata per fare riferimento a una parte specifica della rappresentazione di una risorsa Web (il segmento di un video, il commento generato dagli utenti a un articolo di un quotidiano, ecc.). @it
comment: Describe la acción que se realiza con una etiqueta cuando es usada para referirse a una parte específica de un recurso Web (el segmento de un video, comentarios generados por los usuarios a un artículo de periódico). @es
comment: Describes the action that is performed with a tag whenever it is used to point to a specific part of a Web representation (the segment of a video, a user-generated commentary to a newspaper article, etc.).

Part Of Web representation
disjoint with: Nothing
subclass of: WebRepresentation
subclass of: Thing
type: Class
comment: Usato per rappresentare la parte della rappresentazione di una risorsa Web quando si è fatto uso dell'atto di tagging "Point". @it
label: Onderdeel van de representatie van een bron op het web @nl
comment: Utilisé pour représenter la partie de la représentation d'une ressource qui est taguée lorsque qu'il est fait usage de l'acte de taguer "Pointer". @fr
label: Partie de la représentation d'une ressource sur le Web @fr
comment: Used to represent the part of the Web representation resource being tagged after the "Point" TagAction is used.
comment: Wordt gebruikt om het getagde deel van een web-representatie aan te geven wanneer gebruikt is gemaakt van de "Aanwijs" taghandeling. @nl
label: Parte della rappresentazione di una risorsa Web @it
label: Parte de la representación de un recurso en la Web @es
comment: Usado para representar la parte de la representación de un recurso Web quando se ha hecho uso del acto de etiquetado "Point". @es

Prohibition
disjoint with: Nothing
equivalent class: Prohibition
subclass of: Thing
subclass of: Prohibition
type: Class
comment: something you may be asked not to do

Source Code
equivalent class: SourceCode
subclass of: SourceCode
type: Thing
type: Requirement
subclass of: Thing
type: Class
disjoint with: Nothing
comment: source code (the preferred form for making modifications) must be provided when exercising some rights granted by the license.

Work
disjoint with: Nothing
equivalent class: Work
subclass of: Thing
subclass of: Work
type: Class
comment: a potentially copyrightable work

Owner tag action
subclass of: Graph
disjoint with: Set task
disjoint with: Visitor tag action
disjoint with: Nothing
subclass of: Thing
type: Class
subclass of: Tag action
subclass of: Item
comment: Utilisé pour décrire un acte de taguer accompli par le propriétaire de l'URI qui identifie la ressource taguée. @fr
comment: Usato per descrivere un'azione di tagging svolta dal proprietario dell'URI che identifica la risorsa taggata. @it
comment: Used to describe an act of tagging performed by the owner of the URI that identifies the tagged resource.
label: Acción de etiquetado del propietario @es
comment: Beschrijft een taghandeling verricht door de eigenaar van de URI waarmee de getagde bron geïdentificeerd wordt. @nl
label: Taghandeling eigenaar @nl
comment: Usado para describir una acción de etiquetado realizada por el propietario del URI que identifica el recurso etiquetado. @es
label: Azione di tagging del proprietario @it
label: Acte de taguer d'un propriétaire @fr

Is about
sub property of: topObjectProperty
sub property of: Is related to
property disjoint with: bottomObjectProperty
type: ObjectProperty
comment: Property used when the label of a tag describes the topic of a resource.
label: A pour thème @fr
label: Ha come tema @it
comment: Eigenschap die gebruikt wordt wanneer het label van een tag het thema van een bron beschrijft. @nl
type: Property
label: Tiene como tema @es
label: Betreft @nl
comment: Proprietà usata quando il contenuto di una tag descrive il tema di una risorsa. @it
comment: Propriété utilisé pour indiquer que le libellé d'un tag décrit le thème d'une ressource. @fr
comment: Propriedad usada cuando el contenido de una etiqueta describe el tema de un recurso. @es

Identifier
property disjoint with: bottomObjectProperty
type: Thing
description: Recommended best practice is to identify the resource by means of a string conforming to a formal identification system.
note: A second property with the same name as this property has been declared in the dcterms: namespace (http://purl.org/dc/terms/). See the Introduction to the document "DCMI Metadata Terms" (http://dublincore.org/documents/dcmi-terms/) for an explanation.
modified: 2008-01-14
sub property of: topObjectProperty
issued: 1999-07-02
has version: identifier-006
type: ObjectProperty
type: Property
comment: An unambiguous reference to the resource within a given context.

Ask
disjoint with: Nothing
subclass of: Item
subclass of: Tag action
subclass of: Thing
subclass of: Graph
type: Class
label: Porre una domanda @it
comment: Beschrijft de handeling die met de tag verricht wordt als het stellen van een vraag. @nl
comment: Describes the action that is performed with a tag by asking a question.
comment: Descrive l'azione che viene compiuta con una tag quando questa viene usata per porre una domanda. @it
label: Preguntar @es
label: Vraag stellen @nl
label: Poser une question @fr
comment: Describe la acción que se realiza con una etiqueta cuando se usa para hacer una pregunta. @es
comment: Décrit l'action que l'on accomplit avec un tag dès lors que celui-ci est utilisé pour poser une question. @fr

requires
sub property of: topObjectProperty
property disjoint with: bottomObjectProperty
sub property of: requires
equivalent property: requires
type: ObjectProperty
type: Property
domain: License
range: Requirement

Language
issued: 1999-07-02
type: Thing
type: ObjectProperty
note: A second property with the same name as this property has been declared in the dcterms: namespace (http://purl.org/dc/terms/). See the Introduction to the document "DCMI Metadata Terms" (http://dublincore.org/documents/dcmi-terms/) for an explanation.
has version: language-007
description: Recommended best practice is to use a controlled vocabulary such as RFC 4646 [RFC4646].
sub property of: topObjectProperty
property disjoint with: bottomObjectProperty
modified: 2008-01-14
type: Property
comment: A language of the resource.

Disambiguate Tag Action
disjoint with: Nothing
subclass of: Item
subclass of: Tag action
subclass of: Thing
subclass of: Graph
type: Class
comment: Used when the sign used to tag is disambiguated.
label: Acte de taguer avec désambigüisation @fr
comment: Utilisé lorsque le signe utilisé pour taguer est désambiguïsé. @fr
comment: Usado quando el signo usado para etiquetar es desambiguado. @es
comment: Wordt gebruikt wanneer het teken waarmee getagd wordt gedesambigueerd is. @nl
label: Azione di tagging con disambiguazione @it
comment: Usato quando il segno usato per taggare è disambiguato. @it
label: Taghandeling met gedisambigueerd teken @nl
label: Acción de etiquetado con desambiguación @es

Set task
disjoint with: Owner tag action
subclass of: Thing
subclass of: Graph
subclass of: Tag action
type: Class
subclass of: Item
disjoint with: Nothing
subclass of: Visitor tag action
label: Définir une tâche @fr
label: Taak definiëren @nl
comment: Décrit l'action que l'on accomplit avec un tag de type "àfaire" dès lors que celui-ci est utilisé pour définir une tâche attendant sa réalisation. @fr
label: Definir una tarea @es
comment: Describe la acción que se realiza con una etiqueta de tipo "quehacer" cuando es usada para crear una tarea en espera de realización. @es
comment: Describes the action that is performed with a "todo" tag whenever it is used to create a task awaiting performance.
label: Definire un compito @it
comment: Descrive l'azione che si compie con una tag di tipo "dafare", quando questa è usata per creare un compito in attesa di realizzazione. @it
comment: Beschrijft de handeling die verricht wordt met een tag van het type “te doen” wanneer deze gebruikt wordt om een taak te maken in afwachting van haar realisatie. @nl

Personal tag collection
disjoint with: Nothing
subclass of: Tag collection
subclass of: Thing
type: Class
comment: A collection of tags generated by a single user.
comment: Une collection de tags constituée par un utilisateur précis. @fr
label: Colección de etiquetas personal @es
label: Collection de tags personnelle @fr
label: Collezione di tag personale @it
label: Persoonlijke tagverzameling @nl

Tagged resource
disjoint with: Nothing
equivalent class: Resource
subclass of: Thing
subclass of: Resource
type: Class
comment: Usado para representar el recurso etiquetado. Equivalente a irw:Resource. @es
comment: Wordt gebruikt als representatie van de bron die getagd wordt. @nl
comment: Usato per rappresentare la risorsa taggata. Equivalente di irw:Resource. @it
comment: Used to represent the resource being tagged. Equivalent of irw:Resource.
label: Risorsa taggata @it
comment: Utilisé pour représenter la ressource taguée. Equivalent de irw:Resource. @fr
label: Ressource taguée @fr
label: Getagde bron @nl
label: Recurso etiquetado @es

Aggregate
disjoint with: Nothing
subclass of: Item
subclass of: Tag action
subclass of: Thing
subclass of: Graph
type: Class
label: Verzamelen @nl
comment: Descrive l'azione che viene compiuta quando delle risorse sono aggregate attorno a una tag definita collettivamente. @it
comment: Describes the action that is performed whenever resources are aggregated with a collectively defined tag.
comment: Décrit l'action que l'on accomplit lorsque des ressources sont aggrégées autour d'un tag défini de manière collective. @fr
comment: Beschrijft de handeling die verricht wordt wanneer bronnen worden bijeenverzameld onder een gezamenlijk gedefinieerde tag. @nl
label: Agréger @fr
label: Aggregare @it
comment: Describe la acción que se realiza cuando se agregan unos recursos alrededor de una etiqueta definita colectivamente. @es
label: Agregar @es

Has personal sign
sub property of: topObjectProperty
sub property of: Is related to
property disjoint with: bottomObjectProperty
type: ObjectProperty
comment: Corresponde al uso de etiquetas definidas por el usuario, que pueden servir para recoger, categorizar o distinguir etiquetas, o para estructurar su propria colección de etiquetas @es
comment: Corresponde al uso de etiquetas definidas por el usuario, que pueden servir para recoger, categorizar o distinguir etiquetas, o para estructurar su propria colección de etiquetas . @es
type: Property
comment: Correspond à l'emploi de libellés définis par un utilisateur pour rassembler, catégoriser ou distinguer des ressources voire simplement structurer sa propre collection de tags. @fr
label: Heeft een persoonlijk teken @nl
comment: Corresponds to uses of user-defined labels that can either serve to gather, categorize, distinguish resources or simply add structure to one's collection of tags.
label: Ha segno personale @it
comment: Corrisponde all'uso di tag definite dall'utente che possono servire per raccogliere, categorizzare o distinguere risorse, oppure semplicemente per strutturare la propria collezione di tag. @it
comment: Komt overeen met het gebruik van persoonlijk gedefinieerde labels die tot doel hebben bronnen te verzamelen, categoriseren en onderscheiden, of die simpelweg een verzameling tags structureren. @nl
label: Tiene signo personal @es
label: A pour signe personnel @fr

deprecated on
sub property of: topObjectProperty
property disjoint with: bottomObjectProperty
type: ObjectProperty
type: Property
domain: License
range: date

Express feelings
disjoint with: Nothing
subclass of: Item
subclass of: Tag action
subclass of: Thing
subclass of: Graph
type: Class
label: Expresar un sentimiento @es
comment: Beschrijft de handeling die verricht wordt met een tag wanneer deze gebruikt wordt om een gevoel, emotie, etc. uit te drukken. @nl
comment: Décrit l'action que l'on accomplit avec un tag dès lors que celui-ci est utilisé pour exprimer un sentiment, une émotion, etc. @fr
label: Exprimer un ressenti @fr
label: Esprimere un sentimento @it
comment: Descrive l'azione che si compie con una tag quando questa è usata per esprimere un sentimento, un'emozione, ecc. @it
comment: Describes the action that is performed with a tag whenever it is used to express a feeling, an emotion, etc.
comment: Describe la acción que se realiza con una etiqueta cuando es usada para expresar un sentimiento, una emoción, etc. @es
label: Gevoelens uitdrukken @nl

Syntactic Tag Action
disjoint with: Nothing
subclass of: Item
subclass of: Tag action
subclass of: Thing
subclass of: Graph
type: Class
label: Acción de etiquetado sintáctica @es
label: Azione di tagging sintattica @it
comment: Describes tags whose labels are following a given syntax for improved precision and tractability.
comment: Describe etiquetas cuyo texto sigue una sintaxis determinada para una mayor precisión y tratabilidad. @es
comment: Décrit des tags dont les libellés mobilisent une certaine syntaxe pour accroître leur précision et leur capacité à être manipulés. @fr
label: Acte de taguer syntaxique @fr
label: Syntactische taghandeling @nl
comment: Descrive delle tag il cui testo segue una sintassi determinata per ottenere maggiore precisione e trattabilità. @it
comment: Beschrijft tags waarvan de labels van een bepaalde syntaxis gebruik maken om de precisie en manipuleerbaarheid te vergroten. @nl

Is relevant to something
sub property of: topObjectProperty
sub property of: isRelevantTo
property disjoint with: bottomObjectProperty
type: ObjectProperty
comment: Subproperty of 'is relevant to', used to link a resource to anything that it may be relevant to. In other words, in such a way that no immediate formal link can be inferrend between the two except from the point of view of the creator of the said link.
comment: Sotto-proprietà di 'isRelevantTo' usata per associare una risorsa a qualsiasi cosa che possa essere pertinente, in modo che nessun collegamento formale immediato possa essere inferito fra i due, eccetto dal punto di vista del creatore di tale collegamento. @it
label: Es pertinente para algo @es
label: Is relevant met betrekking tot iets @nl
comment: Deeleigenschap van ‘isRelevantTo’, gebruikt om een verband te leggen tussen de bron en iets anders, waarbij geen formeel verband is vast te stellen behalve vanuit het gezichtspunt van degene die dit verband legt. @nl
type: Property
comment: Sous-propriété de "isRelevantTo', utilisée pour lier quoi que ce soit à une ressource de telle manière qu'aucun lien immédiat formel ne puisse être inféré entre les deux excepté du point de vue du créateur d'un tel lien. @fr
label: Est pertinent par rapport à quelque chose @fr
label: È pertinente a qualcosa @it
comment: Sub-propriedad de 'isRelevantTo' usada para asociar un recurso a qualquier cosa para la que pueda ser pertinente, de manera que ningun enlace formal inmediato pueda ser inferido entre los dos, excepto desde el punto de vista del creador de esa asociación. @es

Can be read by
sub property of: topObjectProperty
sub property of: Is related to
property disjoint with: bottomObjectProperty
type: ObjectProperty
comment: Eigenschap die gebruikt wordt wanneer het label van een tag aangeeft aan wie toegangsrechten tot de getagde bron worden toegekend. @nl
type: Property
domain: WebRepresentation
range: Person
label: Puede ser leído por @es
comment: Property used when the label of a tag indicates to whom access rights to the tagged resource are conferred.
label: Può essere letto da @it
comment: Corresponde al uso de etiquetas cuyo contenido indica el destinatario al cual vienen conferidos derechos de acceso a un recurso. @es
comment: Corrisponde all'uso di tag il cui contenuto indica il destinatario a cui vengono conferiti diritti di accesso a una risorsa. @it
label: Kan gelezen worden door @nl
label: Peut être lu par @fr
comment: Corresponds à l'utilisation de tags dont le libellé indique le destinataire auquel des droits d'accès définis sur une ressource donnée ont été octroyés. @fr

Raises question about
sub property of: topObjectProperty
sub property of: Is related to
property disjoint with: bottomObjectProperty
type: ObjectProperty
comment: Propriedad usada cuando el contenido de una etiqueta indica que se esta planteando una pregunta. @es
label: Plantea una cuestión sobre @es
comment: Propriété utilisée quand le libellé d'un tag indique qu'une question est posée. @fr
comment: Eigenschap die gebruikt wordt wanneer het label van een tag aangeeft dat een vraag gesteld wordt. @nl
label: Roept vragen op over @nl
comment: Proprietà usata quando il contenuto di una tag indica che si sta ponendo una domanda. @it
label: Solleva una domanda su @it
label: Soulève une interrogation au sujet de @fr
type: Property
comment: Property used when the label of a tag indicates that a question is being asked.

Subject
property disjoint with: bottomObjectProperty
modified: 2012-06-14
sub property of: topObjectProperty
type: ObjectProperty
note: A second property with the same name as this property has been declared in the dcterms: namespace (http://purl.org/dc/terms/). See the Introduction to the document "DCMI Metadata Terms" (http://dublincore.org/documents/dcmi-terms/) for an explanation.
type: Thing
description: Typically, the subject will be represented using keywords, key phrases, or classification codes. Recommended best practice is to use a controlled vocabulary.
has version: subject-007
issued: 1999-07-02
type: Property
comment: The topic of the resource.

Copyleft
type: Requirement
type: Thing
comment: derivative and combined works must be licensed under specified terms, similar to those on the original work

Tag action
disjoint with: Nothing
subclass of: Item
subclass of: Thing
subclass of: Graph
type: Class
label: Acte de taguer @fr
comment: A super class to describe every tag action as modelled by a named graph according to RDF Graph model (RDFG).
label: Taghandeling @nl
label: Acción de etiquetado @es
union of: http://lodlaundromat.org/.well-known/genid/samples/pellet///predicate//0b7a6cec83cd7a6ef81ffd016aefb0e4/0b7a6cec83cd7a6ef81ffd016aefb0e4#1
comment: Une super-classe qui permet de décrire et de modéliser les actes de taguer à l'aide d'un graphe nommé et au moyen du modèle de graphe RDF (RDFG). @fr
comment: Een overkoepelende categorie die toestaat elke taghandeling te beschrijving als een gelabelde graaf binnen het RDF graph model (RDFG). @nl
union of: http://lodlaundromat.org/.well-known/genid/0b7a6cec83cd7a6ef81ffd016aefb0e4#1
comment: Una super-clase que permite describir y modelar cada acción de etiquetado utilizando un named graph según el modelo del grafo RDF (RDFG). @es
label: Azione di tagging @it
comment: Una super-classe che permette di descrivere e di modellare ogni azione di tagging con un named graph secondo il modello del grafo RDF (RDFG). @it

Cannot be read by
sub property of: topObjectProperty
sub property of: Is related to
property disjoint with: bottomObjectProperty
type: ObjectProperty
label: Kan niet gelezen worden door @nl
comment: Proprietà usata quando il contenuto di una tag indica il destinatario a cui sono negati diritti di accesso a una risorsa. @it
domain: WebRepresentation
label: Non può essere letto da @it
comment: Eigenschap die gebruikt wordt wanneer het label van een tag aangeeft aan wie de toegangsrechten tot de getagde bron worden ontzegd. @nl
comment: Propriété utilisée quand le libellé d'un tag indique le destinataire auquel des droits d'accès définis sur une ressource donnée ont été déniés. @fr
range: Person
label: No puede ser leído por @es
comment: Property used when the label of a tag indicates to whom access right to the tagged resource are denied.
type: Property
comment: Propriedad usada cuando el contenido de una etiqueta indica el destinatario al cual se han negado derechos de acceso a un recurso. @es
label: Ne peut être lu par @fr

Visitor tag action
disjoint with: Nothing
disjoint with: Owner tag action
subclass of: Item
subclass of: Tag action
subclass of: Thing
subclass of: Graph
type: Class
label: Acción de etiquetado de un visitante @es
comment: Usado para describir una acción de etiquetado realizada por una persona que ha tenido acceso a la representación de un recurso en la Web. @es
comment: Utilisé pour décrire l'acte de taguer accompli par une personne ayant eu accès à la représentation d'une ressource sur le Web. @fr
label: Azione di tagging di un visitatore @it
comment: Beschrijft een taghandeling verricht door een bezoeker van de web-representatie van een bron. @nl
comment: Used to describe an act of tagging performed by a the person who browsed a Web representation.
label: Taghandeling bezoeker @nl
label: Acte de taguer d'un visiteur @fr
comment: Usato per descrivere un'azione di tagging svolta da una persona che ha avuto accesso alla rappresentazione di una risorsa Web. @it

Relation
property disjoint with: bottomObjectProperty
issued: 1999-07-02
type: Thing
type: ObjectProperty
modified: 2008-01-14
sub property of: topObjectProperty
has version: relation-006
note: A second property with the same name as this property has been declared in the dcterms: namespace (http://purl.org/dc/terms/). See the Introduction to the document "DCMI Metadata Terms" (http://dublincore.org/documents/dcmi-terms/) for an explanation.
description: Recommended best practice is to identify the related resource by means of a string conforming to a formal identification system.
type: Property
comment: A related resource.

Creator
type: ObjectProperty
has version: creator-006
property disjoint with: bottomObjectProperty
description: Examples of a Creator include a person, an organization, or a service. Typically, the name of a Creator should be used to indicate the entity.
issued: 1999-07-02
note: A second property with the same name as this property has been declared in the dcterms: namespace (http://purl.org/dc/terms/). See the Introduction to the document "DCMI Metadata Terms" (http://dublincore.org/documents/dcmi-terms/) for an explanation.
modified: 2008-01-14
type: Thing
sub property of: topObjectProperty
type: Property
comment: An entity primarily responsible for making the resource.

Format
type: Thing
description: Examples of dimensions include size and duration. Recommended best practice is to use a controlled vocabulary such as the list of Internet Media Types [MIME].
sub property of: topObjectProperty
property disjoint with: bottomObjectProperty
modified: 2008-01-14
issued: 1999-07-02
note: A second property with the same name as this property has been declared in the dcterms: namespace (http://purl.org/dc/terms/). See the Introduction to the document "DCMI Metadata Terms" (http://dublincore.org/documents/dcmi-terms/) for an explanation.
has version: format-007
type: ObjectProperty
type: Property
comment: The file format, physical medium, or dimensions of the resource.

jurisdiction
sub property of: topObjectProperty
property disjoint with: bottomObjectProperty
type: ObjectProperty
type: Property
domain: License
range: Jurisdiction

Is relevant to somebody
sub property of: topObjectProperty
sub property of: isRelevantTo
property disjoint with: bottomObjectProperty
type: ObjectProperty
label: Est pertinent pour quelqu'un @fr
type: Property
comment: Subproperty of 'is relevant to' used to link a resource to the person whom it may be relevant to. In other words, in such a way that no immediate formal link can be inferred between the two except from the point of view of a precise person in addition to the user who defined the said link.
comment: Sub-propriedad de 'isRelevantTo' usada para asociar un recurso a la persona para la que puede ser pertinente, de manera que ningun enlace formal inmediato pueda ser inferido entre los dos, excepto desde el punto de vista del creador de esa asociación. @es
range: Person
label: Es pertinente para alguien @es
comment: Sous-propriété de 'isRelevantTo', utilisée pour associer une ressource à une personne de telle manière qu'aucun lien formel ne puisse être inféré entre les deux excepté du point de vue du destinataire et du destinateur du tag. @fr
label: È pertinente a qualcuno @it
comment: Deeleigenschap van ‘isRelevantTo’, gebruikt om een verband tot stand te brengen tussen een bron en de persoon waar het betrekking tot kan hebben. In een zodanige vorm dat er geen onmiddelijke formele relatie tussen de twee afgeleid kan worden behalve vanuit het gezichtspunt van een specifiek persoon en de gebruiker die dit verband gelegd heeft. @nl
comment: Sotto-proprietà di 'isRelevantTo' usata per associare una risorsa alla persona a cui può essere pertinente, in modo tale che nessun collegamento formale immediato possa essere inferito fra i due, eccetto dal punto di vista del creatore di tale collegamento @it
label: Is relevant voor iemand @nl

Has part
sub property of: topObjectProperty
sub property of: Is related to
property disjoint with: bottomObjectProperty
type: ObjectProperty
comment: Proprietà usata quando il contenuto di una tag indica quale parte della rappresentazione di una risorsa su Web è taggata. @it
label: A pour partie @fr
comment: Property used when the label of a tag indicates which part of a Web representation is being tagged.
type: Property
label: Ha come parte @it
comment: Propriété utilisée quand le libellé d'un tag indique quelle partie de la représentation d'une ressource sur le Web est taguée. @fr
range: Part Of Web representation
label: Heeft als deel @nl
comment: Propriedad usada cuando el contenido de una etiqueta indica que parte de la representación de un recurso en la Web ha sido etiquetada. @es
label: Tiene como parte @es
comment: Eigenschap die gebruikt wordt wanneer het label van een tag aangeeft welk gedeelte van een web-representatie getagd wordt. @nl
domain: WebRepresentation

Source
property disjoint with: bottomObjectProperty
issued: 1999-07-02
type: Thing
description: The described resource may be derived from the related resource in whole or in part. Recommended best practice is to identify the related resource by means of a string conforming to a formal identification system.
sub property of: topObjectProperty
modified: 2008-01-14
note: A second property with the same name as this property has been declared in the dcterms: namespace (http://purl.org/dc/terms/). See the Introduction to the document "DCMI Metadata Terms" (http://dublincore.org/documents/dcmi-terms/) for an explanation.
has version: source-006
type: ObjectProperty
type: Property
comment: A related resource from which the described resource is derived.

Description
modified: 2008-01-14
has version: description-006
note: A second property with the same name as this property has been declared in the dcterms: namespace (http://purl.org/dc/terms/). See the Introduction to the document "DCMI Metadata Terms" (http://dublincore.org/documents/dcmi-terms/) for an explanation.
sub property of: topDataProperty
type: Thing
issued: 1999-07-02
type: DatatypeProperty
description: Description may include but is not limited to: an abstract, a table of contents, a graphical representation, or a free-text account of the resource.
property disjoint with: bottomDataProperty
type: Property
comment: An account of the resource.

Web concept tag action
disjoint with: Nothing
subclass of: Item
subclass of: Tag action
subclass of: Thing
subclass of: Graph
type: Class
label: Acción de etiquetado con Web concept @es
label: Azione di tagging con Web concept @it
label: Taghandeling met webconcept @nl
comment: Usata per descrivere un'azioni di tagging effettuata con l'aiuto di un concetto Web (per esempio geonames). @it
comment: Wordt gebruikt om taghandelingen te beschrijven waarbij gebruikt gemaakt woord van webconcepten (zoals geonames). @nl
comment: Usada para describir una acción de etiquetado realizada con la ayuda de un concepto Web (por ejemplo geonames). @es
comment: Utilisé pour décrire un taggage effectué à l'aide de concepts Web (tels que geonames). @fr
label: Acte de taguer par concept Web @fr
comment: Describes tagging involving Web concepts (such as geonames).

Requirement
disjoint with: Nothing
equivalent class: Requirement
subclass of: Thing
subclass of: Requirement
type: Class
comment: an action that may or may not be requested of you

Derivative Works
type: Permission
subclass of: DerivativeWorks
subclass of: Thing
type: Class
equivalent class: DerivativeWorks
disjoint with: Nothing
type: Thing
comment: distribution of derivative works

Commercial Use
type: Class
subclass of: CommercialUse
disjoint with: Nothing
subclass of: Thing
type: Prohibition
equivalent class: CommercialUse
type: Thing
comment: exercising rights for commercial purposes

Sent to
sub property of: topObjectProperty
sub property of: Is related to
property disjoint with: bottomObjectProperty
type: ObjectProperty
label: Envoyé à @fr
comment: Propriété utilisée quand le libellé d'un tag indique à quel utilisateur une ressource a été suggérée (modélise des fonctionalités existantes telles que les tags "for:-username" sur Delicious). @fr
comment: Propriedad usada cuando el contenido de una etiqueta indica a que usuario un recurso ha sido sugerido (modeliza funcionalidades existentes como las etiquetas "for:usuario" en Delicious). @es
comment: Proprietà usata quando il contenuto di una tag indica a quale utente una risorsa è stata suggerita (modellizza funzionalità esistenti come le tag "for:utente" in Delicious). @it
comment: Property used when the label of a tag indicates to whom a resource was suggested (models existing features like delicious "for:-username" tags).
label: Inviato a @it
label: Enviado a @es
range: UserAccount
comment: Eigenschap die gebruikt wordt wanneer het label van een tag aangeeft aan wie de bron is voorgesteld (modelleert bestaande functionaliteit zoals de "for:-username" tags op Delicious). @nl
domain: WebRepresentation
type: Property
label: Verstuurd aan @nl

Community tag collection
disjoint with: Nothing
subclass of: Tag collection
subclass of: Thing
type: Class
comment: Una colección de etiquetas generada por los usuarios de una comunidad en linea o de un servicio Web dados. @es
label: Colección de etiquetas comunitaria @es
comment: Une collection de tag constituée par les utilisateurs d'une communauté ou d'un service donnés. @fr
label: Collection de tags communautaire @fr
label: Collezione di tag comunitaria @it
comment: Una collezione di tag generata dagli utenti di una comunità online o di un servizio Web dati. @it
comment: Een verzameling tags die gegenereerd is door een groep gebruikers van een gemeenschap of digitale dienst. @nl
label: Gemeenschapstagverzameling @nl
comment: A collection of tags generated by the users of a given online community or Web service.

Reproduction
type: Class
type: Permission
equivalent class: Reproduction
disjoint with: Nothing
type: Thing
subclass of: Thing
subclass of: Reproduction
comment: making multiple copies

Evaluate
disjoint with: Nothing
subclass of: Item
subclass of: Tag action
subclass of: Thing
subclass of: Graph
type: Class
label: Evaluar @es
comment: Describes the action that is performed with a tag whenever it is used to give a notation, a mark of approval and disapproval, or, more generally speaking, an evaluation.
comment: Beschrijft de handeling die verricht wordt met een tag wanneer deze gebruikt wordt om een klassering, een teken van goedkeuring of afkeuring, of meer algemeen een beoordeling te geven. @nl
comment: Descrive l'azione che si compie con una tag quando questa è usata per esprimere approvazione o disapprovazione, o, più in generale, una valutazione. @it
label: Beoordelen @nl
comment: Décrit l'action que l'on accomplit avec un tag dès lors que celui-ci est utilisé pour donner une note, marquer son approbation ou sa désapprobation ou, plus généralement, produirez une évaluation. @fr
label: Evaluer @fr
comment: Describe la acción que se realiza con una etiqueta cuando es usada para expresar aprobación o desaprobación o, mas en general, una evaluación. @es
label: Valutare @it

prohibits
sub property of: topObjectProperty
property disjoint with: bottomObjectProperty
sub property of: prohibits
equivalent property: prohibits
type: ObjectProperty
type: Property
domain: License
range: Prohibition

Manual tag action
disjoint with: Nothing
subclass of: Item
subclass of: Tag action
subclass of: Thing
subclass of: Graph
type: Class
label: Azione di tagging manuale @it
label: Handmatige taghandeling @nl
comment: Descrive delle tag associate manualmente a una risorsa da un essere umano. @it
label: Acción de etiquetado manual @es
comment: Describes tags as manually associated to a resource by a human.
comment: Describe etiquetas asociadas manualmente a un recurso por un ser humano. @es
comment: Décrit des tags associés manuellement à une ressource par un être humain. @fr
label: Acte de taguer manuel @fr
comment: Beschrijft tags als handmatig met een bron geasssocieerd door een mens @nl

Distribution
type: Permission
disjoint with: Nothing
type: Class
type: Thing
subclass of: Thing
subclass of: Distribution
equivalent class: Distribution
comment: distribution, public display, and publicly performance

Contributor
issued: 1999-07-02
type: Thing
type: ObjectProperty
property disjoint with: bottomObjectProperty
modified: 2008-01-14
description: Examples of a Contributor include a person, an organization, or a service. Typically, the name of a Contributor should be used to indicate the entity.
sub property of: topObjectProperty
note: A second property with the same name as this property has been declared in the dcterms: namespace (http://purl.org/dc/terms/). See the Introduction to the document "DCMI Metadata Terms" (http://dublincore.org/documents/dcmi-terms/) for an explanation.
has version: contributor-006
type: Property
comment: An entity responsible for making contributions to the resource.

permits
sub property of: topObjectProperty
property disjoint with: bottomObjectProperty
sub property of: permits
equivalent property: permits
type: ObjectProperty
type: Property
domain: License
range: Permission

È pertinente
sub property of: topObjectProperty
sub property of: Is related to
property disjoint with: bottomObjectProperty
type: ObjectProperty
comment: Propriété utilisée pour subsumer "isRelevantToSb" et "isRelevantToSt". @fr
comment: Proprietà usata per sussumere "isRelevantToSb" e "isRelevantToSt". @it
type: Property
label: Is relevant
comment: Eigenschap die gebruikt wordt om "isRelevantToSb" en "isRelevantToSt" onder één noemer te brengen. @nl
comment: Property used to subsume "isRelevantToSb" and "isRelevantToSt".
label: Est pertinent @fr
label: Es pertinente @es
comment: Propriedad usada para subsumir "isRelevantToSb" y "isRelevantToSt". @es

Share Alike
type: Requirement
type: Class
equivalent class: ShareAlike
subclass of: Thing
type: Thing
disjoint with: Nothing
subclass of: ShareAlike
comment: derivative works be licensed under the same terms or compatible terms as the original work

Permission
disjoint with: Nothing
equivalent class: Permission
subclass of: Thing
subclass of: Permission
type: Class
comment: an action that may or may not be allowed or desired

Nice Tag Ontology
description: NiceTag è un'ontologia che descrive nel modo più generale possibile le tag, o meglio le azioni di tagging, come atti linguistici nel Web @it
title: L'ontologia Nice Tag @it
title: La ontología Nice Tag @es
attribution URL: http://ns.inria.fr/nicetag/
Type: Text
licence: http://creativecommons.org/licenses/by-sa/3.0/
description: NiceTag is een ontologie die zo algemeen mogelijk tags beschrijft, of meer precies de handeling van het taggen. NiceTag beschrijft de handeling van het taggen als een op het web plaats vindende taalhandeling. @nl
description: NiceTag est une ontologie décrivant le plus généralement possible les tags ou plutôt les actes de taguer comme des actes de langage survenant sur le Web @fr
type: Work
title: Nice Tag ontologie @nl
type: Thing
description: NiceTag es una ontología que describe de la manera mas general posible las etiquetas, o mejor las acciones de etiquetado, como actos de habla en la Web @es
title: L'Ontologie Nice Tag @fr
description: NiceTag Ontology is an ontology which describes as generally as possible tags or rather tag actions understood as a speech acts occurring on the Web
version info: Version 0.5, 09 september 2010
type: Ontology

Date
has version: date-006
modified: 2008-01-14
description: Date may be used to express temporal information at any level of granularity. Recommended best practice is to use an encoding scheme, such as the W3CDTF profile of ISO 8601 [W3CDTF].
sub property of: topObjectProperty
type: ObjectProperty
note: A second property with the same name as this property has been declared in the dcterms: namespace (http://purl.org/dc/terms/). See the Introduction to the document "DCMI Metadata Terms" (http://dublincore.org/documents/dcmi-terms/) for an explanation.
property disjoint with: bottomObjectProperty
type: Thing
issued: 1999-07-02
type: Property
comment: A point or period of time associated with an event in the lifecycle of the resource.

Notice
subclass of: Notice
equivalent class: Notice
type: Thing
type: Requirement
disjoint with: Nothing
type: Class
subclass of: Thing
comment: copyright and license notices be kept intact

Rights
type: Thing
property disjoint with: bottomObjectProperty
has version: rights-006
description: Typically, rights information includes a statement about various property rights associated with the resource, including intellectual property rights.
issued: 1999-07-02
sub property of: topObjectProperty
note: A second property with the same name as this property has been declared in the dcterms: namespace (http://purl.org/dc/terms/). See the Introduction to the document "DCMI Metadata Terms" (http://dublincore.org/documents/dcmi-terms/) for an explanation.
type: ObjectProperty
modified: 2008-01-14
type: Property
comment: Information about rights held in and over the resource.

Tag collection
disjoint with: Nothing
subclass of: Thing
type: Class
comment: Una generica collezione di tag. @it
label: Tagverzameling @nl
label: Collection de tags @fr
comment: Undefined collection of tags.
comment: Une collection de tags ne répondant à aucune définition particulière. @fr
label: Colección de etiquetas @es
comment: Een verzameling tags zonder verdere specifieke definitie. @nl
label: Collezione di tag @it
comment: Una genérica colección de etiquetas. @es

Belongs to tag collection
sub property of: topObjectProperty
property disjoint with: bottomObjectProperty
type: ObjectProperty
type: Property
comment: Propriedad usada para asociar una singola acción de etiquetado a una colección de etiquetas, con el objetivo de dar cuenta de los diferentes niveles de agregación proporcionados por los servicios de etiquetado existentes. Hay varias maneras de agregar la etiquetas (por ejemplo, http://delicious.com/fabion_gandon/OWL permite de acceder a una reppresentación de todas las acciones de etiquetado realizadas por el titular de la cuenta "fabien_gandon", en las cuales aparece la etiqueta "OWL" en del.icio.us.com en un instante "t"). @es
label: Appartient à une collection de tags @fr
domain: Tag action
range: Tag collection
comment: Proprietà usata per associare una singola azione di tagging a una collezione di tag, con lo scopo di rendere conto dei vari livelli di aggregazione forniti dai servizi di tagging esistenti. Ci sono vari modi di aggregare delle tag (per esempio, http://delicious.com/fabion_gandon/OWL permette di accedere a una rappresentazione di tutte le azioni di tagging svolte dal titolare dell'account "fabien_gandon", nelle quali compare la tag "OWL" su del.icio.us.com in un istante "t"). @it
comment: Eigenschap die gebruikt wordt om een enkelvoudige taghandeling te koppelen aan een tagverzameling, zo rekenschap gevende van de verschillende niveaus waarop veelgebruikte tagdiensten tags bijeenverzamelen (http://delicious.com/fabion_gandon/OWL bijvoorbeeld, geeft een webrepresentatie van alle taghandelingen van de gebruiker "fabian_gandon" waar op een moment "t" het label "OWL" is gebruikt). @nl
comment: Propriété employée pour associer un acte de taguer singulier à une collection de tags. Ceci sert à rendre compte des multiples manières d'aggréger les tags offertes par les différents services existants (l'URI http://delicious.com/fabion_gandon/OWL permet par exemple d'accéder à une représentation de tous les actes de taguer accomplis par le titulaire du compte "fabien_gandon" où figure le libellé "OWL" sur delicious.com à un instant "t"). @fr
label: Pertenece a una colección de etiquetas @es
label: Appartiene a una collezione di tag @it
comment: Property used to link a single and well individuated TagAction to a TagCollection to account for the various levels of aggregation provided by common tagging applications. There exist different ways to aggregate tags (for instance, http://delicious.com/fabion_gandon/OWL gives a Web representation of all taggings of user "fabien_gandon" involving the tag labeled 'OWL' on delicious.com at time "t").
label: Behoort toe aan tagverzameling @nl

Dublin Core Metadata Element Set, Version 1.1
modified: 2012-06-14
publisher: DCMI
type: Thing

Title
type: DatatypeProperty
note: A second property with the same name as this property has been declared in the dcterms: namespace (http://purl.org/dc/terms/). See the Introduction to the document "DCMI Metadata Terms" (http://dublincore.org/documents/dcmi-terms/) for an explanation.
issued: 1999-07-02
type: Thing
modified: 2008-01-14
sub property of: topDataProperty
property disjoint with: bottomDataProperty
has version: title-006
type: Property
comment: A name given to the resource.

Has community sign
sub property of: topObjectProperty
sub property of: Is related to
property disjoint with: bottomObjectProperty
type: ObjectProperty
comment: Corresponds to uses of collectively approved labels shared inside a community.
label: A pour signe collectif @fr
comment: Corresponde al uso de etiquetas elegidas por una comunidad. @es
type: Property
comment: Komt overeen met collectief afgestemd gebruik van door een gemeenschap gekozen labels. @nl
comment: Corrisponde all'uso di tag scelte da una comunità. @it
label: Ha segno collettivo @it
label: Heeft een gemeenschappelijk teken @nl
label: Tiene signo colectivo @es
comment: Correspond à des usages collectivement constitués de libellés choisis par une communauté. @fr

High Income Nation Use
type: Prohibition
type: Thing
comment: use in a non-developing country

Auto tag action
disjoint with: Nothing
subclass of: Item
subclass of: Tag action
subclass of: Thing
subclass of: Graph
type: Class
label: Azione di tagging automatica @it
comment: Descrive delle tag generate e/o associate automaticamente a una risorsa da un computer. @it
label: Acte de taguer automatique @fr
comment: Décrit des tags générés et/ou associés automatiquement à une ressource par une machine. @fr
label: Geautomatiseerde taghandeling @nl
comment: Describe etiquetas generadas y/o asociadas manualmente a un recurso por un ordenador. @es
comment: Describes tags as automatically generated and/or associated to a resource by a computer.
label: Acción de etiquetado automática @es
comment: Beschrijft tags als zijnde gegenereerd en/of automatisch met een bron geasoccieerd, door een computerprogramma. @nl

Annotated resource
disjoint with: Nothing
equivalent class: WebRepresentation
subclass of: Thing
subclass of: WebRepresentation
type: Class
comment: Usato per rappresentare la realizzazione di una risorsa informazionale accessibile sul Web mediante il protocollo HTTP. La risorsa annotata è quella che generalmente provaoca l'azione di tagging. Essendo per definizione dereferenziabile, fornisce anche l'indirizzo che sarà salvato su sistemi di bookmarking come delicious, e che avrà funzione di ancoraggio per le tag. In ogni caso, la risorsa taggata non è limitata a dati accessibili sul Web (ciò che è taggato può anche essere ciò che la rappresentazione Web di una risorsa rappresenta, per esempio una risorsa non-informazionale, piuttosto che la sua rappresentazione) @it
comment: Utilisé pour représenter la réalisation d'une ressource informationnelle accessible sur le Web via le protocole HTTP. La ressource annotée, consultable en ligne, est celle-là même qui déclenche généralement l'acte de taguer. En quoi d'ailleurs elle est l'équivalent de la classe irw:WebRepresentation. Etant par définition déréférençable, elle fournit également l'adresse qui servira d'ancrage aux tags par l'intermédiaire du signet, selon le modèle proposé par delicious. Par contraste, la ressource taguée n'est, quant à elle, aucunement limitée à des données accessibles sur le Web (ce qui est taguée peut bien se révéler ne pas être autre chose que ce que la représentation d'un ressource représente, une ressource non-informationnelle par exemple, plutôt que cette représentation elle-même). @fr
comment: Usado para representar la realización de un recurso informacional accesible en la Web mediante el protocolo HTTP. El recurso anotado es aquel que generalmente provoca la acción de etiquetado. Siendo por definición dereferenciable, dota tambien de la dirección que quedarà guardada en sistemas de "bookmarking" como delicious, y que tendrà una función de anclaje para las etiqueta. De todas maneras, el recurso etiquetado no se limita a los datos accesibles en la Web (aquello que es etiquetado puede ser también lo que la representación Web de un recurso representa, por ejemplo un recurso no-informacional, en lugar de su representación) @es
label: Bron met aantekeningen @nl
label: Ressource annotée @fr
comment: Wordt gebruikt om een via het HTTP protocol op het web toegankelijke informatiebron te representeren. De bron met annototies, online beschikbaar en gelijkwaardig aan een irw:WebRepresentation, is wat aanzet tot de taghandeling. Aangezien de bron via het web toegankelijk is, is het per definitie mogelijk om ernaar te verwijzen, dus de bron levert ook het adres dat gebookmarkt kan worden en als anker voor de tags dient. Echter, de bron die getagd wordt is op geen enkele wijze beperkt tot http-toegankelijke data (wat getagd wordt is hetgen waar de web-representatie voor staat, bijvoorbeeld een non-informatie bron, en niet de representatie zelf). @nl
comment: Used to represent the HTTP-accessible realization of an information resource on the Web. The equivalent of irw:WebRepresentation, the Annotated Resource is that which generally triggers the act of tagging. Being dereferenceable by definition, it also provides the address that will be bookmarked on delicious-like sites and work like an anchor for tags. This said, the resource being tagged is in no way limited to HTTP-accessible data (indeed, what supports an act of tagging may very well be what the Web representation represents, a non-information resource for example, instead of the Web representation itself).
label: Recurso anotado @es
label: Risorsa annotata @it

Type
type: Thing
sub property of: topObjectProperty
note: A second property with the same name as this property has been declared in the dcterms: namespace (http://purl.org/dc/terms/). See the Introduction to the document "DCMI Metadata Terms" (http://dublincore.org/documents/dcmi-terms/) for an explanation.
property disjoint with: bottomObjectProperty
type: ObjectProperty
issued: 1999-07-02
has version: type-006
description: Recommended best practice is to use a controlled vocabulary such as the DCMI Type Vocabulary [DCMITYPE]. To describe the file format, physical medium, or dimensions of the resource, use the Format element.
modified: 2008-01-14
type: Property
comment: The nature or genre of the resource.

Sent by
sub property of: topObjectProperty
sub property of: Is related to
property disjoint with: bottomObjectProperty
type: ObjectProperty
comment: Komt overeen met het gebruik van labels die aangeven door wie deze bron is voorgesteld. @nl
comment: Corrisponde all'uso di tagche indicano da chi è stata suggerita una risorsa. @it
type: Property
domain: WebRepresentation
comment: Correspond à l'utilisation de signes qui indiquent à qui une ressource a été suggérée. @fr
range: UserAccount
label: Enviado por @es
comment: Corresponds to uses of labels that indicate by whom a resource was suggested.
label: Inviato da @it
label: Envoyé par @fr
label: Verstuurd door @nl
comment: Corresponde al uso de etiquetas que indican por quien ha sido sugerido un recurso. @es

Share
disjoint with: Nothing
subclass of: Item
subclass of: Tag action
subclass of: Thing
subclass of: Graph
type: Class
comment: Describe la acción que se realiza con una etiqueta cuando es usada para compartir la representación de un recurso en un servicio Web, por ejemplo Delicious o Twitter, con el titular de una cuenta en este servicio (sioc:UserAccount, que no es necesariamente una foaf:Person, porqué puede ser también un robot o una institución cuyos representantes pueden variar en el tiempo. @es
label: Condividere @it
comment: Describes the action that is performed with a tag whenever it is used to share the representation of a WebResource on various services - Twitter or Delicious for instance - with the owner of a sioc:UserAccount (not necessarily a foaf:Person as it might be either a bot, a person or an institution whose representatives may well vary over time).
label: Compartir @es
comment: Descrive l'azione che si compie con una tag quando questa è usata per condividere la rappresentazizone di una risorsa su uno specifico servizio Web, per esempio Delicious o Twitter, con il titolare di un account su tale servizio (sioc:UserAccount, che non è necessariamente una foaf:Person, ma può trattarsi anche di un robot, o di una istituzione i cui rappresentanti possono variare nel tempo). @it
label: Partager @fr
comment: Beschrijft de handeling die verricht wordt met een tag wanneer deze gebruikt wordt om de representatie van een bron op het web te delen met een gebruiker van een dienst als Twitter of Delicious. (sioc:UserAccount, wat niet per se een foaf:Person is aangezien het ook om een bot kan gaan of een instelling die met het verlopen van de tijd door verschillende personen vertegenwoordigd kan worden). @nl
label: Delen @nl
comment: Décrit l'action que l'on accomplit avec un tag dès lors que celui-ci est utilisé pour partager une représentation d'une ressource sur le Web, notamment sur Delicious ou Twitter. Ce partage ne se fait pas nécessairement avec une autre personne mais plutôt avec le titulaire d'un compte sur l'un ou l'autre de ces services (sioc:UserAccount, qui n'est pas nécessairement une foaf:Person étant donné qu'il peut s'agir aussi bien d'un robot, d'une personne ou encore d'une institution dont les représentants sont potentiellement amenés à varier au fil du temps). @fr

Machine tag action
subclass of: Tag action
subclass of: Graph
type: Thing
subclass of: Syntactic Tag Action
subclass of: Thing
disjoint with: Nothing
subclass of: Item
type: Class
label: Acte de taguer avec machine tag @fr
comment: Décrit des tags dont les libellés mobilisent la syntaxe des machine tags telle qu'implémentée d'abord sur le site Flickr.com. @fr
comment: Describes tags whose labels are using the syntax of machine tags as implemented first in Flickr.com.
comment: Describe etiquetas cuyo texto sigue la sintaxis de las machine tag como implementada en Flickr.com. @es
label: Azione di tagging con machine tag @it
comment: Beschrijft tags waarvan de labels gebruik maken van de machine-tag syntaxis, zoals voor het eerst geimplementeerd op flickr.com. @nl
comment: Descrive delle tag il cui testo segue la sintassi delle machine tag come implementata su Flickr.com. @it
label: Taghandeling met machinetag @nl
label: Acción de etiquetado con machine tag @es

Is worth
sub property of: topObjectProperty
sub property of: Is related to
property disjoint with: bottomObjectProperty
type: ObjectProperty
type: Property
comment: Property used whenever a resource is evaluated, ranked, etc. thanks to a label ("***", "5/10", "0", "best", etc.).
label: Ha valore @it
comment: Propriedad usada para indicar que un recurso es evaluado, clasificado, etc., por medio del contenido de una etiqueta ("***", "5/10", "0", "best", etc.). @es
comment: Proprietà usata per indicare che una risorsa è valutata, classificata, ecc. per mezzo del contenuto di una tag ("***", "5/10", "0", "best", etc.). @it
comment: Propriété utilisée pour indiquer qu'une ressource est évaluée, classée, etc. à l'aide d'un libellé ("***", "5/10", "0", "le meilleur", etc.). @fr
label: Is waaard @nl
comment: Eigenschap die gebruikt wordt op het moment dat een een bron wordt gewaardeerd, geklassificeerd met een label ("***", "5/10", "0", "het beste", etc.). @nl
label: Tiene valor @es
label: Vaut @fr

Sharing
type: Thing
type: Permission
comment: permits commercial derivatives, but only non-commercial distribution

Jurisdiction
disjoint with: Nothing
subclass of: Thing
type: Class
comment: the legal jurisdiction of a license