Is related to
sub property of: topObjectProperty
property disjoint with: bottomObjectProperty
type: ObjectProperty
label: Está relacionado con @es
comment: Wordt gebruikt om een bron met een teken te verbinden. Dit teken kan om het even welk type zijn zolang de representatie toegankelijk is via een URI over HTTP. NiceTag definieert tags door een eigenschap die twee bronnen verbindt. Toch kunnen veel van de onderscheiden die te vinden zijn in de IRW ontologie gebruikt worden om een meer precies beeld te krijgen van nt:TaggedResource (in het bijzonder de klasse irw:Resource). @nl
label: È connesso con @it
comment: Usato per associare una risorsa a un segno che può essere, di per sè, di qualsiasi tipo, purchè la sua rappresentazione, identificata da un URI, sia accessibile tramite il protocollo HTTP. NiceTag definisce le tag per mezzo di una proprietà che associa due risorse; l'ontologia IRW permette di comprendere più precisamente il significato di nt:TaggedResource (in particolare la classe irw:Resource). @it
label: Est relié à @fr
comment: Used to link a resource to a sign, which can itself, be of any type, provided its representation is HTTP accessible from a URI. NiceTag defines tags by means of a mere property linking two Resources; this said, the many distinctions found in IRW ontology give a more precise account of nt:TaggedResource (see in particular irw:Resource).
type: Property
comment: Utilisé pour lier une ressource à un signe qui, lui-même, peut être de n'importe quel type pourvu que sa représentation, identifiée par une URI, soit accessible via le protocole HTTP. NiceTag définit les tags au moyen d'une propriété qui relie deux Resource; toutefois, l'ontologie IRW permet de comprendre plus précisément la signification de nt:TaggedResource (en particulier la classe irw:Resource). @fr
comment: Usado para asociar un recurso a un signo que puede ser, en sí mismo, de qualquier tipo, con tal que su representación, identificada por un URI, sea accesible mediante el protocolo HTTP. NiceTag define las etiquetas por medio de una propiedad que asocia dos recursos; la ontologia IRW permite comprender con mas claridad el significaso de nt:taggedResources(en especiàl la clase irw:Resource). @es
label: Houdt verband met @nl

age
term status: unstable
type: Thing
sub property of: topDataProperty
property disjoint with: bottomDataProperty
type: FunctionalProperty
type: DatatypeProperty
type: Property
comment: The age in years of some agent.
domain: Agent
range: Literal

has moderator
property disjoint with: moderator of
property disjoint with: parent of
property disjoint with: owner of
property disjoint with: account of
property disjoint with: has container
sub property of: topObjectProperty
inverse of: moderator of
property disjoint with: has scope
property disjoint with: reply of
property disjoint with: later version
property disjoint with: email
property disjoint with: previous by date
property disjoint with: has host
property disjoint with: creator of
property disjoint with: has usergroup
property disjoint with: addressed to
property disjoint with: function of
property disjoint with: previous version
property disjoint with: sibling
property disjoint with: latest version
property disjoint with: subscriber of
property disjoint with: has reply
property disjoint with: avatar
property disjoint with: next version
property disjoint with: modifier of
type: ObjectProperty
property disjoint with: administrator of
property disjoint with: has function
property disjoint with: scope of
property disjoint with: has parent
property disjoint with: has discussion
property disjoint with: attachment
property disjoint with: host of
property disjoint with: has member
property disjoint with: follows
property disjoint with: earlier version
property disjoint with: Belongs to tag collection
property disjoint with: member of
property disjoint with: reference
property disjoint with: container of
property disjoint with: has modifier
property disjoint with: embeds knowledge
property disjoint with: usergroup of
property disjoint with: about
property disjoint with: next by date
property disjoint with: has space
property disjoint with: bottomObjectProperty
comment: A UserAccount that is a moderator of this Forum.
domain: Forum
range: User Account

id
sub property of: topDataProperty
property disjoint with: bottomDataProperty
type: DatatypeProperty
comment: An identifier of a SIOC concept instance. For example, a user ID. Must be unique for instances of each type of SIOC concept within the same site.
range: Literal

Surname
term status: archaic
type: Thing
sub property of: topDataProperty
property disjoint with: bottomDataProperty
type: DatatypeProperty
type: Property
comment: The surname of some person.
domain: Person
range: Literal

maker
sub property of: topObjectProperty
equivalent property: creator
sub property of: creator
term status: stable
inverse of: made
property disjoint with: bottomObjectProperty
type: Thing
type: ObjectProperty
comment: An agent that made this thing.
domain: Thing
type: Property
range: Agent

Usergroup
disjoint with: Role
disjoint with: Tag action
disjoint with: Owner tag action
disjoint with: Express feelings
disjoint with: Evaluate
disjoint with: Aggregate
disjoint with: Syntactic Tag Action
disjoint with: Visitor tag action
disjoint with: Share
disjoint with: Space
disjoint with: N-tuple tag action
type: Class
disjoint with: Item
disjoint with: Manual tag action
subclass of: Thing
disjoint with: Thread
disjoint with: Nothing
disjoint with: Post
disjoint with: Auto tag action
disjoint with: User Account
disjoint with: Ask
disjoint with: Point
disjoint with: Assert
disjoint with: N-tuple tag action with machine tag syntax
disjoint with: Web concept tag action
disjoint with: Forum
disjoint with: Give access rights to
disjoint with: Site
disjoint with: Machine tag action
disjoint with: User
disjoint with: Disambiguate Tag Action
disjoint with: Container
disjoint with: Set task
comment: A set of UserAccounts whose owners have a common purpose or interest. Can be used for access control purposes.

Makes me feel
sub property of: topObjectProperty
sub property of: Is related to
property disjoint with: bottomObjectProperty
type: ObjectProperty
comment: Propriété utilisée pour indiquer que le libellé d'un tag dénote/exprime une réaction émotionnelle. @fr
comment: Property used to indicate that the label of a tag denotes/expresses an emotional reaction.
label: Mi suscita @it
comment: Propriedad usada para indicar que el contenido de una etiqueta denota/expresa una reacción emocional. @es
label: Maakt dat ik me voel @nl
label: Me provoca @es
comment: Proprietà usata per indicare che il contenuto di una tag denota/esprime una reazione emotiva. @it
comment: Eigenschap die gebruikt wordt om aan te geven dat het label van een tag een emotionele reactie weergeeft of uitdrukt. @nl
type: Property
label: Produit sur moi @fr

is about
sub property of: topObjectProperty
property disjoint with: bottomObjectProperty
property disjoint with: located on
property disjoint with: encoded in
inverse of: is topic of
type: ObjectProperty
domain: information resource
range: resource

N-tuple tag action
disjoint with: Usergroup
disjoint with: Space
disjoint with: Community
disjoint with: Thread
disjoint with: Forum
subclass of: Graph
disjoint with: User Account
disjoint with: User
disjoint with: Nothing
disjoint with: Role
subclass of: Item
disjoint with: Site
disjoint with: Container
subclass of: Syntactic Tag Action
subclass of: Tag action
type: Class
subclass of: Thing
label: Azione di tagging con una tag n-dimensionale @it
comment: Utilisé pour décrire des actes de taguer impliquant des tags dont les libellés ont n-dimensions (double tags, triple tags, etc.). @fr
comment: Descrive azioni di tagging basate su tag n-dimensionali (doppie tag, triple tag, ecc.). @it
comment: Describes tagging involving N-tuple tags (double tags, triple tags, etc.).
label: Acte de taguer avec un tag à n-dimensions @fr
comment: Describe acciones de etiquetado que incluyan etiquetas n-dimensionales (etiquetas dobles, triples, etc.). @es
comment: Wordt gebruikt om taghandelingen te beschrijven waarbij de labels meerdere (n) dimensies kunnen hebben (dubbele tags, driedubbele tags, etc.). @nl
label: Taghandeling met n-tuple @nl
label: Acción de etiquetado con una etiqueta n-dimensional @es

semantic web uri
subclass of: Thing
subclass of: resource
type: Class
subclass of: Tagged resource
subclass of: uri
subclass of: http://lodlaundromat.org/.well-known/genid/samples/pellet///class//0b7a6cec83cd7a6ef81ffd016aefb0e4/f32d8dc45613bef895570d2297255a7b#10
disjoint with: Nothing
subclass of: http://lodlaundromat.org/.well-known/genid/samples/pellet///class//0b7a6cec83cd7a6ef81ffd016aefb0e4/7c71b10046805dc486cf71431721ea93#10
subclass of: http://lodlaundromat.org/.well-known/genid/samples/pellet///class//0b7a6cec83cd7a6ef81ffd016aefb0e4/f32d8dc45613bef895570d2297255a7b#1
subclass of: http://lodlaundromat.org/.well-known/genid/samples/pellet///class//0b7a6cec83cd7a6ef81ffd016aefb0e4/7c71b10046805dc486cf71431721ea93#1
comment: The subset of URI that identify typically analog things. In general they identify any resource but are not directly resolvable. They do not identify an accessible information resource.They act as a virtual delegate for exactly one resource, typically analog. They cause a re-direct or any other type of mechanism that makes the web server resolve another URI that is associated with a WebReource (see range of redirectTo)

depiction
term status: testing
type: Thing
sub property of: topObjectProperty
property disjoint with: bottomObjectProperty
inverse of: depicts
type: ObjectProperty
type: Property
comment: A depiction of some thing.
domain: Thing
range: Image

geekcode
term status: archaic
type: Thing
sub property of: topDataProperty
property disjoint with: bottomDataProperty
type: DatatypeProperty
type: Property
comment: A textual geekcode for this person, see http://www.geekcode.com/geek.html
domain: Person
range: Literal

avatar
property disjoint with: has discussion
property disjoint with: has usergroup
property disjoint with: host of
property disjoint with: function of
property disjoint with: next version
property disjoint with: later version
property disjoint with: latest version
property disjoint with: has reply
property disjoint with: addressed to
property disjoint with: earlier version
property disjoint with: embeds knowledge
property disjoint with: has member
property disjoint with: has moderator
property disjoint with: sibling
sub property of: topObjectProperty
property disjoint with: has modifier
property disjoint with: previous version
property disjoint with: reference
property disjoint with: has container
property disjoint with: container of
property disjoint with: bottomObjectProperty
property disjoint with: has host
property disjoint with: space of
property disjoint with: Belongs to tag collection
property disjoint with: has scope
type: ObjectProperty
property disjoint with: has administrator
property disjoint with: usergroup of
property disjoint with: attachment
sub property of: depiction
property disjoint with: has subscriber
property disjoint with: reply of
property disjoint with: parent of
property disjoint with: about
property disjoint with: previous by date
property disjoint with: next by date
property disjoint with: has parent
comment: An image or depiction used to represent this UserAccount.
domain: User Account

requests
sub property of: topObjectProperty
property disjoint with: bottomObjectProperty
inverse of: is requested by
type: ObjectProperty
range: uri
domain: web client
comment: Expresses the notion behind of a request operation of a web client, exempliﬁed by a typical HTTP GET request.

follows
property disjoint with: next version
property disjoint with: has parent
property disjoint with: container of
property disjoint with: subscriber of
property disjoint with: attachment
property disjoint with: embeds knowledge
property disjoint with: has discussion
property disjoint with: next by date
property disjoint with: has subscriber
property disjoint with: member of
property disjoint with: previous by date
property disjoint with: Belongs to tag collection
property disjoint with: has usergroup
property disjoint with: moderator of
property disjoint with: usergroup of
property disjoint with: later version
property disjoint with: has member
property disjoint with: has function
sub property of: topObjectProperty
property disjoint with: sibling
property disjoint with: reply of
property disjoint with: space of
property disjoint with: previous version
property disjoint with: host of
property disjoint with: about
property disjoint with: has modifier
property disjoint with: reference
type: ObjectProperty
property disjoint with: function of
property disjoint with: modifier of
property disjoint with: earlier version
property disjoint with: has space
property disjoint with: has moderator
property disjoint with: has scope
property disjoint with: parent of
property disjoint with: scope of
property disjoint with: addressed to
property disjoint with: has host
property disjoint with: bottomObjectProperty
property disjoint with: latest version
property disjoint with: has container
property disjoint with: administrator of
property disjoint with: has administrator
property disjoint with: has reply
comment: Indicates that one UserAccount follows another UserAccount (e.g. for microblog posts or other content item updates).
domain: User Account
range: User Account

reference
property disjoint with: has member
property disjoint with: email
property disjoint with: creator of
property disjoint with: has host
property disjoint with: bottomObjectProperty
property disjoint with: has usergroup
property disjoint with: avatar
property disjoint with: usergroup of
property disjoint with: owner of
type: ObjectProperty
property disjoint with: follows
property disjoint with: account of
property disjoint with: has administrator
property disjoint with: container of
sub property of: topObjectProperty
property disjoint with: moderator of
property disjoint with: has scope
property disjoint with: has parent
property disjoint with: function of
property disjoint with: administrator of
property disjoint with: parent of
property disjoint with: subscriber of
property disjoint with: has moderator
property disjoint with: member of
property disjoint with: space of
property disjoint with: modifier of
property disjoint with: host of
property disjoint with: has subscriber
type: DeprecatedProperty
comment: Links either created explicitly or extracted implicitly on the HTML level from the Post.
domain: Post
version info: Renamed to sioc:links_to.

Has for medium
sub property of: topObjectProperty
sub property of: Is related to
property disjoint with: bottomObjectProperty
type: ObjectProperty
comment: Proprietà usata quando il contenuto di una tag indica il medium a cui appartiene la rappresentazione Web della risorsa a cui si accede ("forum", "vidéo", "photo", "pagina Web", "Webservice", etc.). @it
label: Est un medium de type @fr
label: È un medium di tipo @it
domain: WebRepresentation
comment: Propriété utilisée quand le libellé d'un tag indique de quel média la représentation de la ressource à laquelle on accède ressortit ("forum", "vidéo", "photo", "page Web", "Webservice", etc.). @fr
type: Property
label: Es un medium de tipo @es
comment: Property used when the label of a tag indicates the medium which an HTTP-accessible Web representation belongs to ("forum", "video", "photo", "Webpage", "Webservice", etc.).
label: Is het medium @nl
comment: Propriedad usada cuando el contenido de una etiqueta indica el medium al que pertenece la representación Web del recurso al cual se accede ("forum", "video", "foto", "página Web", "Webservice", etc.). @es
comment: Eigenschap die gebruikt wordt wanneer het label van een tag aangeeft tot welk medium een via het web toegankelijke representatie behoort ("forum", "video", "foto", "webpagina", "webdienst", etc.) @nl

Assert
disjoint with: Role
disjoint with: Forum
disjoint with: User Account
disjoint with: Usergroup
disjoint with: Community
disjoint with: Thread
disjoint with: Container
disjoint with: Nothing
disjoint with: User
subclass of: Tag action
subclass of: Item
subclass of: Graph
disjoint with: Space
subclass of: Thing
disjoint with: Site
type: Class
label: Asserter @fr
comment: Describes the action that is performed with a tag whenever it is used to assert anything about a resource.
comment: Décrit l'action que l'on accomplit avec un tag dès lors que celui-ci est utilisé pour affirmer quoi que ce soit à propos d'une ressource. @fr
label: Asserire @it
comment: Descrive l'azione che viene svolta con una tag quando questa è utilizzata per affermare qualcosa a proposito di una risorsa. @it
label: Bevestigen @nl
comment: Describe la acción realizada con una tag quando esta es usada para afirmar algo sobre un recurso. @es
comment: Beschrijft de handeling die verricht wordt met een tag wanneer deze gebruikt wordt om iets over een bron te bevestigen. @nl
label: Afirmar @es

first name
property disjoint with: content
property disjoint with: title
property disjoint with: subject
property disjoint with: content encoded
property disjoint with: description
sub property of: topDataProperty
property disjoint with: num threads
type: DatatypeProperty
property disjoint with: last item date
property disjoint with: modified at
property disjoint with: created at
property disjoint with: bottomDataProperty
property disjoint with: ip address
property disjoint with: num items
type: DeprecatedProperty
comment: First (real) name of this User. Synonyms include given name or christian name.
domain: User Account
range: Literal
version info: This property is deprecated. Use foaf:name or foaf:firstName from the FOAF vocabulary instead.

next version
property disjoint with: has scope
property disjoint with: has host
property disjoint with: space of
property disjoint with: has subscriber
property disjoint with: email
property disjoint with: has administrator
property disjoint with: usergroup of
property disjoint with: has function
property disjoint with: has usergroup
sub property of: topObjectProperty
property disjoint with: subscriber of
property disjoint with: moderator of
property disjoint with: parent of
property disjoint with: has owner
property disjoint with: host of
property disjoint with: has space
property disjoint with: member of
property disjoint with: modifier of
sub property of: later version
property disjoint with: scope of
property disjoint with: has member
property disjoint with: function of
inverse of: previous version
property disjoint with: Sent by
property disjoint with: has modifier
property disjoint with: follows
property disjoint with: account
property disjoint with: administrator of
property disjoint with: has container
property disjoint with: bottomObjectProperty
property disjoint with: has creator
property disjoint with: Sent to
property disjoint with: account of
property disjoint with: container of
property disjoint with: has parent
property disjoint with: has moderator
property disjoint with: avatar
property disjoint with: owner of
type: ObjectProperty
property disjoint with: creator of
comment: Links to the next revision of this Item or Post.
domain: Item
range: Item

Site
disjoint with: Set task
disjoint with: Machine tag action
disjoint with: Role
disjoint with: Tag action
disjoint with: Share
disjoint with: Owner tag action
disjoint with: Auto tag action
disjoint with: Point
disjoint with: N-tuple tag action with machine tag syntax
subclass of: Thing
subclass of: Space
disjoint with: User
disjoint with: Ask
disjoint with: N-tuple tag action
disjoint with: Give access rights to
disjoint with: Visitor tag action
disjoint with: Web concept tag action
type: Class
disjoint with: Disambiguate Tag Action
disjoint with: Express feelings
disjoint with: Evaluate
disjoint with: Post
disjoint with: Aggregate
disjoint with: Syntactic Tag Action
disjoint with: Nothing
disjoint with: Manual tag action
disjoint with: Assert
disjoint with: Item
disjoint with: Usergroup
disjoint with: User Account
comment: A Site can be the location of an online community or set of communities, with UserAccounts and Usergroups creating Items in a set of Containers. It can be thought of as a web-accessible data Space.

content encoded
property disjoint with: num items
property disjoint with: last item date
property disjoint with: num threads
type: DatatypeProperty
property disjoint with: bottomDataProperty
property disjoint with: first name
property disjoint with: last name
sub property of: topDataProperty
property disjoint with: email sha1
type: DeprecatedProperty
comment: The encoded content of the Post, contained in CDATA areas.
domain: Post
range: Literal
version info: This property is deprecated. Use content:encoded from the RSS 1.0 content module instead.

SIOC Core Ontology Namespace
description: SIOC (Semantically-Interlinked Online Communities) is an ontology for describing the information in online communities. This information can be used to export information from online communities and to link them together. The scope of the application areas that SIOC can be used for includes (and is not limited to) weblogs, message boards, mailing lists and chat channels.
type: Thing
type: Ontology
version info: Revision: 1.35

next by date
property disjoint with: email
property disjoint with: Sent by
property disjoint with: member of
property disjoint with: scope of
property disjoint with: administrator of
property disjoint with: follows
property disjoint with: moderator of
property disjoint with: creator of
property disjoint with: has member
property disjoint with: has usergroup
property disjoint with: avatar
property disjoint with: has container
inverse of: previous by date
property disjoint with: has function
property disjoint with: usergroup of
property disjoint with: Sent to
property disjoint with: has administrator
property disjoint with: space of
property disjoint with: has creator
property disjoint with: bottomObjectProperty
property disjoint with: has space
property disjoint with: owner of
type: ObjectProperty
property disjoint with: container of
property disjoint with: has parent
property disjoint with: has moderator
property disjoint with: host of
property disjoint with: has modifier
property disjoint with: has host
property disjoint with: function of
property disjoint with: parent of
property disjoint with: subscriber of
property disjoint with: has owner
sub property of: topObjectProperty
property disjoint with: has subscriber
property disjoint with: has scope
property disjoint with: modifier of
property disjoint with: account
property disjoint with: account of
comment: Next Item or Post in a given Container sorted by date.
domain: Item
range: Item

Role
disjoint with: Container
disjoint with: Forum
disjoint with: Post
disjoint with: Point
disjoint with: Manual tag action
subclass of: Thing
disjoint with: N-tuple tag action
disjoint with: Set task
disjoint with: Community
disjoint with: Tag action
disjoint with: Give access rights to
disjoint with: N-tuple tag action with machine tag syntax
disjoint with: Owner tag action
disjoint with: User
disjoint with: Aggregate
disjoint with: Visitor tag action
disjoint with: User Account
disjoint with: Usergroup
disjoint with: Item
disjoint with: Nothing
disjoint with: Express feelings
disjoint with: Share
disjoint with: Assert
disjoint with: Web concept tag action
type: Class
disjoint with: Syntactic Tag Action
disjoint with: Auto tag action
disjoint with: Disambiguate Tag Action
disjoint with: Space
disjoint with: Thread
disjoint with: Site
disjoint with: Machine tag action
disjoint with: Ask
disjoint with: Evaluate
comment: A Role is a function of a UserAccount within a scope of a particular Forum, Site, etc.

Elicits action
sub property of: topObjectProperty
sub property of: Is related to
property disjoint with: bottomObjectProperty
type: ObjectProperty
comment: Propriété utilisée quand une ressource suscite l'accomplissement d'une action. @fr
label: Suscita l'azione @it
type: Property
comment: Propriedad usada cuando un recurso suscita la realización de una acción. @es
comment: Property used when a resource elicits an action to be performed.
label: Ontlokt de handeling @nl
label: Suscita la acción @es
comment: Proprietà usata quando una risorsa suscita lo svolgimento di un'azione. @it
comment: Eigenschap die gebruikt wordt wanneer een bron aanzet tot het verrichten van een handeling. @nl
label: Suscite l'action @fr

Yahoo chat ID
term status: testing
type: DatatypeProperty
type: Thing
sub property of: topDataProperty
property disjoint with: bottomDataProperty
sub property of: nickname
type: InverseFunctionalProperty
domain: Agent
range: Literal
comment: A Yahoo chat ID
type: Property

knows
term status: stable
type: Thing
sub property of: topObjectProperty
property disjoint with: bottomObjectProperty
type: ObjectProperty
type: Property
comment: A person known by this person (indicating some level of reciprocated interaction between the parties).
domain: Person
range: Person

N-tuple tag action with machine tag syntax
subclass of: Machine tag action
disjoint with: Usergroup
disjoint with: User
type: Thing
disjoint with: Community
disjoint with: Space
disjoint with: Nothing
disjoint with: Site
subclass of: N-tuple tag action
disjoint with: Thread
disjoint with: User Account
subclass of: Tag action
subclass of: Syntactic Tag Action
subclass of: Graph
subclass of: Thing
type: Class
subclass of: Item
disjoint with: Role
disjoint with: Forum
disjoint with: Container
label: Azione di tagging con una tag a n-dimensionale e sintassi delle machine tag @it
comment: Utilisé pour décrire un acte de taguer impliquant des tags dont les libellés ont n-dimensions et suivent la syntaxe des machine tags mais dans un contexte où des APIs semblables à celle de Flickr font défaut. @fr
comment: Descrive azioni di tagging basate su tag n-dimensionali che seguono la sintassi delle machine tag, ma in un contesto dove mancano API simili a quelle di Flickr. @it
label: Acción de etiquetado con una etiqueta n-dimensional y sintaxis de las machine tags @es
comment: Describes tagging involving N-tuple tags which follow machine tags typed syntax in acontext where Flickr-like APIs are lacking.
label: Taghandeling met een n-tuple met machinetag syntaxis @nl
comment: Describe acciones de etiquetado basadas en etiquetas n-dimensionales que siguen la sintaxis de las machine tag, pero en un contexto en el que faltan API parecidas a las de Flickr. @es
comment: Wordt gebruikt om een taghandeling te beschrijven wanneer de labels meerdere dimensies hebben en machinetag syntaxis volgen, maar er geen Flickr-gelijkende API besachikbaar is. @nl
label: Acte de taguer avec un tag à n-dimensions et syntaxe de machine tags @fr

MSN chat ID
sub property of: nickname
property disjoint with: bottomDataProperty
type: Thing
sub property of: topDataProperty
type: InverseFunctionalProperty
term status: testing
type: DatatypeProperty
comment: An MSN chat ID
domain: Agent
type: Property
range: Literal

Give access rights to
disjoint with: Role
disjoint with: User Account
disjoint with: Thread
disjoint with: User
subclass of: Graph
disjoint with: Site
disjoint with: Community
disjoint with: Nothing
disjoint with: Container
subclass of: Thing
disjoint with: Space
subclass of: Tag action
disjoint with: Usergroup
subclass of: Item
disjoint with: Forum
type: Class
comment: Beschrijft de handeling die verricht wordt met een tag wanneer deze gebruikt wordt om vast te stellen aaan wie toegangsrechten tot een bron worden toegekend of ontzegd. @nl
label: Accorder des droits d'accès à @fr
label: Acordar derechos de acceso a @es
comment: Descrive l'azione che si compie con una tag quando questa è usata per definire a chi sono accordati o negati i diritti di accesso a una risorsa. @it
label: Toegangsrechten verlenen aan @nl
comment: Describes the action that is performed with a tag whenever it is used to define to whom access rights to a resource are granted or denied.
label: Accordare diritti di accesso a @it
comment: Décrit l'action que l'on accomplit avec un tag dès lors que celui-ci est utilisé pour définir les personnes auxquelles sont octroyés des droits d'accès à des ressource en ligne (permission ou refus). @fr
comment: Describe la acción que se realiza con una etiqueta cuando es usada para definir a quien son concedidos o negados derechos de acceso a un recurso.. @es

Online Account
term status: testing
type: Thing
disjoint with: Nothing
subclass of: Thing
type: Class
comment: An online account.

Point
disjoint with: Usergroup
disjoint with: User
subclass of: Thing
disjoint with: Nothing
disjoint with: Forum
subclass of: Graph
disjoint with: Community
subclass of: Tag action
type: Class
disjoint with: Role
disjoint with: Container
disjoint with: User Account
disjoint with: Thread
disjoint with: Space
subclass of: Item
disjoint with: Site
comment: Décrit l'action que l'on accomplit avec un tag dès lors que celui-ci est utilisé pour faire référence à une portion spécifique de la représentation d'une ressource sur le Web (le segment d'une vidéo, un commentaire produit par les utilisateurs au pied d'un article, etc.). @fr
label: Puntare @it
label: Pointer @fr
label: Puntar @es
label: Aanwijzen @nl
comment: Beschrijft de handeling die verricht wordt met een tag wanneer deze gebruikt wordt om naar een specifiek deel van een web-representatie te verwijzen (een segment van een video, een door een gebruiker gegenereerd commentaar bij een krantenartikel, etc.). @nl
comment: Descrive l'azione che si compie con una tag quando questa è usata per fare riferimento a una parte specifica della rappresentazione di una risorsa Web (il segmento di un video, il commento generato dagli utenti a un articolo di un quotidiano, ecc.). @it
comment: Describe la acción que se realiza con una etiqueta cuando es usada para referirse a una parte específica de un recurso Web (el segmento de un video, comentarios generados por los usuarios a un artículo de periódico). @es
comment: Describes the action that is performed with a tag whenever it is used to point to a specific part of a Web representation (the segment of a video, a user-generated commentary to a newspaper article, etc.).

email sha1
property disjoint with: content
property disjoint with: num threads
property disjoint with: num items
property disjoint with: title
property disjoint with: created at
property disjoint with: modified at
property disjoint with: description
property disjoint with: subject
sub property of: topDataProperty
property disjoint with: bottomDataProperty
property disjoint with: ip address
property disjoint with: content encoded
type: DatatypeProperty
property disjoint with: last item date
comment: An electronic mail address of the UserAccount, encoded using SHA1.
domain: User Account
range: Literal

account of
type: ObjectProperty
property disjoint with: reference
property disjoint with: has host
sub property of: topObjectProperty
property disjoint with: has parent
property disjoint with: host of
property disjoint with: has discussion
property disjoint with: has scope
property disjoint with: attachment
property disjoint with: latest version
inverse of: account
property disjoint with: parent of
property disjoint with: usergroup of
property disjoint with: later version
property disjoint with: has subscriber
property disjoint with: reply of
property disjoint with: about
property disjoint with: has member
property disjoint with: previous by date
property disjoint with: has administrator
property disjoint with: earlier version
property disjoint with: next by date
property disjoint with: addressed to
property disjoint with: next version
property disjoint with: bottomObjectProperty
property disjoint with: has moderator
property disjoint with: container of
property disjoint with: sibling
property disjoint with: function of
property disjoint with: has reply
property disjoint with: has container
property disjoint with: has modifier
property disjoint with: previous version
property disjoint with: has usergroup
property disjoint with: Belongs to tag collection
property disjoint with: embeds knowledge
property disjoint with: space of
comment: Refers to the foaf:Agent or foaf:Person who owns this sioc:UserAccount.
domain: User Account
range: Agent

has administrator
property disjoint with: attachment
property disjoint with: next by date
property disjoint with: moderator of
property disjoint with: owner of
property disjoint with: embeds knowledge
property disjoint with: avatar
property disjoint with: has reply
type: ObjectProperty
property disjoint with: reference
property disjoint with: reply of
property disjoint with: parent of
property disjoint with: about
property disjoint with: host of
property disjoint with: previous version
property disjoint with: account of
property disjoint with: Belongs to tag collection
property disjoint with: latest version
property disjoint with: bottomObjectProperty
property disjoint with: container of
property disjoint with: administrator of
property disjoint with: next version
property disjoint with: modifier of
property disjoint with: function of
property disjoint with: has function
inverse of: administrator of
property disjoint with: member of
property disjoint with: scope of
property disjoint with: follows
property disjoint with: subscriber of
property disjoint with: has space
property disjoint with: usergroup of
property disjoint with: has member
property disjoint with: has host
property disjoint with: has parent
property disjoint with: has modifier
sub property of: topObjectProperty
property disjoint with: has usergroup
property disjoint with: email
property disjoint with: has discussion
property disjoint with: sibling
property disjoint with: addressed to
property disjoint with: later version
property disjoint with: creator of
property disjoint with: earlier version
property disjoint with: has scope
property disjoint with: previous by date
property disjoint with: has container
comment: A UserAccount that is an administrator of this Site.
domain: Site
range: User Account

Part Of Web representation
disjoint with: Nothing
subclass of: WebRepresentation
subclass of: Thing
type: Class
comment: Usato per rappresentare la parte della rappresentazione di una risorsa Web quando si è fatto uso dell'atto di tagging "Point". @it
label: Onderdeel van de representatie van een bron op het web @nl
comment: Utilisé pour représenter la partie de la représentation d'une ressource qui est taguée lorsque qu'il est fait usage de l'acte de taguer "Pointer". @fr
label: Partie de la représentation d'une ressource sur le Web @fr
comment: Used to represent the part of the Web representation resource being tagged after the "Point" TagAction is used.
comment: Wordt gebruikt om het getagde deel van een web-representatie aan te geven wanneer gebruikt is gemaakt van de "Aanwijs" taghandeling. @nl
label: Parte della rappresentazione di una risorsa Web @it
label: Parte de la representación de un recurso en la Web @es
comment: Usado para representar la parte de la representación de un recurso Web quando se ha hecho uso del acto de etiquetado "Point". @es

host of
property disjoint with: reply of
property disjoint with: creator of
property disjoint with: email
property disjoint with: has function
property disjoint with: has scope
property disjoint with: has administrator
property disjoint with: function of
property disjoint with: subscriber of
property disjoint with: Sent to
property disjoint with: has discussion
property disjoint with: addressed to
property disjoint with: attachment
property disjoint with: has owner
property disjoint with: next by date
property disjoint with: administrator of
property disjoint with: has subscriber
property disjoint with: moderator of
property disjoint with: sibling
property disjoint with: has member
property disjoint with: previous by date
property disjoint with: latest version
property disjoint with: member of
property disjoint with: later version
property disjoint with: reference
property disjoint with: avatar
property disjoint with: has usergroup
property disjoint with: container of
property disjoint with: owner of
property disjoint with: modifier of
property disjoint with: account
type: ObjectProperty
property disjoint with: embeds knowledge
property disjoint with: has moderator
inverse of: has host
property disjoint with: Belongs to tag collection
sub property of: topObjectProperty
property disjoint with: scope of
property disjoint with: Sent by
property disjoint with: account of
property disjoint with: previous version
property disjoint with: bottomObjectProperty
property disjoint with: has creator
property disjoint with: has reply
property disjoint with: has modifier
property disjoint with: earlier version
property disjoint with: about
property disjoint with: has container
property disjoint with: usergroup of
property disjoint with: follows
property disjoint with: next version
comment: A Forum that is hosted on this Site.
domain: Site
range: Forum

has owner
property disjoint with: has function
property disjoint with: has reply
type: ObjectProperty
property disjoint with: moderator of
property disjoint with: later version
property disjoint with: has host
sub property of: topObjectProperty
property disjoint with: bottomObjectProperty
property disjoint with: previous version
inverse of: owner of
property disjoint with: earlier version
property disjoint with: has parent
property disjoint with: reply of
property disjoint with: container of
property disjoint with: next by date
property disjoint with: host of
property disjoint with: latest version
property disjoint with: scope of
property disjoint with: sibling
property disjoint with: administrator of
property disjoint with: parent of
property disjoint with: has container
property disjoint with: has space
property disjoint with: modifier of
property disjoint with: member of
property disjoint with: subscriber of
property disjoint with: previous by date
property disjoint with: usergroup of
property disjoint with: next version
property disjoint with: has usergroup
comment: A UserAccount that this resource is owned by.
range: User Account

last activity date
sub property of: date
sub property of: topDataProperty
property disjoint with: bottomDataProperty
type: DatatypeProperty
comment: The date and time of the last activity associated with a SIOC concept instance, and expressed in ISO 8601 format. This could be due to a reply Post or Comment, a modification to an Item, etc.
range: Literal

Post
disjoint with: Role
disjoint with: Site
disjoint with: Forum
disjoint with: Community
disjoint with: Usergroup
type: Class
subclass of: Document
disjoint with: Container
disjoint with: Thread
disjoint with: Space
disjoint with: Project
subclass of: Item
disjoint with: Organization
disjoint with: User Account
disjoint with: Nothing
subclass of: Thing
disjoint with: User
comment: An article or message that can be posted to a Forum.

modified at
property disjoint with: num threads
property disjoint with: last item date
type: DatatypeProperty
property disjoint with: num items
property disjoint with: first name
property disjoint with: email sha1
property disjoint with: bottomDataProperty
property disjoint with: last name
sub property of: topDataProperty
type: DeprecatedProperty
comment: When this was modified, in ISO 8601 format.
domain: Post
range: Literal
version info: This property is deprecated. Use dcterms:modified from the Dublin Core ontology instead.

related to
sub property of: topObjectProperty
property disjoint with: bottomObjectProperty
type: ObjectProperty
comment: Related Posts for this Post, perhaps determined implicitly from topics or references.

Given name
term status: testing
type: Thing
sub property of: topDataProperty
property disjoint with: bottomDataProperty
type: DatatypeProperty
type: Property
comment: The given name of some person.

encoded in
sub property of: topObjectProperty
property disjoint with: is about
property disjoint with: bottomObjectProperty
inverse of: encodes
type: FunctionalProperty
type: ObjectProperty
domain: awww representation
range: media type

uri
disjoint with: Nothing
subclass of: Tagged resource
subclass of: resource
subclass of: http://lodlaundromat.org/.well-known/genid/samples/pellet///class//0b7a6cec83cd7a6ef81ffd016aefb0e4/f32d8dc45613bef895570d2297255a7b#10
subclass of: http://lodlaundromat.org/.well-known/genid/samples/pellet///class//0b7a6cec83cd7a6ef81ffd016aefb0e4/7c71b10046805dc486cf71431721ea93#10
subclass of: Thing
type: Class
subclass of: http://lodlaundromat.org/.well-known/genid/samples/pellet///class//0b7a6cec83cd7a6ef81ffd016aefb0e4/f32d8dc45613bef895570d2297255a7b#2
subclass of: http://lodlaundromat.org/.well-known/genid/samples/pellet///class//0b7a6cec83cd7a6ef81ffd016aefb0e4/f32d8dc45613bef895570d2297255a7b#3
subclass of: http://lodlaundromat.org/.well-known/genid/samples/pellet///class//0b7a6cec83cd7a6ef81ffd016aefb0e4/7c71b10046805dc486cf71431721ea93#2
subclass of: http://lodlaundromat.org/.well-known/genid/samples/pellet///class//0b7a6cec83cd7a6ef81ffd016aefb0e4/7c71b10046805dc486cf71431721ea93#3

funded by
term status: archaic
type: Thing
sub property of: topObjectProperty
property disjoint with: bottomObjectProperty
type: ObjectProperty
type: Property
comment: An organization funding a project or person.
domain: Thing
range: Thing

has subscriber
property disjoint with: scope of
property disjoint with: later version
property disjoint with: reply of
property disjoint with: Belongs to tag collection
property disjoint with: has modifier
property disjoint with: creator of
property disjoint with: embeds knowledge
property disjoint with: member of
property disjoint with: earlier version
property disjoint with: moderator of
property disjoint with: modifier of
sub property of: topObjectProperty
property disjoint with: administrator of
property disjoint with: has container
property disjoint with: reference
property disjoint with: latest version
property disjoint with: has usergroup
property disjoint with: subscriber of
property disjoint with: account of
property disjoint with: host of
property disjoint with: bottomObjectProperty
property disjoint with: owner of
property disjoint with: has reply
property disjoint with: follows
property disjoint with: has discussion
property disjoint with: about
property disjoint with: email
property disjoint with: addressed to
property disjoint with: sibling
property disjoint with: attachment
property disjoint with: previous version
inverse of: subscriber of
property disjoint with: usergroup of
property disjoint with: previous by date
property disjoint with: avatar
property disjoint with: has scope
property disjoint with: next by date
property disjoint with: has space
property disjoint with: has function
property disjoint with: function of
type: ObjectProperty
property disjoint with: has host
property disjoint with: has parent
property disjoint with: next version
property disjoint with: has member
property disjoint with: container of
property disjoint with: parent of
comment: A UserAccount that is subscribed to this Container.
domain: Container
range: User Account

Online Chat Account
term status: unstable
type: Thing
disjoint with: Nothing
subclass of: Thing
subclass of: Online Account
type: Class
comment: An online chat account.

account name
term status: testing
type: Thing
sub property of: topDataProperty
property disjoint with: bottomDataProperty
type: DatatypeProperty
type: Property
comment: Indicates the name (identifier) associated with this online account.
domain: Online Account
range: Literal

thumbnail
term status: testing
type: Thing
sub property of: topObjectProperty
property disjoint with: bottomObjectProperty
type: ObjectProperty
type: Property
comment: A derived thumbnail image.
domain: Image
range: Image

is identified by
sub property of: topObjectProperty
property disjoint with: bottomObjectProperty
inverse of: identifies
type: ObjectProperty
domain: Thing
range: uri
domain: resource

Owner tag action
subclass of: Graph
disjoint with: Community
disjoint with: Set task
disjoint with: Role
disjoint with: Site
disjoint with: User
disjoint with: Visitor tag action
disjoint with: Nothing
disjoint with: Forum
subclass of: Thing
type: Class
disjoint with: Space
disjoint with: Container
disjoint with: Usergroup
subclass of: Tag action
disjoint with: Thread
subclass of: Item
disjoint with: User Account
comment: Utilisé pour décrire un acte de taguer accompli par le propriétaire de l'URI qui identifie la ressource taguée. @fr
comment: Usato per descrivere un'azione di tagging svolta dal proprietario dell'URI che identifica la risorsa taggata. @it
comment: Used to describe an act of tagging performed by the owner of the URI that identifies the tagged resource.
label: Acción de etiquetado del propietario @es
comment: Beschrijft een taghandeling verricht door de eigenaar van de URI waarmee de getagde bron geïdentificeerd wordt. @nl
label: Taghandeling eigenaar @nl
comment: Usado para describir una acción de etiquetado realizada por el propietario del URI que identifica el recurso etiquetado. @es
label: Azione di tagging del proprietario @it
label: Acte de taguer d'un propriétaire @fr

Is about
sub property of: topObjectProperty
sub property of: Is related to
property disjoint with: bottomObjectProperty
type: ObjectProperty
comment: Property used when the label of a tag describes the topic of a resource.
label: A pour thème @fr
label: Ha come tema @it
comment: Eigenschap die gebruikt wordt wanneer het label van een tag het thema van een bron beschrijft. @nl
type: Property
label: Tiene como tema @es
label: Betreft @nl
comment: Proprietà usata quando il contenuto di una tag descrive il tema di una risorsa. @it
comment: Propriété utilisé pour indiquer que le libellé d'un tag décrit le thème d'une ressource. @fr
comment: Propriedad usada cuando el contenido de una etiqueta describe el tema de un recurso. @es

Ask
disjoint with: Space
disjoint with: Forum
subclass of: Thing
disjoint with: Community
subclass of: Graph
disjoint with: Thread
disjoint with: User
disjoint with: Container
disjoint with: Role
disjoint with: Nothing
subclass of: Item
disjoint with: Site
disjoint with: Usergroup
disjoint with: User Account
subclass of: Tag action
type: Class
label: Porre una domanda @it
comment: Beschrijft de handeling die met de tag verricht wordt als het stellen van een vraag. @nl
comment: Describes the action that is performed with a tag by asking a question.
comment: Descrive l'azione che viene compiuta con una tag quando questa viene usata per porre una domanda. @it
label: Preguntar @es
label: Vraag stellen @nl
label: Poser une question @fr
comment: Describe la acción que se realiza con una etiqueta cuando se usa para hacer una pregunta. @es
comment: Décrit l'action que l'on accomplit avec un tag dès lors que celui-ci est utilisé pour poser une question. @fr

web client
disjoint with: Nothing
subclass of: Tagged resource
subclass of: resource
subclass of: http://lodlaundromat.org/.well-known/genid/samples/pellet///class//0b7a6cec83cd7a6ef81ffd016aefb0e4/f32d8dc45613bef895570d2297255a7b#10
subclass of: http://lodlaundromat.org/.well-known/genid/samples/pellet///class//0b7a6cec83cd7a6ef81ffd016aefb0e4/7c71b10046805dc486cf71431721ea93#10
subclass of: Thing
type: Class

Disambiguate Tag Action
disjoint with: Usergroup
disjoint with: Nothing
subclass of: Item
disjoint with: Space
subclass of: Tag action
disjoint with: Role
subclass of: Graph
disjoint with: Site
disjoint with: User Account
type: Class
disjoint with: Container
subclass of: Thing
disjoint with: Community
disjoint with: User
disjoint with: Thread
disjoint with: Forum
comment: Used when the sign used to tag is disambiguated.
label: Acte de taguer avec désambigüisation @fr
comment: Utilisé lorsque le signe utilisé pour taguer est désambiguïsé. @fr
comment: Usado quando el signo usado para etiquetar es desambiguado. @es
comment: Wordt gebruikt wanneer het teken waarmee getagd wordt gedesambigueerd is. @nl
label: Azione di tagging con disambiguazione @it
comment: Usato quando il segno usato per taggare è disambiguato. @it
label: Taghandeling met gedisambigueerd teken @nl
label: Acción de etiquetado con desambiguación @es

later version
property disjoint with: has administrator
property disjoint with: follows
property disjoint with: avatar
property disjoint with: owner of
inverse of: earlier version
property disjoint with: function of
property disjoint with: Sent by
property disjoint with: moderator of
property disjoint with: has moderator
property disjoint with: has subscriber
property disjoint with: has owner
property disjoint with: parent of
property disjoint with: has creator
property disjoint with: container of
property disjoint with: usergroup of
property disjoint with: Sent to
property disjoint with: modifier of
property disjoint with: has scope
property disjoint with: has space
type: TransitiveProperty
property disjoint with: creator of
property disjoint with: host of
property disjoint with: scope of
type: ObjectProperty
property disjoint with: has host
property disjoint with: has parent
property disjoint with: subscriber of
sub property of: topObjectProperty
property disjoint with: member of
property disjoint with: has usergroup
property disjoint with: administrator of
property disjoint with: account of
property disjoint with: has member
property disjoint with: has function
property disjoint with: space of
property disjoint with: bottomObjectProperty
property disjoint with: has modifier
property disjoint with: account
property disjoint with: has container
property disjoint with: email
comment: Links to a later (newer) revision of this Item or Post.
domain: Item
range: Item

Set task
disjoint with: Site
disjoint with: Owner tag action
subclass of: Thing
disjoint with: Space
disjoint with: Role
subclass of: Graph
subclass of: Tag action
type: Class
subclass of: Item
disjoint with: Forum
disjoint with: Thread
disjoint with: Nothing
disjoint with: Usergroup
disjoint with: Community
disjoint with: User
subclass of: Visitor tag action
disjoint with: User Account
disjoint with: Container
label: Définir une tâche @fr
label: Taak definiëren @nl
comment: Décrit l'action que l'on accomplit avec un tag de type "àfaire" dès lors que celui-ci est utilisé pour définir une tâche attendant sa réalisation. @fr
label: Definir una tarea @es
comment: Describe la acción que se realiza con una etiqueta de tipo "quehacer" cuando es usada para crear una tarea en espera de realización. @es
comment: Describes the action that is performed with a "todo" tag whenever it is used to create a task awaiting performance.
label: Definire un compito @it
comment: Descrive l'azione che si compie con una tag di tipo "dafare", quando questa è usata per creare un compito in attesa di realizzazione. @it
comment: Beschrijft de handeling die verricht wordt met een tag van het type “te doen” wanneer deze gebruikt wordt om een taak te maken in afwachting van haar realisatie. @nl

subgraph of
sub property of: topObjectProperty
property disjoint with: bottomObjectProperty
type: ObjectProperty
type: Property
comment: The graph associated with the subject is a subgraph of a graph equivalent to that associated with the object.
domain: Graph
range: Graph

Personal tag collection
disjoint with: Nothing
subclass of: Tag collection
subclass of: Thing
type: Class
comment: A collection of tags generated by a single user.
comment: Une collection de tags constituée par un utilisateur précis. @fr
label: Colección de etiquetas personal @es
label: Collection de tags personnelle @fr
label: Collezione di tag personale @it
label: Persoonlijke tagverzameling @nl

abstract resource
subclass of: http://lodlaundromat.org/.well-known/genid/samples/pellet///class//0b7a6cec83cd7a6ef81ffd016aefb0e4/f32d8dc45613bef895570d2297255a7b#10
subclass of: non-information resources
disjoint with: conceptual resource
subclass of: resource
subclass of: Tagged resource
disjoint with: InformationObject
disjoint with: information resource
disjoint with: awww representation
disjoint with: web resource
disjoint with: Annotated resource
subclass of: Thing
type: Class
disjoint with: InformationRealization
disjoint with: physical resource
disjoint with: Nothing
subclass of: http://lodlaundromat.org/.well-known/genid/samples/pellet///class//0b7a6cec83cd7a6ef81ffd016aefb0e4/7c71b10046805dc486cf71431721ea93#10
comment: Abstract things. They are combinatorial spaces. They cannot be located in space-time. Examples are: the infinite set of integers, real numbers, formal entities, relations, functions, the infinite set of names that can be defined in namespaces.

Tagged resource
disjoint with: Nothing
type: Class
subclass of: Thing
subclass of: resource
equivalent class: http://lodlaundromat.org/.well-known/genid/samples/pellet///class//0b7a6cec83cd7a6ef81ffd016aefb0e4/7c71b10046805dc486cf71431721ea93#10
equivalent class: resource
subclass of: http://lodlaundromat.org/.well-known/genid/samples/pellet///class//0b7a6cec83cd7a6ef81ffd016aefb0e4/7c71b10046805dc486cf71431721ea93#10
subclass of: http://lodlaundromat.org/.well-known/genid/samples/pellet///class//0b7a6cec83cd7a6ef81ffd016aefb0e4/f32d8dc45613bef895570d2297255a7b#10
equivalent class: http://lodlaundromat.org/.well-known/genid/samples/pellet///class//0b7a6cec83cd7a6ef81ffd016aefb0e4/f32d8dc45613bef895570d2297255a7b#10
comment: Usado para representar el recurso etiquetado. Equivalente a irw:Resource. @es
comment: Wordt gebruikt als representatie van de bron die getagd wordt. @nl
comment: Usato per rappresentare la risorsa taggata. Equivalente di irw:Resource. @it
comment: Used to represent the resource being tagged. Equivalent of irw:Resource.
label: Risorsa taggata @it
comment: Utilisé pour représenter la ressource taguée. Equivalent de irw:Resource. @fr
label: Ressource taguée @fr
label: Getagde bron @nl
label: Recurso etiquetado @es

status
term status: unstable
type: Thing
sub property of: topDataProperty
property disjoint with: bottomDataProperty
type: DatatypeProperty
type: Property
comment: A string expressing what the user is happy for the general public (normally) to know about their current activity.
domain: Agent
range: Literal

DNA checksum
term status: archaic
type: Thing
sub property of: topDataProperty
property disjoint with: bottomDataProperty
type: DatatypeProperty
type: Property
comment: A checksum for the DNA of some thing. Joke.
range: Literal

Container
disjoint with: Web concept tag action
disjoint with: Item
disjoint with: Give access rights to
disjoint with: Manual tag action
disjoint with: N-tuple tag action
disjoint with: Syntactic Tag Action
disjoint with: Post
disjoint with: Assert
disjoint with: Evaluate
disjoint with: User Account
disjoint with: Share
disjoint with: Tag action
subclass of: Thing
disjoint with: Role
disjoint with: Auto tag action
disjoint with: Visitor tag action
disjoint with: Set task
disjoint with: N-tuple tag action with machine tag syntax
disjoint with: Ask
disjoint with: Point
disjoint with: Owner tag action
disjoint with: User
type: Class
disjoint with: Express feelings
disjoint with: Disambiguate Tag Action
disjoint with: Machine tag action
disjoint with: Usergroup
disjoint with: Nothing
disjoint with: Aggregate
comment: An area in which content Items are contained.

Aggregate
disjoint with: User
disjoint with: Usergroup
disjoint with: Thread
type: Class
disjoint with: Nothing
disjoint with: User Account
disjoint with: Site
subclass of: Item
disjoint with: Community
disjoint with: Space
subclass of: Thing
disjoint with: Forum
disjoint with: Role
disjoint with: Container
subclass of: Graph
subclass of: Tag action
label: Verzamelen @nl
comment: Descrive l'azione che viene compiuta quando delle risorse sono aggregate attorno a una tag definita collettivamente. @it
comment: Describes the action that is performed whenever resources are aggregated with a collectively defined tag.
comment: Décrit l'action que l'on accomplit lorsque des ressources sont aggrégées autour d'un tag défini de manière collective. @fr
comment: Beschrijft de handeling die verricht wordt wanneer bronnen worden bijeenverzameld onder een gezamenlijk gedefinieerde tag. @nl
label: Agréger @fr
label: Aggregare @it
comment: Describe la acción que se realiza cuando se agregan unos recursos alrededor de una etiqueta definita colectivamente. @es
label: Agregar @es

attachment
property disjoint with: has member
property disjoint with: member of
property disjoint with: account of
property disjoint with: avatar
property disjoint with: has host
property disjoint with: subscriber of
property disjoint with: has moderator
property disjoint with: follows
property disjoint with: has usergroup
property disjoint with: owner of
property disjoint with: moderator of
property disjoint with: parent of
type: ObjectProperty
property disjoint with: space of
property disjoint with: creator of
property disjoint with: has administrator
property disjoint with: has scope
property disjoint with: has parent
property disjoint with: bottomObjectProperty
sub property of: topObjectProperty
property disjoint with: has subscriber
property disjoint with: container of
property disjoint with: host of
property disjoint with: email
property disjoint with: usergroup of
property disjoint with: function of
property disjoint with: administrator of
property disjoint with: modifier of
comment: The URI of a file attached to an Item.
domain: Item

content
property disjoint with: num items
property disjoint with: first name
sub property of: topDataProperty
property disjoint with: bottomDataProperty
property disjoint with: num threads
property disjoint with: last name
property disjoint with: last item date
property disjoint with: email sha1
type: DatatypeProperty
comment: The content of the Item in plain text format.
domain: Item
range: Literal

physical resource
type: Class
disjoint with: web resource
subclass of: resource
subclass of: http://lodlaundromat.org/.well-known/genid/samples/pellet///class//0b7a6cec83cd7a6ef81ffd016aefb0e4/7c71b10046805dc486cf71431721ea93#10
disjoint with: abstract resource
disjoint with: InformationObject
subclass of: Tagged resource
disjoint with: information resource
subclass of: http://lodlaundromat.org/.well-known/genid/samples/pellet///class//0b7a6cec83cd7a6ef81ffd016aefb0e4/f32d8dc45613bef895570d2297255a7b#10
disjoint with: Nothing
disjoint with: conceptual resource
subclass of: Thing
subclass of: non-information resources
comment: Something that occupies its own space and has its own mass in the real world, and can have a "virtual delegate" on the Web. For example physical people, artifacts, places, bodies, chimical substances, biological entities, etc.

num authors
sub property of: topDataProperty
property disjoint with: bottomDataProperty
property disjoint with: has URI string value
type: DatatypeProperty
comment: The number of unique authors (UserAccounts and unregistered posters) who have contributed to this Item, Thread, Post, etc.
range: nonNegativeInteger

Has personal sign
sub property of: topObjectProperty
sub property of: Is related to
property disjoint with: bottomObjectProperty
type: ObjectProperty
comment: Corresponde al uso de etiquetas definidas por el usuario, que pueden servir para recoger, categorizar o distinguir etiquetas, o para estructurar su propria colección de etiquetas @es
comment: Corresponde al uso de etiquetas definidas por el usuario, que pueden servir para recoger, categorizar o distinguir etiquetas, o para estructurar su propria colección de etiquetas . @es
type: Property
comment: Correspond à l'emploi de libellés définis par un utilisateur pour rassembler, catégoriser ou distinguer des ressources voire simplement structurer sa propre collection de tags. @fr
label: Heeft een persoonlijk teken @nl
comment: Corresponds to uses of user-defined labels that can either serve to gather, categorize, distinguish resources or simply add structure to one's collection of tags.
label: Ha segno personale @it
comment: Corrisponde all'uso di tag definite dall'utente che possono servire per raccogliere, categorizzare o distinguere risorse, oppure semplicemente per strutturare la propria collezione di tag. @it
comment: Komt overeen met het gebruik van persoonlijk gedefinieerde labels die tot doel hebben bronnen te verzamelen, categoriseren en onderscheiden, of die simpelweg een verzameling tags structureren. @nl
label: Tiene signo personal @es
label: A pour signe personnel @fr

subject
property disjoint with: email sha1
property disjoint with: num threads
sub property of: topDataProperty
property disjoint with: last name
type: DatatypeProperty
property disjoint with: first name
property disjoint with: last item date
property disjoint with: bottomDataProperty
property disjoint with: num items
type: DeprecatedProperty
comment: Keyword(s) describing subject of the Post.
domain: Post
range: Literal
version info: This property is deprecated. Use dcterms:subject from the Dublin Core ontology for text keywords and sioc:topic if the subject can be represented by a URI instead.

interest
term status: testing
type: Thing
sub property of: topObjectProperty
property disjoint with: bottomObjectProperty
type: ObjectProperty
type: Property
comment: A page about a topic of interest to this person.
domain: Agent
range: Document

Express feelings
subclass of: Thing
disjoint with: Role
disjoint with: Forum
disjoint with: Site
disjoint with: Container
type: Class
disjoint with: Community
disjoint with: Usergroup
subclass of: Tag action
disjoint with: User Account
subclass of: Graph
disjoint with: User
disjoint with: Space
disjoint with: Thread
disjoint with: Nothing
subclass of: Item
label: Expresar un sentimiento @es
comment: Beschrijft de handeling die verricht wordt met een tag wanneer deze gebruikt wordt om een gevoel, emotie, etc. uit te drukken. @nl
comment: Décrit l'action que l'on accomplit avec un tag dès lors que celui-ci est utilisé pour exprimer un sentiment, une émotion, etc. @fr
label: Exprimer un ressenti @fr
label: Esprimere un sentimento @it
comment: Descrive l'azione che si compie con una tag quando questa è usata per esprimere un sentimento, un'emozione, ecc. @it
comment: Describes the action that is performed with a tag whenever it is used to express a feeling, an emotion, etc.
comment: Describe la acción que se realiza con una etiqueta cuando es usada para expresar un sentimiento, una emoción, etc. @es
label: Gevoelens uitdrukken @nl

Is relevant to something
sub property of: topObjectProperty
sub property of: isRelevantTo
property disjoint with: bottomObjectProperty
type: ObjectProperty
comment: Subproperty of 'is relevant to', used to link a resource to anything that it may be relevant to. In other words, in such a way that no immediate formal link can be inferrend between the two except from the point of view of the creator of the said link.
comment: Sotto-proprietà di 'isRelevantTo' usata per associare una risorsa a qualsiasi cosa che possa essere pertinente, in modo che nessun collegamento formale immediato possa essere inferito fra i due, eccetto dal punto di vista del creatore di tale collegamento. @it
label: Es pertinente para algo @es
label: Is relevant met betrekking tot iets @nl
comment: Deeleigenschap van ‘isRelevantTo’, gebruikt om een verband te leggen tussen de bron en iets anders, waarbij geen formeel verband is vast te stellen behalve vanuit het gezichtspunt van degene die dit verband legt. @nl
type: Property
comment: Sous-propriété de "isRelevantTo', utilisée pour lier quoi que ce soit à une ressource de telle manière qu'aucun lien immédiat formel ne puisse être inféré entre les deux excepté du point de vue du créateur d'un tel lien. @fr
label: Est pertinent par rapport à quelque chose @fr
label: È pertinente a qualcosa @it
comment: Sub-propriedad de 'isRelevantTo' usada para asociar un recurso a qualquier cosa para la que pueda ser pertinente, de manera que ningun enlace formal inmediato pueda ser inferido entre los dos, excepto desde el punto de vista del creador de esa asociación. @es

Syntactic Tag Action
disjoint with: Site
disjoint with: Community
disjoint with: Forum
type: Class
subclass of: Tag action
subclass of: Thing
disjoint with: User Account
disjoint with: User
disjoint with: Thread
disjoint with: Role
subclass of: Item
subclass of: Graph
disjoint with: Usergroup
disjoint with: Container
disjoint with: Nothing
disjoint with: Space
label: Acción de etiquetado sintáctica @es
label: Azione di tagging sintattica @it
comment: Describes tags whose labels are following a given syntax for improved precision and tractability.
comment: Describe etiquetas cuyo texto sigue una sintaxis determinada para una mayor precisión y tratabilidad. @es
comment: Décrit des tags dont les libellés mobilisent une certaine syntaxe pour accroître leur précision et leur capacité à être manipulés. @fr
label: Acte de taguer syntaxique @fr
label: Syntactische taghandeling @nl
comment: Descrive delle tag il cui testo segue una sintassi determinata per ottenere maggiore precisione e trattabilità. @it
comment: Beschrijft tags waarvan de labels van een bepaalde syntaxis gebruik maken om de precisie en manipuleerbaarheid te vergroten. @nl

depicts
term status: testing
type: Thing
sub property of: topObjectProperty
property disjoint with: bottomObjectProperty
inverse of: depiction
type: ObjectProperty
type: Property
comment: A thing depicted in this representation.
domain: Image
range: Thing

account
property disjoint with: container of
property disjoint with: bottomObjectProperty
property disjoint with: has parent
property disjoint with: parent of
type: ObjectProperty
type: Thing
property disjoint with: has space
property disjoint with: administrator of
property disjoint with: modifier of
property disjoint with: moderator of
property disjoint with: later version
property disjoint with: has reply
property disjoint with: subscriber of
property disjoint with: scope of
property disjoint with: host of
sub property of: topObjectProperty
property disjoint with: next version
property disjoint with: has host
property disjoint with: next by date
property disjoint with: member of
property disjoint with: has container
term status: testing
property disjoint with: earlier version
property disjoint with: latest version
inverse of: account of
property disjoint with: usergroup of
property disjoint with: reply of
property disjoint with: has function
property disjoint with: sibling
property disjoint with: previous version
property disjoint with: has usergroup
property disjoint with: previous by date
type: Property
comment: Indicates an account held by this agent.
domain: Agent
range: Online Account

has reply
property disjoint with: has parent
property disjoint with: has scope
property disjoint with: has owner
property disjoint with: creator of
property disjoint with: account
property disjoint with: avatar
sub property of: topObjectProperty
property disjoint with: owner of
property disjoint with: subscriber of
property disjoint with: space of
property disjoint with: has function
property disjoint with: moderator of
property disjoint with: function of
sub property of: related to
property disjoint with: has member
property disjoint with: has space
property disjoint with: scope of
property disjoint with: modifier of
property disjoint with: has modifier
property disjoint with: parent of
property disjoint with: follows
property disjoint with: email
property disjoint with: container of
property disjoint with: has container
property disjoint with: Sent to
property disjoint with: Sent by
property disjoint with: has subscriber
property disjoint with: has creator
property disjoint with: has moderator
property disjoint with: member of
property disjoint with: bottomObjectProperty
property disjoint with: account of
type: ObjectProperty
property disjoint with: has administrator
property disjoint with: has usergroup
property disjoint with: usergroup of
property disjoint with: host of
property disjoint with: administrator of
property disjoint with: has host
inverse of: reply of
comment: Points to an Item or Post that is a reply or response to this Item or Post.
domain: Item
range: Item

Can be read by
sub property of: topObjectProperty
sub property of: Is related to
property disjoint with: bottomObjectProperty
type: ObjectProperty
comment: Eigenschap die gebruikt wordt wanneer het label van een tag aangeeft aan wie toegangsrechten tot de getagde bron worden toegekend. @nl
type: Property
domain: WebRepresentation
range: Person
label: Puede ser leído por @es
comment: Property used when the label of a tag indicates to whom access rights to the tagged resource are conferred.
label: Può essere letto da @it
comment: Corresponde al uso de etiquetas cuyo contenido indica el destinatario al cual vienen conferidos derechos de acceso a un recurso. @es
comment: Corrisponde all'uso di tag il cui contenuto indica il destinatario a cui vengono conferiti diritti di accesso a una risorsa. @it
label: Kan gelezen worden door @nl
label: Peut être lu par @fr
comment: Corresponds à l'utilisation de tags dont le libellé indique le destinataire auquel des droits d'accès définis sur une ressource donnée ont été octroyés. @fr

member of
property disjoint with: has parent
property disjoint with: previous version
property disjoint with: follows
property disjoint with: reply of
property disjoint with: has modifier
property disjoint with: has usergroup
property disjoint with: has moderator
property disjoint with: has host
property disjoint with: has space
property disjoint with: scope of
property disjoint with: function of
property disjoint with: administrator of
property disjoint with: next by date
property disjoint with: has scope
property disjoint with: account
property disjoint with: usergroup of
property disjoint with: previous by date
property disjoint with: has container
property disjoint with: has administrator
property disjoint with: Sent to
property disjoint with: embeds knowledge
property disjoint with: Sent by
property disjoint with: subscriber of
property disjoint with: parent of
property disjoint with: earlier version
property disjoint with: has creator
property disjoint with: latest version
property disjoint with: sibling
property disjoint with: modifier of
property disjoint with: has discussion
inverse of: has member
property disjoint with: moderator of
type: ObjectProperty
property disjoint with: about
property disjoint with: has reply
property disjoint with: space of
property disjoint with: later version
property disjoint with: has function
property disjoint with: has owner
property disjoint with: has member
property disjoint with: bottomObjectProperty
sub property of: topObjectProperty
property disjoint with: attachment
property disjoint with: has subscriber
property disjoint with: Belongs to tag collection
property disjoint with: container of
property disjoint with: host of
property disjoint with: addressed to
property disjoint with: reference
property disjoint with: next version
comment: A Usergroup that this UserAccount is a member of.
domain: User Account
range: Usergroup

sha1sum (hex)
term status: unstable
type: Thing
sub property of: topDataProperty
property disjoint with: bottomDataProperty
type: DatatypeProperty
type: Property
comment: A sha1sum hash, in hex.
domain: Document

Raises question about
sub property of: topObjectProperty
sub property of: Is related to
property disjoint with: bottomObjectProperty
type: ObjectProperty
comment: Propriedad usada cuando el contenido de una etiqueta indica que se esta planteando una pregunta. @es
label: Plantea una cuestión sobre @es
comment: Propriété utilisée quand le libellé d'un tag indique qu'une question est posée. @fr
comment: Eigenschap die gebruikt wordt wanneer het label van een tag aangeeft dat een vraag gesteld wordt. @nl
label: Roept vragen op over @nl
comment: Proprietà usata quando il contenuto di una tag indica che si sta ponendo una domanda. @it
label: Solleva una domanda su @it
label: Soulève une interrogation au sujet de @fr
type: Property
comment: Property used when the label of a tag indicates that a question is being asked.

is referenced by
sub property of: topObjectProperty
sub property of: requests
property disjoint with: bottomObjectProperty
inverse of: refers to
type: ObjectProperty
range: uri
comment: The relation between a resource and the information resource that is about it.
domain: resource

embeds knowledge
property disjoint with: administrator of
property disjoint with: member of
property disjoint with: has moderator
property disjoint with: has subscriber
property disjoint with: usergroup of
type: ObjectProperty
property disjoint with: parent of
property disjoint with: moderator of
property disjoint with: avatar
property disjoint with: space of
property disjoint with: bottomObjectProperty
property disjoint with: email
property disjoint with: has parent
sub property of: topObjectProperty
property disjoint with: owner of
property disjoint with: modifier of
property disjoint with: subscriber of
property disjoint with: account of
property disjoint with: creator of
property disjoint with: follows
property disjoint with: function of
property disjoint with: has usergroup
property disjoint with: container of
property disjoint with: host of
property disjoint with: has administrator
property disjoint with: has scope
property disjoint with: has member
property disjoint with: has host
comment: This links Items to embedded statements, facts and structured content.
domain: Item
range: Graph

myersBriggs
term status: testing
type: Thing
sub property of: topDataProperty
property disjoint with: bottomDataProperty
type: DatatypeProperty
type: Property
comment: A Myers Briggs (MBTI) personality classification.
domain: Person
range: Literal

schoolHomepage
term status: testing
type: Thing
sub property of: topObjectProperty
property disjoint with: bottomObjectProperty
type: ObjectProperty
type: Property
comment: A homepage of a school attended by the person.
domain: Person
range: Document

Person
term status: stable
subclass of: SpatialThing
disjoint with: Nothing
subclass of: Agent
disjoint with: Project
subclass of: Person
subclass of: Thing
type: Class
type: Thing
disjoint with: Organization
comment: A person.

has host
property disjoint with: has reply
property disjoint with: has modifier
inverse of: host of
property disjoint with: administrator of
property disjoint with: bottomObjectProperty
property disjoint with: previous by date
property disjoint with: attachment
property disjoint with: has discussion
property disjoint with: has moderator
property disjoint with: modifier of
sub property of: topObjectProperty
property disjoint with: moderator of
property disjoint with: has subscriber
property disjoint with: Sent by
property disjoint with: owner of
property disjoint with: creator of
property disjoint with: member of
property disjoint with: has member
property disjoint with: avatar
property disjoint with: has creator
property disjoint with: reply of
property disjoint with: scope of
property disjoint with: Sent to
property disjoint with: account of
property disjoint with: about
property disjoint with: earlier version
property disjoint with: later version
property disjoint with: embeds knowledge
property disjoint with: has container
property disjoint with: account
property disjoint with: sibling
property disjoint with: addressed to
property disjoint with: has scope
property disjoint with: previous version
property disjoint with: Belongs to tag collection
property disjoint with: has usergroup
property disjoint with: has administrator
property disjoint with: usergroup of
property disjoint with: follows
property disjoint with: container of
property disjoint with: function of
property disjoint with: subscriber of
property disjoint with: next by date
type: ObjectProperty
property disjoint with: next version
property disjoint with: has function
property disjoint with: latest version
property disjoint with: reference
property disjoint with: email
property disjoint with: has owner
comment: The Site that hosts this Forum.
domain: Forum
range: Site

logo
term status: testing
type: Thing
sub property of: topObjectProperty
property disjoint with: bottomObjectProperty
type: InverseFunctionalProperty
type: ObjectProperty
type: Property
comment: A logo representing some thing.
domain: Thing
range: Thing

Tag action
subclass of: Graph
disjoint with: Usergroup
subclass of: Thing
disjoint with: Role
disjoint with: Space
disjoint with: Forum
disjoint with: Community
disjoint with: User Account
disjoint with: Site
disjoint with: Container
disjoint with: User
subclass of: Item
disjoint with: Nothing
type: Class
disjoint with: Thread
union of: http://lodlaundromat.org/.well-known/genid/samples/pellet///class//0b7a6cec83cd7a6ef81ffd016aefb0e4/0b7a6cec83cd7a6ef81ffd016aefb0e4#1
label: Acte de taguer @fr
comment: A super class to describe every tag action as modelled by a named graph according to RDF Graph model (RDFG).
label: Taghandeling @nl
label: Acción de etiquetado @es
comment: Une super-classe qui permet de décrire et de modéliser les actes de taguer à l'aide d'un graphe nommé et au moyen du modèle de graphe RDF (RDFG). @fr
comment: Een overkoepelende categorie die toestaat elke taghandeling te beschrijving als een gelabelde graaf binnen het RDF graph model (RDFG). @nl
union of: http://lodlaundromat.org/.well-known/genid/0b7a6cec83cd7a6ef81ffd016aefb0e4#1
comment: Una super-clase que permite describir y modelar cada acción de etiquetado utilizando un named graph según el modelo del grafo RDF (RDFG). @es
label: Azione di tagging @it
comment: Una super-classe che permette di descrivere e di modellare ogni azione di tagging con un named graph secondo il modello del grafo RDF (RDFG). @it

Cannot be read by
sub property of: topObjectProperty
sub property of: Is related to
property disjoint with: bottomObjectProperty
type: ObjectProperty
label: Kan niet gelezen worden door @nl
comment: Proprietà usata quando il contenuto di una tag indica il destinatario a cui sono negati diritti di accesso a una risorsa. @it
domain: WebRepresentation
label: Non può essere letto da @it
comment: Eigenschap die gebruikt wordt wanneer het label van een tag aangeeft aan wie de toegangsrechten tot de getagde bron worden ontzegd. @nl
comment: Propriété utilisée quand le libellé d'un tag indique le destinataire auquel des droits d'accès définis sur une ressource donnée ont été déniés. @fr
range: Person
label: No puede ser leído por @es
comment: Property used when the label of a tag indicates to whom access right to the tagged resource are denied.
type: Property
comment: Propriedad usada cuando el contenido de una etiqueta indica el destinatario al cual se han negado derechos de acceso a un recurso. @es
label: Ne peut être lu par @fr

email
property disjoint with: has usergroup
property disjoint with: attachment
property disjoint with: reply of
property disjoint with: bottomObjectProperty
property disjoint with: has scope
property disjoint with: has modifier
property disjoint with: sibling
property disjoint with: previous by date
property disjoint with: host of
property disjoint with: reference
property disjoint with: has member
property disjoint with: previous version
property disjoint with: has parent
property disjoint with: has container
property disjoint with: has moderator
property disjoint with: latest version
property disjoint with: parent of
sub property of: topObjectProperty
property disjoint with: function of
property disjoint with: later version
property disjoint with: container of
property disjoint with: earlier version
property disjoint with: about
property disjoint with: next version
property disjoint with: space of
property disjoint with: has administrator
type: ObjectProperty
property disjoint with: usergroup of
property disjoint with: next by date
property disjoint with: Belongs to tag collection
property disjoint with: embeds knowledge
property disjoint with: has reply
property disjoint with: addressed to
property disjoint with: has discussion
property disjoint with: has subscriber
property disjoint with: has host
comment: An electronic mail address of the UserAccount.
domain: User Account

previous version
property disjoint with: has space
property disjoint with: account of
property disjoint with: has moderator
property disjoint with: follows
property disjoint with: usergroup of
sub property of: earlier version
property disjoint with: email
property disjoint with: bottomObjectProperty
property disjoint with: host of
property disjoint with: administrator of
property disjoint with: container of
property disjoint with: Sent to
property disjoint with: has usergroup
property disjoint with: modifier of
property disjoint with: space of
property disjoint with: has modifier
property disjoint with: scope of
property disjoint with: subscriber of
property disjoint with: parent of
property disjoint with: has parent
property disjoint with: account
property disjoint with: moderator of
property disjoint with: has member
property disjoint with: function of
property disjoint with: Sent by
inverse of: next version
property disjoint with: has container
property disjoint with: has function
property disjoint with: has host
property disjoint with: has owner
property disjoint with: has subscriber
type: ObjectProperty
property disjoint with: has creator
sub property of: topObjectProperty
property disjoint with: has administrator
property disjoint with: avatar
property disjoint with: has scope
property disjoint with: member of
property disjoint with: owner of
property disjoint with: creator of
comment: Links to the previous revision of this Item or Post.
domain: Item
range: Item

topic
term status: testing
type: Thing
sub property of: topObjectProperty
property disjoint with: bottomObjectProperty
inverse of: page
type: ObjectProperty
type: Property
comment: A topic of some page or document.
domain: Document
range: Thing

has modifier
property disjoint with: bottomObjectProperty
property disjoint with: sibling
property disjoint with: has host
property disjoint with: scope of
property disjoint with: has moderator
property disjoint with: usergroup of
property disjoint with: moderator of
property disjoint with: has administrator
property disjoint with: has member
property disjoint with: previous version
property disjoint with: earlier version
property disjoint with: has usergroup
property disjoint with: parent of
type: ObjectProperty
property disjoint with: member of
property disjoint with: has reply
property disjoint with: modifier of
property disjoint with: account of
property disjoint with: creator of
property disjoint with: latest version
property disjoint with: next version
property disjoint with: space of
property disjoint with: email
property disjoint with: avatar
property disjoint with: has scope
property disjoint with: next by date
sub property of: topObjectProperty
property disjoint with: has subscriber
property disjoint with: function of
property disjoint with: previous by date
inverse of: modifier of
property disjoint with: container of
property disjoint with: later version
property disjoint with: has space
property disjoint with: host of
property disjoint with: has function
property disjoint with: reply of
property disjoint with: subscriber of
property disjoint with: follows
property disjoint with: owner of
property disjoint with: has container
property disjoint with: administrator of
property disjoint with: has parent
comment: A UserAccount that modified this Item.
domain: Item
range: User Account

is requested by
sub property of: topObjectProperty
property disjoint with: bottomObjectProperty
inverse of: requests
type: ObjectProperty
domain: uri
range: web client
comment: WebClients that have requested a URI, like in typical HTTP GET requests.

Visitor tag action
disjoint with: Container
disjoint with: Forum
subclass of: Graph
type: Class
disjoint with: Community
subclass of: Item
disjoint with: Role
disjoint with: Thread
disjoint with: Owner tag action
subclass of: Tag action
disjoint with: User Account
subclass of: Thing
disjoint with: Space
disjoint with: User
disjoint with: Nothing
disjoint with: Usergroup
disjoint with: Site
label: Acción de etiquetado de un visitante @es
comment: Usado para describir una acción de etiquetado realizada por una persona que ha tenido acceso a la representación de un recurso en la Web. @es
comment: Utilisé pour décrire l'acte de taguer accompli par une personne ayant eu accès à la représentation d'une ressource sur le Web. @fr
label: Azione di tagging di un visitatore @it
comment: Beschrijft een taghandeling verricht door een bezoeker van de web-representatie van een bron. @nl
comment: Used to describe an act of tagging performed by a the person who browsed a Web representation.
label: Taghandeling bezoeker @nl
label: Acte de taguer d'un visiteur @fr
comment: Usato per descrivere un'azione di tagging svolta da una persona che ha avuto accesso alla rappresentazione di una risorsa Web. @it

media type
disjoint with: Nothing
subclass of: Tagged resource
subclass of: resource
subclass of: http://lodlaundromat.org/.well-known/genid/samples/pellet///class//0b7a6cec83cd7a6ef81ffd016aefb0e4/f32d8dc45613bef895570d2297255a7b#10
subclass of: http://lodlaundromat.org/.well-known/genid/samples/pellet///class//0b7a6cec83cd7a6ef81ffd016aefb0e4/7c71b10046805dc486cf71431721ea93#10
subclass of: Thing
type: Class

member
term status: stable
type: Thing
sub property of: topObjectProperty
property disjoint with: bottomObjectProperty
type: ObjectProperty
type: Property
comment: Indicates a member of a Group
domain: Group
range: Agent

description
property disjoint with: last name
property disjoint with: num threads
property disjoint with: num items
property disjoint with: email sha1
type: DatatypeProperty
property disjoint with: last item date
property disjoint with: first name
sub property of: topDataProperty
property disjoint with: bottomDataProperty
type: DeprecatedProperty
comment: The content of the Post.
domain: Post
range: Literal
version info: This property is deprecated. Use sioc:content or other methods (AtomOwl, content:encoded from RSS 1.0, etc.) instead.

feed
sub property of: topObjectProperty
property disjoint with: bottomObjectProperty
type: ObjectProperty
comment: A feed (e.g. RSS, Atom, etc.) pertaining to this resource (e.g. for a Forum, Site, UserAccount, etc.).

name
term status: testing
type: Thing
sub property of: topDataProperty
property disjoint with: bottomDataProperty
type: DatatypeProperty
type: Property
comment: A name for some thing.
domain: Thing
range: Literal
sub property of: label

conceptual resource
disjoint with: InformationRealization
disjoint with: information resource
disjoint with: InformationObject
subclass of: non-information resources
subclass of: Thing
type: Class
disjoint with: Nothing
disjoint with: Annotated resource
disjoint with: awww representation
disjoint with: web resource
disjoint with: abstract resource
subclass of: resource
subclass of: http://lodlaundromat.org/.well-known/genid/samples/pellet///class//0b7a6cec83cd7a6ef81ffd016aefb0e4/f32d8dc45613bef895570d2297255a7b#10
disjoint with: physical resource
subclass of: http://lodlaundromat.org/.well-known/genid/samples/pellet///class//0b7a6cec83cd7a6ef81ffd016aefb0e4/7c71b10046805dc486cf71431721ea93#10
subclass of: Tagged resource
comment: Resources that are created in the social communication process. A conceptual resource does not exist if it's not in a social communication. For example: legal entities, political entities, social relations, concepts, etc.

ICQ chat ID
sub property of: nickname
term status: testing
type: Thing
property disjoint with: bottomDataProperty
sub property of: topDataProperty
type: InverseFunctionalProperty
type: DatatypeProperty
domain: Agent
range: Literal
comment: An ICQ chat ID
type: Property

Project
disjoint with: PersonalProfileDocument
type: Class
term status: testing
disjoint with: Document
disjoint with: Post
subclass of: Thing
disjoint with: Nothing
disjoint with: Image
disjoint with: Person
type: Thing
comment: A project (a collective endeavour of some kind).

homepage
sub property of: topObjectProperty
term status: stable
sub property of: page
sub property of: is primary topic of
type: Thing
property disjoint with: bottomObjectProperty
type: ObjectProperty
type: InverseFunctionalProperty
comment: A homepage for some thing.
range: Document
type: Property
domain: Thing

current project
term status: testing
type: Thing
sub property of: topObjectProperty
property disjoint with: bottomObjectProperty
type: ObjectProperty
type: Property
comment: A current project this person works on.
domain: Person
range: Thing

family_name
term status: archaic
type: Thing
sub property of: topDataProperty
property disjoint with: bottomDataProperty
type: DatatypeProperty
type: Property
comment: The family name of some person.
domain: Person
range: Literal

information resource
type: Class
equivalent class: InformationObject
subclass of: Thing
disjoint with: conceptual resource
disjoint with: Annotated resource
subclass of: http://lodlaundromat.org/.well-known/genid/samples/pellet///class//0b7a6cec83cd7a6ef81ffd016aefb0e4/f32d8dc45613bef895570d2297255a7b#10
subclass of: InformationObject
disjoint with: abstract resource
subclass of: Tagged resource
subclass of: resource
disjoint with: InformationRealization
subclass of: http://lodlaundromat.org/.well-known/genid/samples/pellet///class//0b7a6cec83cd7a6ef81ffd016aefb0e4/7c71b10046805dc486cf71431721ea93#10
disjoint with: physical resource
disjoint with: Nothing
disjoint with: non-information resources
disjoint with: awww representation
comment: They are *about* something, this something can be everything (rdfs:Resource, owl:Thing, ire:Entity) including AnalogResource. Their essential characteristics can be conveyed in a single message. They can be associated with a URI, and can have a WebRepresentation, in this case they are called WebResource. They have some realization, for example: the text of Moby Dick is an InformationResource, a book containing the text of Moby Dick is one of its realization. The intuition behind the class InformationResource is the same behind the class ir:InformationRealization (cloned from Dolce Ultra Lite).

weblog
sub property of: page
term status: testing
type: Thing
property disjoint with: bottomObjectProperty
type: InverseFunctionalProperty
type: ObjectProperty
sub property of: topObjectProperty
type: Property
range: Document
comment: A weblog of some thing (whether person, group, company etc.).
domain: Agent

earlier version
property disjoint with: account of
property disjoint with: scope of
type: ObjectProperty
property disjoint with: avatar
property disjoint with: moderator of
property disjoint with: member of
type: TransitiveProperty
property disjoint with: modifier of
property disjoint with: Sent by
property disjoint with: administrator of
property disjoint with: has function
property disjoint with: host of
property disjoint with: follows
property disjoint with: has creator
sub property of: topObjectProperty
property disjoint with: account
property disjoint with: has modifier
inverse of: later version
property disjoint with: has parent
property disjoint with: creator of
property disjoint with: has scope
property disjoint with: subscriber of
property disjoint with: has space
property disjoint with: has owner
property disjoint with: parent of
property disjoint with: container of
property disjoint with: space of
property disjoint with: has container
property disjoint with: function of
property disjoint with: has subscriber
property disjoint with: email
property disjoint with: usergroup of
property disjoint with: Sent to
property disjoint with: has usergroup
property disjoint with: has administrator
property disjoint with: bottomObjectProperty
property disjoint with: owner of
property disjoint with: has moderator
property disjoint with: has member
property disjoint with: has host
comment: Links to a previous (older) revision of this Item or Post.
domain: Item
range: Item

Space
subclass of: Thing
disjoint with: Point
disjoint with: Evaluate
disjoint with: Assert
disjoint with: Post
disjoint with: Owner tag action
disjoint with: Give access rights to
disjoint with: N-tuple tag action with machine tag syntax
disjoint with: Ask
disjoint with: Machine tag action
disjoint with: Nothing
disjoint with: Set task
type: Class
disjoint with: Express feelings
disjoint with: Tag action
disjoint with: Auto tag action
disjoint with: Usergroup
disjoint with: N-tuple tag action
disjoint with: Manual tag action
disjoint with: Share
disjoint with: Aggregate
disjoint with: User Account
disjoint with: Item
disjoint with: User
disjoint with: Syntactic Tag Action
disjoint with: Role
disjoint with: Disambiguate Tag Action
disjoint with: Visitor tag action
disjoint with: Web concept tag action
comment: A Space is a place where data resides, e.g. on a website, desktop, fileshare, etc.

function of
type: ObjectProperty
property disjoint with: administrator of
property disjoint with: next version
property disjoint with: host of
property disjoint with: sibling
property disjoint with: has administrator
property disjoint with: has subscriber
property disjoint with: owner of
property disjoint with: has moderator
property disjoint with: has parent
property disjoint with: avatar
property disjoint with: embeds knowledge
property disjoint with: container of
property disjoint with: reply of
property disjoint with: modifier of
property disjoint with: creator of
sub property of: topObjectProperty
property disjoint with: parent of
property disjoint with: later version
property disjoint with: previous version
property disjoint with: previous by date
property disjoint with: next by date
property disjoint with: bottomObjectProperty
property disjoint with: has reply
property disjoint with: attachment
property disjoint with: reference
property disjoint with: account of
property disjoint with: addressed to
property disjoint with: usergroup of
property disjoint with: has discussion
property disjoint with: email
property disjoint with: Belongs to tag collection
property disjoint with: has container
property disjoint with: has usergroup
property disjoint with: has host
property disjoint with: subscriber of
inverse of: has function
property disjoint with: member of
property disjoint with: has member
property disjoint with: has modifier
property disjoint with: latest version
property disjoint with: earlier version
property disjoint with: about
property disjoint with: space of
property disjoint with: moderator of
property disjoint with: follows
comment: A UserAccount that has this Role.
domain: Role

has function
property disjoint with: has creator
property disjoint with: has usergroup
property disjoint with: has moderator
inverse of: function of
property disjoint with: has container
property disjoint with: has owner
property disjoint with: has modifier
property disjoint with: latest version
property disjoint with: has administrator
property disjoint with: account
property disjoint with: has subscriber
property disjoint with: later version
property disjoint with: earlier version
property disjoint with: usergroup of
property disjoint with: subscriber of
property disjoint with: previous by date
property disjoint with: member of
sub property of: topObjectProperty
property disjoint with: next version
property disjoint with: modifier of
property disjoint with: has parent
property disjoint with: has host
property disjoint with: reply of
property disjoint with: Sent to
property disjoint with: next by date
property disjoint with: has member
property disjoint with: container of
property disjoint with: bottomObjectProperty
property disjoint with: parent of
property disjoint with: follows
property disjoint with: previous version
property disjoint with: Sent by
property disjoint with: moderator of
property disjoint with: sibling
property disjoint with: has reply
type: ObjectProperty
property disjoint with: host of
property disjoint with: administrator of
property disjoint with: has space
comment: A Role that this UserAccount has.
range: Role

phone
term status: testing
type: Thing
sub property of: topObjectProperty
property disjoint with: bottomObjectProperty
type: ObjectProperty
type: Property
comment: A phone, specified using fully qualified tel: URI scheme (refs: http://www.w3.org/Addressing/schemes.html#tel).

is resolution of
sub property of: topObjectProperty
sub property of: requests
property disjoint with: bottomObjectProperty
inverse of: resolves to
type: ObjectProperty
range: uri
domain: web server

Is relevant to somebody
sub property of: topObjectProperty
sub property of: isRelevantTo
property disjoint with: bottomObjectProperty
type: ObjectProperty
label: Est pertinent pour quelqu'un @fr
type: Property
comment: Subproperty of 'is relevant to' used to link a resource to the person whom it may be relevant to. In other words, in such a way that no immediate formal link can be inferred between the two except from the point of view of a precise person in addition to the user who defined the said link.
comment: Sub-propriedad de 'isRelevantTo' usada para asociar un recurso a la persona para la que puede ser pertinente, de manera que ningun enlace formal inmediato pueda ser inferido entre los dos, excepto desde el punto de vista del creador de esa asociación. @es
range: Person
label: Es pertinente para alguien @es
comment: Sous-propriété de 'isRelevantTo', utilisée pour associer une ressource à une personne de telle manière qu'aucun lien formel ne puisse être inféré entre les deux excepté du point de vue du destinataire et du destinateur du tag. @fr
label: È pertinente a qualcuno @it
comment: Deeleigenschap van ‘isRelevantTo’, gebruikt om een verband tot stand te brengen tussen een bron en de persoon waar het betrekking tot kan hebben. In een zodanige vorm dat er geen onmiddelijke formele relatie tussen de twee afgeleid kan worden behalve vanuit het gezichtspunt van een specifiek persoon en de gebruiker die dit verband gelegd heeft. @nl
comment: Sotto-proprietà di 'isRelevantTo' usata per associare una risorsa alla persona a cui può essere pertinente, in modo tale che nessun collegamento formale immediato possa essere inferito fra i due, eccetto dal punto di vista del creatore di tale collegamento @it
label: Is relevant voor iemand @nl

has space
property disjoint with: has creator
property disjoint with: has administrator
property disjoint with: has subscriber
property disjoint with: later version
property disjoint with: next by date
property disjoint with: reply of
property disjoint with: container of
property disjoint with: has function
property disjoint with: sibling
property disjoint with: earlier version
property disjoint with: member of
inverse of: space of
property disjoint with: previous version
property disjoint with: has moderator
property disjoint with: account
property disjoint with: follows
property disjoint with: has member
property disjoint with: latest version
type: ObjectProperty
property disjoint with: modifier of
property disjoint with: next version
property disjoint with: has reply
property disjoint with: has modifier
property disjoint with: has usergroup
sub property of: topObjectProperty
property disjoint with: scope of
property disjoint with: bottomObjectProperty
property disjoint with: Sent by
property disjoint with: Sent to
property disjoint with: previous by date
property disjoint with: has owner
comment: A data Space which this resource is a part of.
range: Space

located on
sub property of: topObjectProperty
property disjoint with: is about
property disjoint with: bottomObjectProperty
inverse of: is location of
type: ObjectProperty
comment: A relation between a WebRepresentation and a WebServer, indicating that the WebRepresentation can be obtained by e.g. an HTTP request to the WebServer.
range: web server
domain: awww representation

User
disjoint with: Role
disjoint with: Point
disjoint with: Nothing
type: Class
disjoint with: Give access rights to
disjoint with: Thread
disjoint with: Usergroup
disjoint with: Ask
disjoint with: Evaluate
disjoint with: Assert
disjoint with: Manual tag action
disjoint with: Container
disjoint with: Forum
disjoint with: Item
disjoint with: Owner tag action
equivalent class: User Account
disjoint with: N-tuple tag action
disjoint with: Community
disjoint with: Tag action
disjoint with: Space
disjoint with: Set task
disjoint with: Visitor tag action
subclass of: Thing
disjoint with: Share
subclass of: Online Account
disjoint with: N-tuple tag action with machine tag syntax
disjoint with: Disambiguate Tag Action
disjoint with: Site
disjoint with: Post
disjoint with: Aggregate
subclass of: User Account
disjoint with: Web concept tag action
disjoint with: Express feelings
disjoint with: Auto tag action
disjoint with: Machine tag action
disjoint with: Syntactic Tag Action
version info: This class is deprecated. Use sioc:UserAccount from the SIOC ontology instead.
type: DeprecatedClass
comment: UserAccount is now preferred. This is a deprecated class for a User in an online community site.

Image
type: Class
disjoint with: Organization
subclass of: Thing
type: Thing
disjoint with: Project
subclass of: Document
disjoint with: Nothing
term status: testing
comment: An image.

num views
sub property of: topDataProperty
property disjoint with: bottomDataProperty
property disjoint with: has URI string value
type: DatatypeProperty
comment: The number of times this Item, Thread, UserAccount profile, etc. has been viewed.
range: nonNegativeInteger

has part
sub property of: topObjectProperty
property disjoint with: bottomObjectProperty
inverse of: part of
type: ObjectProperty
type: DeprecatedProperty
comment: An resource that is a part of this subject.
version info: This property is deprecated. Use dcterms:hasPart from the Dublin Core ontology instead.

made
inverse of: maker
type: ObjectProperty
type: Thing
inverse of: creator
property disjoint with: bottomObjectProperty
sub property of: topObjectProperty
term status: stable
type: Property
comment: Something that was made by this agent.
domain: Agent
range: Thing

Has part
sub property of: topObjectProperty
sub property of: Is related to
property disjoint with: bottomObjectProperty
type: ObjectProperty
comment: Proprietà usata quando il contenuto di una tag indica quale parte della rappresentazione di una risorsa su Web è taggata. @it
label: A pour partie @fr
comment: Property used when the label of a tag indicates which part of a Web representation is being tagged.
type: Property
label: Ha come parte @it
comment: Propriété utilisée quand le libellé d'un tag indique quelle partie de la représentation d'une ressource sur le Web est taguée. @fr
range: Part Of Web representation
label: Heeft als deel @nl
comment: Propriedad usada cuando el contenido de una etiqueta indica que parte de la representación de un recurso en la Web ha sido etiquetada. @es
label: Tiene como parte @es
comment: Eigenschap die gebruikt wordt wanneer het label van een tag aangeeft welk gedeelte van een web-representatie getagd wordt. @nl
domain: WebRepresentation

has member
property disjoint with: owner of
property disjoint with: about
property disjoint with: bottomObjectProperty
property disjoint with: has reply
property disjoint with: next version
sub property of: topObjectProperty
property disjoint with: usergroup of
property disjoint with: sibling
property disjoint with: follows
property disjoint with: container of
property disjoint with: creator of
property disjoint with: administrator of
property disjoint with: avatar
property disjoint with: reply of
property disjoint with: Belongs to tag collection
property disjoint with: later version
property disjoint with: account of
property disjoint with: scope of
property disjoint with: previous by date
property disjoint with: space of
property disjoint with: next by date
property disjoint with: modifier of
property disjoint with: subscriber of
property disjoint with: has subscriber
property disjoint with: embeds knowledge
inverse of: member of
property disjoint with: function of
type: ObjectProperty
property disjoint with: has administrator
property disjoint with: attachment
property disjoint with: email
property disjoint with: has space
property disjoint with: addressed to
property disjoint with: has modifier
property disjoint with: earlier version
property disjoint with: previous version
property disjoint with: latest version
property disjoint with: host of
property disjoint with: member of
property disjoint with: has scope
property disjoint with: parent of
property disjoint with: has usergroup
property disjoint with: has function
property disjoint with: has container
property disjoint with: has parent
property disjoint with: reference
property disjoint with: has discussion
property disjoint with: has moderator
property disjoint with: moderator of
property disjoint with: has host
comment: A UserAccount that is a member of this Usergroup.
domain: Usergroup
range: User Account

is primary topic of
sub property of: topObjectProperty
property disjoint with: bottomObjectProperty
type: Thing
type: ObjectProperty
sub property of: page
type: InverseFunctionalProperty
term status: stable
inverse of: primary topic
comment: A document that this thing is the primary topic of.
domain: Thing
range: Document
type: Property

num replies
sub property of: topDataProperty
property disjoint with: bottomDataProperty
property disjoint with: has URI string value
type: DatatypeProperty
comment: The number of replies that this Item, Thread, Post, etc. has. Useful for when the reply structure is absent.
range: nonNegativeInteger

resolves to
sub property of: topObjectProperty
sub property of: accesses
property disjoint with: bottomObjectProperty
inverse of: is resolution of
type: ObjectProperty
comment: Relates a URI to a concrete Web server, which currently is done by mapping a URI to an IP address or addresses.
domain: uri
range: web server

topic
sub property of: topObjectProperty
sub property of: subject
property disjoint with: bottomObjectProperty
type: ObjectProperty
comment: A topic of interest, linking to the appropriate URI, e.g. in the Open Directory Project or of a SKOS category.

Web concept tag action
disjoint with: Container
disjoint with: Usergroup
disjoint with: Space
subclass of: Tag action
subclass of: Graph
disjoint with: Nothing
disjoint with: User Account
disjoint with: User
disjoint with: Site
disjoint with: Forum
type: Class
disjoint with: Role
subclass of: Item
disjoint with: Thread
disjoint with: Community
subclass of: Thing
label: Acción de etiquetado con Web concept @es
label: Azione di tagging con Web concept @it
label: Taghandeling met webconcept @nl
comment: Usata per descrivere un'azioni di tagging effettuata con l'aiuto di un concetto Web (per esempio geonames). @it
comment: Wordt gebruikt om taghandelingen te beschrijven waarbij gebruikt gemaakt woord van webconcepten (zoals geonames). @nl
comment: Usada para describir una acción de etiquetado realizada con la ayuda de un concepto Web (por ejemplo geonames). @es
comment: Utilisé pour décrire un taggage effectué à l'aide de concepts Web (tels que geonames). @fr
label: Acte de taguer par concept Web @fr
comment: Describes tagging involving Web concepts (such as geonames).

Document
term status: testing
subclass of: Thing
disjoint with: Nothing
type: Class
disjoint with: Project
type: Thing
disjoint with: Organization
comment: A document.

scope of
property disjoint with: reply of
property disjoint with: Sent by
property disjoint with: has space
property disjoint with: follows
property disjoint with: previous by date
property disjoint with: next by date
property disjoint with: container of
property disjoint with: sibling
property disjoint with: moderator of
property disjoint with: has host
property disjoint with: latest version
property disjoint with: has modifier
property disjoint with: next version
property disjoint with: subscriber of
property disjoint with: has parent
property disjoint with: has creator
property disjoint with: Sent to
property disjoint with: earlier version
property disjoint with: has administrator
property disjoint with: previous version
property disjoint with: host of
property disjoint with: member of
property disjoint with: administrator of
property disjoint with: has usergroup
type: ObjectProperty
property disjoint with: has reply
property disjoint with: has owner
property disjoint with: parent of
property disjoint with: modifier of
property disjoint with: usergroup of
property disjoint with: has moderator
property disjoint with: has member
inverse of: has scope
sub property of: topObjectProperty
property disjoint with: later version
property disjoint with: account
property disjoint with: has container
property disjoint with: has subscriber
property disjoint with: bottomObjectProperty
comment: A Role that has a scope of this resource.
range: Role

Online Gaming Account
term status: unstable
type: Thing
disjoint with: Nothing
subclass of: Thing
subclass of: Online Account
type: Class
comment: An online gaming account.

sibling
property disjoint with: has moderator
property disjoint with: Sent by
property disjoint with: has owner
property disjoint with: space of
property disjoint with: has parent
property disjoint with: has host
property disjoint with: has scope
property disjoint with: has container
property disjoint with: has usergroup
property disjoint with: owner of
type: ObjectProperty
property disjoint with: has space
property disjoint with: parent of
property disjoint with: modifier of
property disjoint with: has member
property disjoint with: bottomObjectProperty
property disjoint with: email
sub property of: topObjectProperty
property disjoint with: has subscriber
property disjoint with: Sent to
property disjoint with: has function
property disjoint with: function of
property disjoint with: has modifier
property disjoint with: has creator
property disjoint with: subscriber of
property disjoint with: administrator of
property disjoint with: scope of
property disjoint with: account
type: SymmetricProperty
property disjoint with: account of
property disjoint with: usergroup of
property disjoint with: follows
property disjoint with: member of
property disjoint with: creator of
property disjoint with: has administrator
property disjoint with: host of
property disjoint with: moderator of
property disjoint with: container of
property disjoint with: avatar
comment: An Item may have a sibling or a twin that exists in a different Container, but the siblings may differ in some small way (for example, language, category, etc.). The sibling of this Item should be self-describing (that is, it should contain all available information).
domain: Item
range: Item

lastName
term status: testing
type: Thing
sub property of: topDataProperty
property disjoint with: bottomDataProperty
type: DatatypeProperty
type: Property
comment: The last name of a person.
domain: Person
range: Literal

refers to
sub property of: topObjectProperty
sub property of: accesses
property disjoint with: bottomObjectProperty
inverse of: is referenced by
type: ObjectProperty
comment: The relation between a URI and the resources it refers to.
domain: uri
range: resource

creator of
property disjoint with: has scope
property disjoint with: reply of
property disjoint with: container of
property disjoint with: space of
property disjoint with: host of
property disjoint with: function of
property disjoint with: usergroup of
property disjoint with: previous version
type: ObjectProperty
sub property of: topObjectProperty
property disjoint with: has reply
property disjoint with: earlier version
property disjoint with: attachment
property disjoint with: has moderator
property disjoint with: addressed to
property disjoint with: next version
property disjoint with: has administrator
property disjoint with: has container
property disjoint with: sibling
property disjoint with: has host
property disjoint with: next by date
property disjoint with: has parent
property disjoint with: reference
property disjoint with: has subscriber
property disjoint with: has member
property disjoint with: about
property disjoint with: Belongs to tag collection
property disjoint with: previous by date
property disjoint with: has discussion
property disjoint with: has usergroup
property disjoint with: has modifier
property disjoint with: bottomObjectProperty
inverse of: has creator
property disjoint with: embeds knowledge
property disjoint with: parent of
property disjoint with: later version
property disjoint with: latest version
comment: A resource that the UserAccount is a creator of.
domain: User Account

gender
term status: testing
type: Thing
sub property of: topDataProperty
property disjoint with: bottomDataProperty
type: FunctionalProperty
type: DatatypeProperty
type: Property
comment: The gender of this Agent (typically but not necessarily 'male' or 'female').
domain: Agent
range: Literal

awww representation
subclass of: InformationRealization
disjoint with: InformationObject
subclass of: non-information resources
subclass of: Tagged resource
disjoint with: information resource
subclass of: resource
subclass of: Annotated resource
disjoint with: Nothing
subclass of: http://lodlaundromat.org/.well-known/genid/samples/pellet///class//0b7a6cec83cd7a6ef81ffd016aefb0e4/7c71b10046805dc486cf71431721ea93#10
disjoint with: web resource
equivalent class: Annotated resource
subclass of: Thing
subclass of: http://lodlaundromat.org/.well-known/genid/samples/pellet///class//0b7a6cec83cd7a6ef81ffd016aefb0e4/f32d8dc45613bef895570d2297255a7b#10
type: Class
disjoint with: abstract resource
subclass of: physical resource
disjoint with: conceptual resource
subclass of: http://lodlaundromat.org/.well-known/genid/samples/pellet///class//0b7a6cec83cd7a6ef81ffd016aefb0e4/f32d8dc45613bef895570d2297255a7b#4
subclass of: http://lodlaundromat.org/.well-known/genid/samples/pellet///class//0b7a6cec83cd7a6ef81ffd016aefb0e4/7c71b10046805dc486cf71431721ea93#4
comment: The realization of a message encoding that 'goes on the wire' according to an interaction protocol (e.g. http) in order to resolve a Web accessible resource. Representation have neither a URL nor a URI, they are associated with the URL of the Web Resource they represent. Representation are disjoint with Web resources

theme
term status: archaic
type: Thing
sub property of: topObjectProperty
property disjoint with: bottomObjectProperty
type: ObjectProperty
type: Property
comment: A theme.
domain: Thing
range: Thing

latest version
property disjoint with: has administrator
type: ObjectProperty
property disjoint with: function of
property disjoint with: has modifier
property disjoint with: modifier of
property disjoint with: parent of
property disjoint with: administrator of
sub property of: topObjectProperty
property disjoint with: account
property disjoint with: creator of
property disjoint with: follows
property disjoint with: container of
property disjoint with: moderator of
property disjoint with: has parent
property disjoint with: scope of
property disjoint with: has subscriber
property disjoint with: has owner
property disjoint with: has function
property disjoint with: subscriber of
property disjoint with: bottomObjectProperty
property disjoint with: has container
property disjoint with: has creator
property disjoint with: Sent to
property disjoint with: has host
property disjoint with: owner of
property disjoint with: email
property disjoint with: has moderator
property disjoint with: account of
property disjoint with: usergroup of
property disjoint with: avatar
property disjoint with: has scope
property disjoint with: has space
property disjoint with: space of
property disjoint with: member of
property disjoint with: Sent by
property disjoint with: has member
property disjoint with: host of
property disjoint with: has usergroup
comment: Links to the latest revision of this Item or Post.
domain: Item
range: Item

User Account
disjoint with: Visitor tag action
type: Class
disjoint with: Role
subclass of: Thing
disjoint with: Site
equivalent class: User
disjoint with: Disambiguate Tag Action
disjoint with: Assert
disjoint with: Owner tag action
subclass of: Online Account
disjoint with: Auto tag action
subclass of: User
disjoint with: Thread
disjoint with: Usergroup
disjoint with: Set task
disjoint with: Nothing
disjoint with: Space
disjoint with: Tag action
disjoint with: Machine tag action
disjoint with: Community
disjoint with: Give access rights to
disjoint with: Web concept tag action
disjoint with: Manual tag action
disjoint with: Share
disjoint with: Syntactic Tag Action
disjoint with: Forum
disjoint with: N-tuple tag action with machine tag syntax
disjoint with: Container
disjoint with: N-tuple tag action
disjoint with: Post
disjoint with: Aggregate
disjoint with: Item
disjoint with: Express feelings
disjoint with: Point
disjoint with: Evaluate
disjoint with: Ask
comment: A user account in an online community site.

links to
sub property of: topObjectProperty
sub property of: references
property disjoint with: bottomObjectProperty
type: ObjectProperty
comment: Links extracted from hyperlinks within a SIOC concept, e.g. Post or Site.

redirects to
sub property of: topObjectProperty
sub property of: accesses
property disjoint with: bottomObjectProperty
type: ObjectProperty
range: http://lodlaundromat.org/.well-known/genid/samples/pellet///class//0b7a6cec83cd7a6ef81ffd016aefb0e4/f32d8dc45613bef895570d2297255a7b#13
domain: uri
range: http://lodlaundromat.org/.well-known/genid/samples/pellet///class//0b7a6cec83cd7a6ef81ffd016aefb0e4/7c71b10046805dc486cf71431721ea93#13
comment: Redirections can be used outside the Semantic Web between just normal information resources, their domain and range says nothing about the type of resource. The only important aspect is that the reseource that is the destination of the redirection must be associated with a WebRepresentation, hence it must be a WebResource. This property can be used as top property for expressing special types of redirections e.g. TAG's 303 redirection or hash convention.

jabber ID
term status: testing
type: Thing
sub property of: topDataProperty
property disjoint with: bottomDataProperty
type: InverseFunctionalProperty
type: DatatypeProperty
type: Property
comment: A jabber ID for something.
domain: Agent
range: Literal

AIM chat ID
type: DatatypeProperty
property disjoint with: bottomDataProperty
sub property of: topDataProperty
type: InverseFunctionalProperty
term status: testing
type: Thing
sub property of: nickname
type: Property
domain: Agent
comment: An AIM chat ID
range: Literal

reply of
property disjoint with: usergroup of
property disjoint with: has moderator
property disjoint with: has function
sub property of: topObjectProperty
property disjoint with: has usergroup
property disjoint with: function of
property disjoint with: owner of
property disjoint with: host of
property disjoint with: administrator of
property disjoint with: member of
property disjoint with: has owner
inverse of: has reply
sub property of: related to
property disjoint with: creator of
property disjoint with: account
property disjoint with: email
property disjoint with: follows
property disjoint with: has subscriber
property disjoint with: has container
property disjoint with: modifier of
property disjoint with: has creator
property disjoint with: container of
property disjoint with: scope of
type: ObjectProperty
property disjoint with: Sent by
property disjoint with: avatar
property disjoint with: space of
property disjoint with: has member
property disjoint with: has administrator
property disjoint with: account of
property disjoint with: has host
property disjoint with: Sent to
property disjoint with: bottomObjectProperty
property disjoint with: has scope
property disjoint with: has modifier
property disjoint with: has space
property disjoint with: moderator of
property disjoint with: has parent
property disjoint with: subscriber of
property disjoint with: parent of
comment: Links to an Item or Post which this Item or Post is a reply to.
domain: Item
range: Item

workplace homepage
term status: testing
type: Thing
sub property of: topObjectProperty
property disjoint with: bottomObjectProperty
type: ObjectProperty
type: Property
comment: A workplace homepage of some person; the homepage of an organization they work for.
domain: Person
range: Document

Forum
disjoint with: Express feelings
disjoint with: Role
disjoint with: Syntactic Tag Action
disjoint with: Owner tag action
disjoint with: Ask
disjoint with: Aggregate
disjoint with: Assert
disjoint with: Machine tag action
disjoint with: Point
disjoint with: Usergroup
disjoint with: Set task
disjoint with: Share
disjoint with: Manual tag action
disjoint with: N-tuple tag action with machine tag syntax
subclass of: Thing
disjoint with: Nothing
disjoint with: Give access rights to
disjoint with: Auto tag action
disjoint with: Tag action
disjoint with: Post
disjoint with: N-tuple tag action
disjoint with: Disambiguate Tag Action
disjoint with: Web concept tag action
disjoint with: User Account
disjoint with: Visitor tag action
disjoint with: Evaluate
type: Class
disjoint with: User
disjoint with: Item
subclass of: Container
comment: A discussion area on which Posts or entries are made.

personal mailbox
term status: stable
type: Thing
sub property of: topObjectProperty
property disjoint with: bottomObjectProperty
type: InverseFunctionalProperty
type: ObjectProperty
type: Property
comment: A personal mailbox, ie. an Internet mailbox associated with exactly one owner, the first owner of this mailbox. This is a 'static inverse functional property', in that there is (across time and change) at most one individual that ever has any particular value for foaf:mbox.
domain: Agent
range: Thing

addressed to
property disjoint with: administrator of
property disjoint with: host of
property disjoint with: email
property disjoint with: has host
property disjoint with: parent of
property disjoint with: owner of
property disjoint with: usergroup of
type: ObjectProperty
property disjoint with: has usergroup
property disjoint with: has subscriber
property disjoint with: creator of
property disjoint with: moderator of
property disjoint with: bottomObjectProperty
property disjoint with: has member
sub property of: topObjectProperty
property disjoint with: avatar
property disjoint with: modifier of
property disjoint with: follows
property disjoint with: space of
property disjoint with: container of
property disjoint with: account of
property disjoint with: has moderator
property disjoint with: has parent
property disjoint with: has scope
property disjoint with: has administrator
property disjoint with: function of
property disjoint with: subscriber of
property disjoint with: member of
comment: Refers to who (e.g. a UserAccount, e-mail address, etc.) a particular Item is addressed to.
domain: Item

Thread
type: Class
disjoint with: N-tuple tag action with machine tag syntax
disjoint with: Post
disjoint with: Express feelings
disjoint with: Disambiguate Tag Action
disjoint with: Manual tag action
disjoint with: Usergroup
disjoint with: Owner tag action
disjoint with: Nothing
disjoint with: Auto tag action
disjoint with: Role
disjoint with: Ask
disjoint with: Assert
disjoint with: User
disjoint with: Syntactic Tag Action
disjoint with: Item
subclass of: Container
subclass of: Thing
disjoint with: Web concept tag action
disjoint with: Visitor tag action
disjoint with: Share
disjoint with: Machine tag action
disjoint with: Evaluate
disjoint with: Aggregate
disjoint with: Set task
disjoint with: User Account
disjoint with: Give access rights to
disjoint with: Tag action
disjoint with: Point
disjoint with: N-tuple tag action
comment: A container for a series of threaded discussion Posts or Items.

Sent to
property disjoint with: has parent
property disjoint with: has usergroup
property disjoint with: member of
property disjoint with: scope of
property disjoint with: bottomObjectProperty
property disjoint with: has container
sub property of: Is related to
sub property of: topObjectProperty
property disjoint with: has space
property disjoint with: moderator of
property disjoint with: parent of
property disjoint with: has function
property disjoint with: previous by date
property disjoint with: administrator of
property disjoint with: usergroup of
property disjoint with: host of
property disjoint with: reply of
property disjoint with: has reply
property disjoint with: sibling
property disjoint with: next by date
property disjoint with: subscriber of
property disjoint with: next version
property disjoint with: later version
property disjoint with: latest version
property disjoint with: earlier version
type: ObjectProperty
property disjoint with: has host
property disjoint with: container of
property disjoint with: modifier of
property disjoint with: previous version
label: Envoyé à @fr
comment: Propriété utilisée quand le libellé d'un tag indique à quel utilisateur une ressource a été suggérée (modélise des fonctionalités existantes telles que les tags "for:-username" sur Delicious). @fr
comment: Propriedad usada cuando el contenido de una etiqueta indica a que usuario un recurso ha sido sugerido (modeliza funcionalidades existentes como las etiquetas "for:usuario" en Delicious). @es
comment: Proprietà usata quando il contenuto di una tag indica a quale utente una risorsa è stata suggerita (modellizza funzionalità esistenti come le tag "for:utente" in Delicious). @it
comment: Property used when the label of a tag indicates to whom a resource was suggested (models existing features like delicious "for:-username" tags).
label: Inviato a @it
label: Enviado a @es
range: User Account
comment: Eigenschap die gebruikt wordt wanneer het label van een tag aangeeft aan wie de bron is voorgesteld (modelleert bestaande functionaliteit zoals de "for:-username" tags op Delicious). @nl
domain: WebRepresentation
type: Property
label: Verstuurd aan @nl

about
property disjoint with: has subscriber
sub property of: topObjectProperty
property disjoint with: follows
property disjoint with: container of
property disjoint with: has host
property disjoint with: has administrator
property disjoint with: moderator of
property disjoint with: space of
property disjoint with: usergroup of
property disjoint with: member of
property disjoint with: modifier of
property disjoint with: has moderator
property disjoint with: has parent
property disjoint with: account of
property disjoint with: owner of
property disjoint with: bottomObjectProperty
property disjoint with: host of
property disjoint with: has member
property disjoint with: has usergroup
property disjoint with: function of
property disjoint with: has scope
property disjoint with: creator of
property disjoint with: avatar
type: ObjectProperty
property disjoint with: email
property disjoint with: subscriber of
property disjoint with: parent of
property disjoint with: administrator of
comment: Specifies that this Item is about a particular resource, e.g. a Post describing a book, hotel, etc.
domain: Item

Community tag collection
disjoint with: Nothing
subclass of: Tag collection
subclass of: Thing
type: Class
comment: Una colección de etiquetas generada por los usuarios de una comunidad en linea o de un servicio Web dados. @es
label: Colección de etiquetas comunitaria @es
comment: Une collection de tag constituée par les utilisateurs d'une communauté ou d'un service donnés. @fr
label: Collection de tags communautaire @fr
label: Collezione di tag comunitaria @it
comment: Una collezione di tag generata dagli utenti di una comunità online o di un servizio Web dati. @it
comment: Een verzameling tags die gegenereerd is door een groep gebruikers van een gemeenschap of digitale dienst. @nl
label: Gemeenschapstagverzameling @nl
comment: A collection of tags generated by the users of a given online community or Web service.

focus
term status: testing
type: Thing
sub property of: topObjectProperty
property disjoint with: bottomObjectProperty
type: ObjectProperty
type: Property
comment: The underlying or 'focal' entity associated with some SKOS-described concept.
domain: Concept
range: Thing

Evaluate
disjoint with: Thread
disjoint with: Usergroup
type: Class
disjoint with: Site
disjoint with: Space
subclass of: Item
disjoint with: Nothing
disjoint with: User Account
disjoint with: Container
subclass of: Graph
subclass of: Tag action
disjoint with: Forum
disjoint with: Role
disjoint with: Community
disjoint with: User
subclass of: Thing
label: Evaluar @es
comment: Describes the action that is performed with a tag whenever it is used to give a notation, a mark of approval and disapproval, or, more generally speaking, an evaluation.
comment: Beschrijft de handeling die verricht wordt met een tag wanneer deze gebruikt wordt om een klassering, een teken van goedkeuring of afkeuring, of meer algemeen een beoordeling te geven. @nl
comment: Descrive l'azione che si compie con una tag quando questa è usata per esprimere approvazione o disapprovazione, o, più in generale, una valutazione. @it
label: Beoordelen @nl
comment: Décrit l'action que l'on accomplit avec un tag dès lors que celui-ci est utilisé pour donner une note, marquer son approbation ou sa désapprobation ou, plus généralement, produirez une évaluation. @fr
label: Evaluer @fr
comment: Describe la acción que se realiza con una etiqueta cuando es usada para expresar aprobación o desaprobación o, mas en general, una evaluación. @es
label: Valutare @it

openid
type: ObjectProperty
term status: testing
sub property of: page
property disjoint with: bottomObjectProperty
type: InverseFunctionalProperty
sub property of: is primary topic of
sub property of: topObjectProperty
type: Thing
range: Document
type: Property
domain: Agent
comment: An OpenID for an Agent.

Manual tag action
subclass of: Item
disjoint with: Usergroup
disjoint with: Container
disjoint with: User Account
disjoint with: Space
disjoint with: User
subclass of: Tag action
disjoint with: Thread
disjoint with: Site
subclass of: Graph
disjoint with: Role
disjoint with: Community
subclass of: Thing
disjoint with: Nothing
disjoint with: Forum
type: Class
label: Azione di tagging manuale @it
label: Handmatige taghandeling @nl
comment: Descrive delle tag associate manualmente a una risorsa da un essere umano. @it
label: Acción de etiquetado manual @es
comment: Describes tags as manually associated to a resource by a human.
comment: Describe etiquetas asociadas manualmente a un recurso por un ser humano. @es
comment: Décrit des tags associés manuellement à une ressource par un être humain. @fr
label: Acte de taguer manuel @fr
comment: Beschrijft tags als handmatig met een bron geasssocieerd door een mens @nl

equivalent graph
sub property of: topObjectProperty
property disjoint with: bottomObjectProperty
type: ObjectProperty
type: Property
comment: The graphs associated with the subject and object are equivalent.
domain: Graph
range: Graph

requests
sub property of: topObjectProperty
property disjoint with: bottomObjectProperty
inverse of: accesses
type: TransitiveProperty
type: ObjectProperty
range: uri
domain: resource

Group
type: Thing
subclass of: Agent
disjoint with: Nothing
type: Class
subclass of: Thing
term status: stable
comment: A class of Agents.

Community
disjoint with: Post
disjoint with: Set task
disjoint with: User
disjoint with: Web concept tag action
disjoint with: Syntactic Tag Action
disjoint with: Express feelings
disjoint with: Role
disjoint with: Disambiguate Tag Action
disjoint with: Tag action
disjoint with: Assert
disjoint with: Point
disjoint with: Ask
type: Class
disjoint with: Owner tag action
disjoint with: Machine tag action
disjoint with: Share
disjoint with: Give access rights to
disjoint with: Aggregate
subclass of: Thing
disjoint with: Auto tag action
disjoint with: Item
disjoint with: Manual tag action
disjoint with: N-tuple tag action
disjoint with: Visitor tag action
disjoint with: User Account
disjoint with: Evaluate
disjoint with: Nothing
disjoint with: N-tuple tag action with machine tag syntax
comment: Community is a high-level concept that defines an online community and what it consists of.

web resource
subclass of: resource
disjoint with: awww representation
disjoint with: InformationRealization
subclass of: Thing
subclass of: http://lodlaundromat.org/.well-known/genid/samples/pellet///class//0b7a6cec83cd7a6ef81ffd016aefb0e4/7c71b10046805dc486cf71431721ea93#10
subclass of: InformationObject
type: Class
disjoint with: non-information resources
subclass of: Tagged resource
disjoint with: Nothing
disjoint with: abstract resource
disjoint with: physical resource
disjoint with: Annotated resource
subclass of: http://lodlaundromat.org/.well-known/genid/samples/pellet///class//0b7a6cec83cd7a6ef81ffd016aefb0e4/f32d8dc45613bef895570d2297255a7b#10
subclass of: information resource
disjoint with: conceptual resource
subclass of: http://lodlaundromat.org/.well-known/genid/samples/pellet///class//0b7a6cec83cd7a6ef81ffd016aefb0e4/7c71b10046805dc486cf71431721ea93#8
comment: InformationResources that have at least one WebRepresentation and at least a URI. For example, a WebResource containing the text of Moby Dick and its WebRepresentation encoded in HTML in English language.
subclass of: http://lodlaundromat.org/.well-known/genid/samples/pellet///class//0b7a6cec83cd7a6ef81ffd016aefb0e4/7c71b10046805dc486cf71431721ea93#7
subclass of: http://lodlaundromat.org/.well-known/genid/samples/pellet///class//0b7a6cec83cd7a6ef81ffd016aefb0e4/f32d8dc45613bef895570d2297255a7b#9
subclass of: http://lodlaundromat.org/.well-known/genid/samples/pellet///class//0b7a6cec83cd7a6ef81ffd016aefb0e4/f32d8dc45613bef895570d2297255a7b#7
subclass of: http://lodlaundromat.org/.well-known/genid/samples/pellet///class//0b7a6cec83cd7a6ef81ffd016aefb0e4/f32d8dc45613bef895570d2297255a7b#8
subclass of: http://lodlaundromat.org/.well-known/genid/samples/pellet///class//0b7a6cec83cd7a6ef81ffd016aefb0e4/7c71b10046805dc486cf71431721ea93#9

Online E-commerce Account
term status: unstable
type: Thing
disjoint with: Nothing
subclass of: Thing
subclass of: Online Account
type: Class
comment: An online e-commerce account.

È pertinente
sub property of: topObjectProperty
sub property of: Is related to
property disjoint with: bottomObjectProperty
type: ObjectProperty
comment: Propriété utilisée pour subsumer "isRelevantToSb" et "isRelevantToSt". @fr
comment: Proprietà usata per sussumere "isRelevantToSb" e "isRelevantToSt". @it
type: Property
label: Is relevant
comment: Eigenschap die gebruikt wordt om "isRelevantToSb" en "isRelevantToSt" onder één noemer te brengen. @nl
comment: Property used to subsume "isRelevantToSb" and "isRelevantToSt".
label: Est pertinent @fr
label: Es pertinente @es
comment: Propriedad usada para subsumir "isRelevantToSb" y "isRelevantToSt". @es

plan
term status: testing
type: Thing
sub property of: topDataProperty
property disjoint with: bottomDataProperty
type: DatatypeProperty
type: Property
comment: Aplan comment, in the tradition of finger and '.plan' files.
domain: Person
range: Literal

Graph
disjoint with: Nothing
subclass of: Thing
type: Class
comment: An RDF graph (with intensional semantics).

Nice Tag Ontology
description: NiceTag è un'ontologia che descrive nel modo più generale possibile le tag, o meglio le azioni di tagging, come atti linguistici nel Web @it
title: L'ontologia Nice Tag @it
title: La ontología Nice Tag @es
attribution URL: http://ns.inria.fr/nicetag/
type: Text
licence: http://creativecommons.org/licenses/by-sa/3.0/
description: NiceTag is een ontologie die zo algemeen mogelijk tags beschrijft, of meer precies de handeling van het taggen. NiceTag beschrijft de handeling van het taggen als een op het web plaats vindende taalhandeling. @nl
description: NiceTag est une ontologie décrivant le plus généralement possible les tags ou plutôt les actes de taguer comme des actes de langage survenant sur le Web @fr
title: Nice Tag ontologie @nl
type: Thing
description: NiceTag es una ontología que describe de la manera mas general posible las etiquetas, o mejor las acciones de etiquetado, como actos de habla en la Web @es
title: L'Ontologie Nice Tag @fr
description: NiceTag Ontology is an ontology which describes as generally as possible tags or rather tag actions understood as a speech acts occurring on the Web
version info: Version 0.5, 09 september 2010
type: Ontology

membershipClass
term status: unstable
type: Thing
type: Property
type: AnnotationProperty
comment: Indicates the class of individuals that are a member of a Group

has parent
property disjoint with: has moderator
property disjoint with: has creator
property disjoint with: owner of
property disjoint with: has modifier
property disjoint with: reply of
property disjoint with: container of
property disjoint with: creator of
property disjoint with: bottomObjectProperty
property disjoint with: about
property disjoint with: account of
property disjoint with: has container
property disjoint with: has owner
property disjoint with: usergroup of
property disjoint with: follows
property disjoint with: scope of
property disjoint with: Sent by
property disjoint with: later version
property disjoint with: has reply
property disjoint with: previous version
property disjoint with: administrator of
property disjoint with: previous by date
property disjoint with: next by date
property disjoint with: sibling
property disjoint with: member of
property disjoint with: subscriber of
property disjoint with: modifier of
property disjoint with: has member
property disjoint with: has scope
property disjoint with: Belongs to tag collection
property disjoint with: latest version
property disjoint with: account
property disjoint with: avatar
property disjoint with: has discussion
property disjoint with: email
inverse of: parent of
property disjoint with: has subscriber
property disjoint with: has function
property disjoint with: function of
type: ObjectProperty
property disjoint with: attachment
property disjoint with: Sent to
property disjoint with: addressed to
sub property of: topObjectProperty
property disjoint with: moderator of
property disjoint with: has usergroup
property disjoint with: reference
property disjoint with: next version
property disjoint with: earlier version
property disjoint with: embeds knowledge
property disjoint with: has administrator
comment: A Container or Forum that this Container or Forum is a child of.
domain: Container
range: Container

owner of
property disjoint with: container of
property disjoint with: embeds knowledge
sub property of: topObjectProperty
property disjoint with: earlier version
property disjoint with: has container
property disjoint with: attachment
property disjoint with: next version
property disjoint with: addressed to
property disjoint with: usergroup of
property disjoint with: has moderator
property disjoint with: has subscriber
property disjoint with: has reply
property disjoint with: reference
property disjoint with: bottomObjectProperty
property disjoint with: has parent
property disjoint with: next by date
property disjoint with: reply of
property disjoint with: space of
inverse of: has owner
property disjoint with: has modifier
property disjoint with: Belongs to tag collection
property disjoint with: function of
property disjoint with: previous by date
type: ObjectProperty
property disjoint with: later version
property disjoint with: parent of
property disjoint with: has administrator
property disjoint with: about
property disjoint with: has scope
property disjoint with: sibling
property disjoint with: previous version
property disjoint with: has member
property disjoint with: has discussion
property disjoint with: host of
property disjoint with: latest version
property disjoint with: has host
property disjoint with: has usergroup
comment: A resource owned by a particular UserAccount, for example, a weblog or image gallery.
domain: User Account

title
term status: testing
type: Thing
sub property of: topDataProperty
property disjoint with: bottomDataProperty
type: DatatypeProperty
type: Property
comment: Title (Mr, Mrs, Ms, Dr. etc)

Agent
type: Class
subclass of: Agent
equivalent class: Agent
subclass of: Thing
disjoint with: Nothing
type: Thing
term status: stable
comment: An agent (eg. person, group, software or physical artifact).

last name
property disjoint with: ip address
property disjoint with: content
property disjoint with: last item date
type: DatatypeProperty
property disjoint with: subject
property disjoint with: created at
property disjoint with: bottomDataProperty
property disjoint with: num items
sub property of: topDataProperty
property disjoint with: modified at
property disjoint with: title
property disjoint with: description
property disjoint with: num threads
property disjoint with: content encoded
type: DeprecatedProperty
comment: Last (real) name of this user. Synonyms include surname or family name.
domain: User Account
range: Literal
version info: This property is deprecated. Use foaf:name or foaf:surname from the FOAF vocabulary instead.

Label Property
term status: unstable
type: Thing
disjoint with: Nothing
subclass of: Thing
type: Class
comment: A foaf:LabelProperty is any RDF property with texual values that serve as labels.

has scope
property disjoint with: about
property disjoint with: later version
property disjoint with: subscriber of
type: ObjectProperty
property disjoint with: owner of
property disjoint with: host of
property disjoint with: usergroup of
property disjoint with: parent of
property disjoint with: modifier of
sub property of: topObjectProperty
property disjoint with: has reply
property disjoint with: has administrator
property disjoint with: follows
property disjoint with: member of
property disjoint with: has container
property disjoint with: reply of
property disjoint with: previous version
property disjoint with: has modifier
property disjoint with: moderator of
property disjoint with: addressed to
property disjoint with: next version
property disjoint with: has usergroup
property disjoint with: sibling
property disjoint with: container of
property disjoint with: email
property disjoint with: bottomObjectProperty
property disjoint with: account of
property disjoint with: has parent
property disjoint with: has discussion
property disjoint with: Belongs to tag collection
property disjoint with: has subscriber
property disjoint with: reference
property disjoint with: latest version
property disjoint with: next by date
property disjoint with: has host
property disjoint with: creator of
inverse of: scope of
property disjoint with: has moderator
property disjoint with: earlier version
property disjoint with: has member
property disjoint with: space of
property disjoint with: administrator of
property disjoint with: attachment
property disjoint with: previous by date
property disjoint with: avatar
property disjoint with: embeds knowledge
comment: A resource that this Role applies to.
domain: Role

modifier of
property disjoint with: space of
property disjoint with: has scope
property disjoint with: has usergroup
property disjoint with: has discussion
inverse of: has modifier
property disjoint with: has reply
property disjoint with: subscriber of
property disjoint with: administrator of
property disjoint with: has creator
property disjoint with: has modifier
property disjoint with: function of
property disjoint with: host of
property disjoint with: usergroup of
property disjoint with: has function
property disjoint with: previous version
property disjoint with: has owner
property disjoint with: bottomObjectProperty
property disjoint with: Sent by
property disjoint with: has space
sub property of: topObjectProperty
property disjoint with: account
property disjoint with: latest version
property disjoint with: has administrator
property disjoint with: parent of
property disjoint with: reply of
property disjoint with: reference
property disjoint with: has subscriber
property disjoint with: attachment
property disjoint with: has moderator
property disjoint with: container of
property disjoint with: has member
property disjoint with: has container
property disjoint with: follows
property disjoint with: moderator of
property disjoint with: addressed to
type: ObjectProperty
property disjoint with: sibling
property disjoint with: previous by date
property disjoint with: scope of
property disjoint with: about
property disjoint with: Belongs to tag collection
property disjoint with: member of
property disjoint with: next by date
property disjoint with: later version
property disjoint with: embeds knowledge
property disjoint with: earlier version
property disjoint with: Sent to
property disjoint with: has host
property disjoint with: has parent
property disjoint with: next version
comment: An Item that this UserAccount has modified.
domain: User Account
range: Item

birthday
term status: unstable
type: Thing
sub property of: topDataProperty
property disjoint with: bottomDataProperty
type: FunctionalProperty
type: DatatypeProperty
type: Property
comment: The birthday of this Agent, represented in mm-dd string form, eg. '12-31'.
domain: Agent
range: Literal

Item
disjoint with: User
disjoint with: Thread
disjoint with: Community
disjoint with: User Account
type: Class
disjoint with: Usergroup
disjoint with: Nothing
disjoint with: Role
disjoint with: Container
disjoint with: Site
disjoint with: Forum
disjoint with: Space
subclass of: Thing
comment: An Item is something which can be in a Container.

parent of
property disjoint with: avatar
property disjoint with: function of
property disjoint with: follows
property disjoint with: modifier of
property disjoint with: later version
property disjoint with: has subscriber
property disjoint with: earlier version
property disjoint with: next version
property disjoint with: bottomObjectProperty
property disjoint with: email
property disjoint with: has discussion
type: ObjectProperty
property disjoint with: about
property disjoint with: has reply
property disjoint with: Sent to
property disjoint with: scope of
property disjoint with: reference
property disjoint with: container of
property disjoint with: previous by date
property disjoint with: subscriber of
property disjoint with: next by date
property disjoint with: account of
property disjoint with: member of
sub property of: topObjectProperty
property disjoint with: has owner
property disjoint with: has creator
property disjoint with: reply of
property disjoint with: has container
inverse of: has parent
property disjoint with: has member
property disjoint with: Belongs to tag collection
property disjoint with: embeds knowledge
property disjoint with: attachment
property disjoint with: has moderator
property disjoint with: has modifier
property disjoint with: previous version
property disjoint with: sibling
property disjoint with: addressed to
property disjoint with: account
property disjoint with: usergroup of
property disjoint with: Sent by
property disjoint with: moderator of
property disjoint with: has usergroup
property disjoint with: creator of
property disjoint with: latest version
property disjoint with: has administrator
property disjoint with: owner of
property disjoint with: administrator of
property disjoint with: has scope
property disjoint with: has function
comment: A child Container or Forum that this Container or Forum is a parent of.
domain: Container
range: Container

sha1sum of a personal mailbox URI name
term status: testing
type: Thing
sub property of: topDataProperty
property disjoint with: bottomDataProperty
type: InverseFunctionalProperty
type: DatatypeProperty
type: Property
comment: The sha1sum of the URI of an Internet mailbox associated with exactly one owner, the first owner of the mailbox.
domain: Agent
range: Literal

administrator of
property disjoint with: attachment
property disjoint with: later version
property disjoint with: host of
property disjoint with: has reply
property disjoint with: member of
property disjoint with: latest version
property disjoint with: Sent by
property disjoint with: function of
property disjoint with: reply of
property disjoint with: space of
property disjoint with: about
sub property of: topObjectProperty
property disjoint with: has discussion
property disjoint with: has owner
property disjoint with: has member
property disjoint with: bottomObjectProperty
property disjoint with: earlier version
property disjoint with: Sent to
property disjoint with: has subscriber
property disjoint with: modifier of
property disjoint with: parent of
type: ObjectProperty
property disjoint with: previous by date
property disjoint with: reference
property disjoint with: Belongs to tag collection
property disjoint with: has modifier
property disjoint with: embeds knowledge
property disjoint with: scope of
property disjoint with: container of
property disjoint with: has administrator
property disjoint with: has scope
inverse of: has administrator
property disjoint with: sibling
property disjoint with: has creator
property disjoint with: has moderator
property disjoint with: has parent
property disjoint with: usergroup of
property disjoint with: has usergroup
property disjoint with: has function
property disjoint with: has container
property disjoint with: account
property disjoint with: next by date
property disjoint with: next version
property disjoint with: previous version
property disjoint with: has host
property disjoint with: addressed to
property disjoint with: follows
comment: A Site that the UserAccount is an administrator of.
domain: User Account
range: Site

has container
property disjoint with: has subscriber
property disjoint with: has function
type: ObjectProperty
property disjoint with: function of
property disjoint with: email
property disjoint with: container of
property disjoint with: account of
property disjoint with: host of
property disjoint with: previous version
property disjoint with: has moderator
property disjoint with: later version
property disjoint with: avatar
property disjoint with: has owner
property disjoint with: owner of
property disjoint with: moderator of
property disjoint with: has parent
property disjoint with: bottomObjectProperty
property disjoint with: has scope
property disjoint with: latest version
property disjoint with: earlier version
property disjoint with: next version
property disjoint with: usergroup of
property disjoint with: account
property disjoint with: has creator
property disjoint with: member of
property disjoint with: Sent by
property disjoint with: Sent to
sub property of: topObjectProperty
property disjoint with: has administrator
property disjoint with: administrator of
property disjoint with: modifier of
property disjoint with: has reply
property disjoint with: space of
property disjoint with: has member
property disjoint with: scope of
property disjoint with: has modifier
property disjoint with: previous by date
property disjoint with: subscriber of
property disjoint with: next by date
property disjoint with: has host
inverse of: container of
property disjoint with: follows
property disjoint with: sibling
property disjoint with: parent of
property disjoint with: creator of
property disjoint with: has usergroup
property disjoint with: reply of
comment: The Container to which this Item belongs.
domain: Item
range: Container

accesses
sub property of: topObjectProperty
property disjoint with: bottomObjectProperty
inverse of: requests
type: TransitiveProperty
type: ObjectProperty
domain: uri
comment: A causal connection from a resource to the thing identiﬁed.
range: resource

Tag collection
disjoint with: Nothing
subclass of: Thing
type: Class
comment: Una generica collezione di tag. @it
label: Tagverzameling @nl
label: Collection de tags @fr
comment: Undefined collection of tags.
comment: Une collection de tags ne répondant à aucune définition particulière. @fr
label: Colección de etiquetas @es
comment: Een verzameling tags zonder verdere specifieke definitie. @nl
label: Collezione di tag @it
comment: Una genérica colección de etiquetas. @es

non-information resources
disjoint with: Nothing
disjoint with: web resource
disjoint with: InformationObject
subclass of: Thing
subclass of: http://lodlaundromat.org/.well-known/genid/samples/pellet///class//0b7a6cec83cd7a6ef81ffd016aefb0e4/f32d8dc45613bef895570d2297255a7b#10
disjoint with: information resource
subclass of: http://lodlaundromat.org/.well-known/genid/samples/pellet///class//0b7a6cec83cd7a6ef81ffd016aefb0e4/7c71b10046805dc486cf71431721ea93#10
subclass of: Tagged resource
type: Class
subclass of: resource
subclass of: http://lodlaundromat.org/.well-known/genid/samples/pellet///class//0b7a6cec83cd7a6ef81ffd016aefb0e4/f32d8dc45613bef895570d2297255a7b#5
subclass of: http://lodlaundromat.org/.well-known/genid/samples/pellet///class//0b7a6cec83cd7a6ef81ffd016aefb0e4/7c71b10046805dc486cf71431721ea93#5
comment: All Semantic Web resources that are not information resources. They include abstract, conceptual, and physical resources.

note
sub property of: topDataProperty
property disjoint with: bottomDataProperty
type: DatatypeProperty
comment: A note associated with this resource, for example, if it has been edited by a UserAccount.
range: Literal

resource
equivalent class: http://lodlaundromat.org/.well-known/genid/samples/pellet///class//0b7a6cec83cd7a6ef81ffd016aefb0e4/7c71b10046805dc486cf71431721ea93#10
subclass of: http://lodlaundromat.org/.well-known/genid/samples/pellet///class//0b7a6cec83cd7a6ef81ffd016aefb0e4/f32d8dc45613bef895570d2297255a7b#10
equivalent class: Tagged resource
type: Class
subclass of: Tagged resource
subclass of: http://lodlaundromat.org/.well-known/genid/samples/pellet///class//0b7a6cec83cd7a6ef81ffd016aefb0e4/7c71b10046805dc486cf71431721ea93#10
subclass of: Thing
disjoint with: Nothing
equivalent class: http://lodlaundromat.org/.well-known/genid/samples/pellet///class//0b7a6cec83cd7a6ef81ffd016aefb0e4/f32d8dc45613bef895570d2297255a7b#10
comment: This class is meant to express the same intuition of rdfs:Resource but it is defined here in order to have OWL-DL compaibility. In an OWL Full version of this ontology we would have this class owl:equivalentClass rdfs:Resource.

link
sub property of: topObjectProperty
property disjoint with: bottomObjectProperty
type: ObjectProperty
comment: A URI of a document which contains this SIOC object.

nickname
term status: testing
type: Thing
sub property of: topDataProperty
property disjoint with: bottomDataProperty
type: DatatypeProperty
type: Property
comment: A short informal nickname characterising an agent (includes login identifiers, IRC and other chat nicknames).

part of
sub property of: topObjectProperty
property disjoint with: bottomObjectProperty
inverse of: has part
type: ObjectProperty
type: DeprecatedProperty
comment: A resource that the subject is a part of.
version info: This property is deprecated. Use dcterms:isPartOf from the Dublin Core ontology instead.

Organization
term status: stable
disjoint with: Image
subclass of: Agent
disjoint with: Nothing
disjoint with: Post
disjoint with: Person
disjoint with: Document
subclass of: Thing
type: Thing
disjoint with: PersonalProfileDocument
type: Class
comment: An organization.

publications
term status: testing
type: Thing
sub property of: topObjectProperty
property disjoint with: bottomObjectProperty
type: ObjectProperty
type: Property
comment: A link to the publications of this person.
domain: Person
range: Document

Belongs to tag collection
property disjoint with: owner of
property disjoint with: bottomObjectProperty
property disjoint with: follows
property disjoint with: email
property disjoint with: space of
property disjoint with: has subscriber
property disjoint with: moderator of
property disjoint with: has parent
property disjoint with: modifier of
property disjoint with: has administrator
property disjoint with: parent of
property disjoint with: has moderator
property disjoint with: function of
type: ObjectProperty
property disjoint with: subscriber of
property disjoint with: has scope
property disjoint with: has host
property disjoint with: creator of
property disjoint with: has usergroup
property disjoint with: administrator of
property disjoint with: host of
property disjoint with: account of
property disjoint with: has member
property disjoint with: usergroup of
sub property of: topObjectProperty
property disjoint with: member of
property disjoint with: avatar
property disjoint with: container of
type: Property
comment: Propriedad usada para asociar una singola acción de etiquetado a una colección de etiquetas, con el objetivo de dar cuenta de los diferentes niveles de agregación proporcionados por los servicios de etiquetado existentes. Hay varias maneras de agregar la etiquetas (por ejemplo, http://delicious.com/fabion_gandon/OWL permite de acceder a una reppresentación de todas las acciones de etiquetado realizadas por el titular de la cuenta "fabien_gandon", en las cuales aparece la etiqueta "OWL" en del.icio.us.com en un instante "t"). @es
label: Appartient à une collection de tags @fr
domain: Tag action
range: Tag collection
comment: Proprietà usata per associare una singola azione di tagging a una collezione di tag, con lo scopo di rendere conto dei vari livelli di aggregazione forniti dai servizi di tagging esistenti. Ci sono vari modi di aggregare delle tag (per esempio, http://delicious.com/fabion_gandon/OWL permette di accedere a una rappresentazione di tutte le azioni di tagging svolte dal titolare dell'account "fabien_gandon", nelle quali compare la tag "OWL" su del.icio.us.com in un istante "t"). @it
comment: Eigenschap die gebruikt wordt om een enkelvoudige taghandeling te koppelen aan een tagverzameling, zo rekenschap gevende van de verschillende niveaus waarop veelgebruikte tagdiensten tags bijeenverzamelen (http://delicious.com/fabion_gandon/OWL bijvoorbeeld, geeft een webrepresentatie van alle taghandelingen van de gebruiker "fabian_gandon" waar op een moment "t" het label "OWL" is gebruikt). @nl
comment: Propriété employée pour associer un acte de taguer singulier à une collection de tags. Ceci sert à rendre compte des multiples manières d'aggréger les tags offertes par les différents services existants (l'URI http://delicious.com/fabion_gandon/OWL permet par exemple d'accéder à une représentation de tous les actes de taguer accomplis par le titulaire du compte "fabien_gandon" où figure le libellé "OWL" sur delicious.com à un instant "t"). @fr
label: Pertenece a una colección de etiquetas @es
label: Appartiene a una collezione di tag @it
comment: Property used to link a single and well individuated TagAction to a TagCollection to account for the various levels of aggregation provided by common tagging applications. There exist different ways to aggregate tags (for instance, http://delicious.com/fabion_gandon/OWL gives a Web representation of all taggings of user "fabien_gandon" involving the tag labeled 'OWL' on delicious.com at time "t").
label: Behoort toe aan tagverzameling @nl

image
term status: testing
type: Thing
sub property of: topObjectProperty
sub property of: depiction
property disjoint with: bottomObjectProperty
type: ObjectProperty
type: Property
comment: An image that can be used to represent some thing (ie. those depictions which are particularly representative of something, eg. one's photo on a homepage).
domain: Person
range: Image

Skype ID
term status: testing
type: Thing
sub property of: topDataProperty
sub property of: nickname
property disjoint with: bottomDataProperty
type: DatatypeProperty
type: Property
comment: A Skype ID
domain: Agent
range: Literal

work info homepage
term status: testing
type: Thing
sub property of: topObjectProperty
property disjoint with: bottomObjectProperty
type: ObjectProperty
type: Property
comment: A work info homepage of some person; a page about their work for some organization.
domain: Person
range: Document

has group
sub property of: topObjectProperty
property disjoint with: bottomObjectProperty
inverse of: group of
type: ObjectProperty
type: DeprecatedProperty
version info: This property has been renamed. Use sioc:has_usergroup instead.

num threads
property disjoint with: content encoded
property disjoint with: subject
sub property of: topDataProperty
property disjoint with: modified at
property disjoint with: ip address
type: DatatypeProperty
property disjoint with: created at
property disjoint with: has URI string value
property disjoint with: title
property disjoint with: description
property disjoint with: first name
property disjoint with: last name
property disjoint with: content
property disjoint with: email sha1
property disjoint with: bottomDataProperty
comment: The number of Threads (AKA discussion topics) in a Forum.
domain: Forum
range: nonNegativeInteger

name
sub property of: topDataProperty
property disjoint with: bottomDataProperty
type: DatatypeProperty
comment: The name of a SIOC concept instance, e.g. a username for a UserAccount, group name for a Usergroup, etc.
range: Literal

usergroup of
property disjoint with: next by date
property disjoint with: previous version
property disjoint with: has administrator
property disjoint with: has subscriber
property disjoint with: has host
property disjoint with: later version
property disjoint with: scope of
property disjoint with: bottomObjectProperty
property disjoint with: has parent
property disjoint with: administrator of
property disjoint with: container of
property disjoint with: sibling
property disjoint with: has discussion
property disjoint with: Sent to
property disjoint with: has creator
property disjoint with: moderator of
property disjoint with: parent of
property disjoint with: Belongs to tag collection
inverse of: has usergroup
property disjoint with: earlier version
property disjoint with: account of
property disjoint with: has modifier
property disjoint with: owner of
property disjoint with: has member
property disjoint with: creator of
property disjoint with: reply of
property disjoint with: previous by date
property disjoint with: reference
property disjoint with: member of
property disjoint with: addressed to
property disjoint with: embeds knowledge
property disjoint with: account
property disjoint with: next version
property disjoint with: Sent by
property disjoint with: has moderator
property disjoint with: has container
property disjoint with: has function
property disjoint with: space of
property disjoint with: function of
property disjoint with: has usergroup
type: ObjectProperty
property disjoint with: email
property disjoint with: has owner
sub property of: topObjectProperty
property disjoint with: has scope
property disjoint with: subscriber of
property disjoint with: has reply
property disjoint with: avatar
property disjoint with: about
property disjoint with: attachment
property disjoint with: latest version
property disjoint with: follows
property disjoint with: host of
property disjoint with: modifier of
comment: A Space that the Usergroup has access to.
domain: Usergroup
range: Space

PersonalProfileDocument
term status: testing
disjoint with: Nothing
disjoint with: Project
type: Thing
subclass of: Thing
type: Class
subclass of: Document
disjoint with: Organization
comment: A personal profile RDF document.

last reply date
sub property of: date
sub property of: topDataProperty
property disjoint with: bottomDataProperty
type: DatatypeProperty
comment: The date and time of the last reply Post or Comment, which could be associated with a starter Item or Post or with a Thread, and expressed in ISO 8601 format.
range: Literal

based near
term status: testing
type: Thing
sub property of: topObjectProperty
property disjoint with: bottomObjectProperty
type: ObjectProperty
type: Property
comment: A location that something is based near, for some broadly human notion of near.
domain: SpatialThing
range: SpatialThing

primary topic
type: FunctionalProperty
sub property of: topic
term status: stable
type: ObjectProperty
type: Thing
inverse of: is primary topic of
sub property of: topObjectProperty
property disjoint with: bottomObjectProperty
domain: Document
range: Thing
type: Property
comment: The primary topic of some page or document.

is location of
sub property of: topObjectProperty
property disjoint with: bottomObjectProperty
property disjoint with: is topic of
inverse of: located on
type: ObjectProperty
range: awww representation
domain: web server
comment: A relation between a WebServer and a WebRepresentation. It indicates that a WebServer concretely can respond to an HTTP request with a particular Web Representation.

account service homepage
term status: testing
type: Thing
sub property of: topObjectProperty
property disjoint with: bottomObjectProperty
type: ObjectProperty
type: Property
comment: Indicates a homepage of the service provide for this online account.
domain: Online Account
range: Document

title
property disjoint with: num items
property disjoint with: last name
property disjoint with: last item date
property disjoint with: bottomDataProperty
sub property of: topDataProperty
type: DatatypeProperty
property disjoint with: num threads
property disjoint with: first name
property disjoint with: email sha1
type: DeprecatedProperty
comment: This is the title (subject line) of the Post. Note that for a Post within a threaded discussion that has no parents, it would detail the topic thread.
domain: Post
range: Literal
version info: This property is deprecated. Use dcterms:title from the Dublin Core ontology instead.

Has community sign
sub property of: topObjectProperty
sub property of: Is related to
property disjoint with: bottomObjectProperty
type: ObjectProperty
comment: Corresponds to uses of collectively approved labels shared inside a community.
label: A pour signe collectif @fr
comment: Corresponde al uso de etiquetas elegidas por una comunidad. @es
type: Property
comment: Komt overeen met collectief afgestemd gebruik van door een gemeenschap gekozen labels. @nl
comment: Corrisponde all'uso di tag scelte da una comunità. @it
label: Ha segno collettivo @it
label: Heeft een gemeenschappelijk teken @nl
label: Tiene signo colectivo @es
comment: Correspond à des usages collectivement constitués de libellés choisis par une communauté. @fr

has discussion
property disjoint with: usergroup of
property disjoint with: avatar
property disjoint with: has subscriber
property disjoint with: container of
property disjoint with: administrator of
property disjoint with: follows
property disjoint with: has usergroup
property disjoint with: account of
property disjoint with: has host
property disjoint with: has member
property disjoint with: owner of
type: ObjectProperty
property disjoint with: modifier of
property disjoint with: bottomObjectProperty
property disjoint with: has scope
property disjoint with: creator of
property disjoint with: has administrator
property disjoint with: subscriber of
property disjoint with: space of
property disjoint with: host of
property disjoint with: function of
property disjoint with: email
sub property of: topObjectProperty
property disjoint with: moderator of
property disjoint with: has parent
property disjoint with: member of
property disjoint with: has moderator
property disjoint with: parent of
comment: The discussion that is related to this Item.
domain: Item

page
term status: testing
type: Thing
sub property of: topObjectProperty
property disjoint with: bottomObjectProperty
inverse of: topic
type: ObjectProperty
type: Property
comment: A page or document about this thing.
domain: Thing
range: Document

web server
disjoint with: Nothing
subclass of: Tagged resource
subclass of: resource
subclass of: http://lodlaundromat.org/.well-known/genid/samples/pellet///class//0b7a6cec83cd7a6ef81ffd016aefb0e4/f32d8dc45613bef895570d2297255a7b#10
subclass of: http://lodlaundromat.org/.well-known/genid/samples/pellet///class//0b7a6cec83cd7a6ef81ffd016aefb0e4/7c71b10046805dc486cf71431721ea93#10
subclass of: Thing
type: Class
subclass of: http://lodlaundromat.org/.well-known/genid/samples/pellet///class//0b7a6cec83cd7a6ef81ffd016aefb0e4/f32d8dc45613bef895570d2297255a7b#6
subclass of: http://lodlaundromat.org/.well-known/genid/samples/pellet///class//0b7a6cec83cd7a6ef81ffd016aefb0e4/7c71b10046805dc486cf71431721ea93#6

created at
property disjoint with: first name
property disjoint with: bottomDataProperty
property disjoint with: last name
property disjoint with: last item date
sub property of: topDataProperty
property disjoint with: num threads
property disjoint with: num items
property disjoint with: email sha1
type: DatatypeProperty
type: DeprecatedProperty
comment: When this was created, in ISO 8601 format.
domain: Post
range: Literal
version info: This property is deprecated. Use dcterms:created from the Dublin Core ontology instead.

Auto tag action
disjoint with: Space
subclass of: Tag action
disjoint with: User
disjoint with: Container
disjoint with: Role
disjoint with: Nothing
type: Class
subclass of: Graph
subclass of: Item
disjoint with: Community
disjoint with: Usergroup
disjoint with: Site
disjoint with: User Account
disjoint with: Thread
subclass of: Thing
disjoint with: Forum
label: Azione di tagging automatica @it
comment: Descrive delle tag generate e/o associate automaticamente a una risorsa da un computer. @it
label: Acte de taguer automatique @fr
comment: Décrit des tags générés et/ou associés automatiquement à une ressource par une machine. @fr
label: Geautomatiseerde taghandeling @nl
comment: Describe etiquetas generadas y/o asociadas manualmente a un recurso por un ordenador. @es
comment: Describes tags as automatically generated and/or associated to a resource by a computer.
label: Acción de etiquetado automática @es
comment: Beschrijft tags als zijnde gegenereerd en/of automatisch met een bron geasoccieerd, door een computerprogramma. @nl

space of
property disjoint with: member of
property disjoint with: has reply
property disjoint with: reference
property disjoint with: attachment
property disjoint with: sibling
property disjoint with: next by date
property disjoint with: owner of
property disjoint with: modifier of
property disjoint with: has scope
property disjoint with: avatar
property disjoint with: reply of
property disjoint with: later version
property disjoint with: creator of
inverse of: has space
property disjoint with: subscriber of
property disjoint with: has discussion
property disjoint with: function of
property disjoint with: next version
property disjoint with: previous by date
property disjoint with: earlier version
property disjoint with: email
property disjoint with: usergroup of
property disjoint with: previous version
property disjoint with: embeds knowledge
property disjoint with: moderator of
property disjoint with: addressed to
type: ObjectProperty
property disjoint with: administrator of
property disjoint with: account of
property disjoint with: follows
property disjoint with: bottomObjectProperty
property disjoint with: about
property disjoint with: has modifier
sub property of: topObjectProperty
property disjoint with: Belongs to tag collection
property disjoint with: has container
property disjoint with: latest version
property disjoint with: has member
comment: A resource which belongs to this data Space.
domain: Space

Annotated resource
disjoint with: conceptual resource
disjoint with: abstract resource
subclass of: http://lodlaundromat.org/.well-known/genid/samples/pellet///class//0b7a6cec83cd7a6ef81ffd016aefb0e4/f32d8dc45613bef895570d2297255a7b#10
subclass of: Thing
equivalent class: awww representation
subclass of: resource
disjoint with: InformationObject
subclass of: Tagged resource
subclass of: InformationRealization
subclass of: http://lodlaundromat.org/.well-known/genid/samples/pellet///class//0b7a6cec83cd7a6ef81ffd016aefb0e4/7c71b10046805dc486cf71431721ea93#10
subclass of: physical resource
subclass of: non-information resources
type: Class
disjoint with: web resource
disjoint with: Nothing
subclass of: awww representation
disjoint with: information resource
comment: Usato per rappresentare la realizzazione di una risorsa informazionale accessibile sul Web mediante il protocollo HTTP. La risorsa annotata è quella che generalmente provaoca l'azione di tagging. Essendo per definizione dereferenziabile, fornisce anche l'indirizzo che sarà salvato su sistemi di bookmarking come delicious, e che avrà funzione di ancoraggio per le tag. In ogni caso, la risorsa taggata non è limitata a dati accessibili sul Web (ciò che è taggato può anche essere ciò che la rappresentazione Web di una risorsa rappresenta, per esempio una risorsa non-informazionale, piuttosto che la sua rappresentazione) @it
comment: Utilisé pour représenter la réalisation d'une ressource informationnelle accessible sur le Web via le protocole HTTP. La ressource annotée, consultable en ligne, est celle-là même qui déclenche généralement l'acte de taguer. En quoi d'ailleurs elle est l'équivalent de la classe irw:WebRepresentation. Etant par définition déréférençable, elle fournit également l'adresse qui servira d'ancrage aux tags par l'intermédiaire du signet, selon le modèle proposé par delicious. Par contraste, la ressource taguée n'est, quant à elle, aucunement limitée à des données accessibles sur le Web (ce qui est taguée peut bien se révéler ne pas être autre chose que ce que la représentation d'un ressource représente, une ressource non-informationnelle par exemple, plutôt que cette représentation elle-même). @fr
comment: Usado para representar la realización de un recurso informacional accesible en la Web mediante el protocolo HTTP. El recurso anotado es aquel que generalmente provoca la acción de etiquetado. Siendo por definición dereferenciable, dota tambien de la dirección que quedarà guardada en sistemas de "bookmarking" como delicious, y que tendrà una función de anclaje para las etiqueta. De todas maneras, el recurso etiquetado no se limita a los datos accesibles en la Web (aquello que es etiquetado puede ser también lo que la representación Web de un recurso representa, por ejemplo un recurso no-informacional, en lugar de su representación) @es
label: Bron met aantekeningen @nl
label: Ressource annotée @fr
comment: Wordt gebruikt om een via het HTTP protocol op het web toegankelijke informatiebron te representeren. De bron met annototies, online beschikbaar en gelijkwaardig aan een irw:WebRepresentation, is wat aanzet tot de taghandeling. Aangezien de bron via het web toegankelijk is, is het per definitie mogelijk om ernaar te verwijzen, dus de bron levert ook het adres dat gebookmarkt kan worden en als anker voor de tags dient. Echter, de bron die getagd wordt is op geen enkele wijze beperkt tot http-toegankelijke data (wat getagd wordt is hetgen waar de web-representatie voor staat, bijvoorbeeld een non-informatie bron, en niet de representatie zelf). @nl
comment: Used to represent the HTTP-accessible realization of an information resource on the Web. The equivalent of irw:WebRepresentation, the Annotated Resource is that which generally triggers the act of tagging. Being dereferenceable by definition, it also provides the address that will be bookmarked on delicious-like sites and work like an anchor for tags. This said, the resource being tagged is in no way limited to HTTP-accessible data (indeed, what supports an act of tagging may very well be what the Web representation represents, a non-information resource for example, instead of the Web representation itself).
label: Recurso anotado @es
label: Risorsa annotata @it

Friend of a Friend (FOAF) vocabulary
description: The Friend of a Friend (FOAF) RDF vocabulary, described using W3C RDF Schema and the Web Ontology Language.
type: Thing
type: Ontology

Sent by
property disjoint with: usergroup of
property disjoint with: administrator of
property disjoint with: has function
property disjoint with: latest version
property disjoint with: sibling
property disjoint with: previous version
property disjoint with: member of
property disjoint with: has container
property disjoint with: reply of
property disjoint with: parent of
property disjoint with: has host
property disjoint with: bottomObjectProperty
type: ObjectProperty
property disjoint with: host of
property disjoint with: previous by date
property disjoint with: modifier of
property disjoint with: next version
property disjoint with: moderator of
property disjoint with: has parent
property disjoint with: next by date
property disjoint with: scope of
property disjoint with: has usergroup
property disjoint with: has reply
property disjoint with: subscriber of
sub property of: topObjectProperty
property disjoint with: container of
property disjoint with: has space
sub property of: Is related to
property disjoint with: earlier version
property disjoint with: later version
comment: Komt overeen met het gebruik van labels die aangeven door wie deze bron is voorgesteld. @nl
comment: Corrisponde all'uso di tagche indicano da chi è stata suggerita una risorsa. @it
type: Property
domain: WebRepresentation
comment: Correspond à l'utilisation de signes qui indiquent à qui une ressource a été suggérée. @fr
range: User Account
label: Enviado por @es
comment: Corresponds to uses of labels that indicate by whom a resource was suggested.
label: Inviato da @it
label: Envoyé par @fr
label: Verstuurd door @nl
comment: Corresponde al uso de etiquetas que indican por quien ha sido sugerido un recurso. @es

Share
disjoint with: Space
disjoint with: Nothing
disjoint with: User
disjoint with: Forum
disjoint with: Community
subclass of: Graph
disjoint with: Role
disjoint with: Thread
disjoint with: Container
subclass of: Item
subclass of: Tag action
type: Class
subclass of: Thing
disjoint with: User Account
disjoint with: Site
disjoint with: Usergroup
comment: Describe la acción que se realiza con una etiqueta cuando es usada para compartir la representación de un recurso en un servicio Web, por ejemplo Delicious o Twitter, con el titular de una cuenta en este servicio (sioc:UserAccount, que no es necesariamente una foaf:Person, porqué puede ser también un robot o una institución cuyos representantes pueden variar en el tiempo. @es
label: Condividere @it
comment: Describes the action that is performed with a tag whenever it is used to share the representation of a WebResource on various services - Twitter or Delicious for instance - with the owner of a sioc:UserAccount (not necessarily a foaf:Person as it might be either a bot, a person or an institution whose representatives may well vary over time).
label: Compartir @es
comment: Descrive l'azione che si compie con una tag quando questa è usata per condividere la rappresentazizone di una risorsa su uno specifico servizio Web, per esempio Delicious o Twitter, con il titolare di un account su tale servizio (sioc:UserAccount, che non è necessariamente una foaf:Person, ma può trattarsi anche di un robot, o di una istituzione i cui rappresentanti possono variare nel tempo). @it
label: Partager @fr
comment: Beschrijft de handeling die verricht wordt met een tag wanneer deze gebruikt wordt om de representatie van een bron op het web te delen met een gebruiker van een dienst als Twitter of Delicious. (sioc:UserAccount, wat niet per se een foaf:Person is aangezien het ook om een bot kan gaan of een instelling die met het verlopen van de tijd door verschillende personen vertegenwoordigd kan worden). @nl
label: Delen @nl
comment: Décrit l'action que l'on accomplit avec un tag dès lors que celui-ci est utilisé pour partager une représentation d'une ressource sur le Web, notamment sur Delicious ou Twitter. Ce partage ne se fait pas nécessairement avec une autre personne mais plutôt avec le titulaire d'un compte sur l'un ou l'autre de ces services (sioc:UserAccount, qui n'est pas nécessairement une foaf:Person étant donné qu'il peut s'agir aussi bien d'un robot, d'une personne ou encore d'une institution dont les représentants sont potentiellement amenés à varier au fil du temps). @fr

is topic of
sub property of: topObjectProperty
property disjoint with: encodes
property disjoint with: is location of
property disjoint with: bottomObjectProperty
inverse of: is about
type: ObjectProperty
domain: resource
range: information resource

Machine tag action
disjoint with: Role
disjoint with: Community
disjoint with: Usergroup
subclass of: Tag action
disjoint with: User
subclass of: Graph
disjoint with: Thread
type: Thing
disjoint with: Space
disjoint with: Container
subclass of: Syntactic Tag Action
subclass of: Thing
disjoint with: Forum
disjoint with: Site
disjoint with: User Account
disjoint with: Nothing
subclass of: Item
type: Class
label: Acte de taguer avec machine tag @fr
comment: Décrit des tags dont les libellés mobilisent la syntaxe des machine tags telle qu'implémentée d'abord sur le site Flickr.com. @fr
comment: Describes tags whose labels are using the syntax of machine tags as implemented first in Flickr.com.
comment: Describe etiquetas cuyo texto sigue la sintaxis de las machine tag como implementada en Flickr.com. @es
label: Azione di tagging con machine tag @it
comment: Beschrijft tags waarvan de labels gebruik maken van de machine-tag syntaxis, zoals voor het eerst geimplementeerd op flickr.com. @nl
comment: Descrive delle tag il cui testo segue la sintassi delle machine tag come implementata su Flickr.com. @it
label: Taghandeling met machinetag @nl
label: Acción de etiquetado con machine tag @es

Is worth
sub property of: topObjectProperty
sub property of: Is related to
property disjoint with: bottomObjectProperty
type: ObjectProperty
type: Property
comment: Property used whenever a resource is evaluated, ranked, etc. thanks to a label ("***", "5/10", "0", "best", etc.).
label: Ha valore @it
comment: Propriedad usada para indicar que un recurso es evaluado, clasificado, etc., por medio del contenido de una etiqueta ("***", "5/10", "0", "best", etc.). @es
comment: Proprietà usata per indicare che una risorsa è valutata, classificata, ecc. per mezzo del contenuto di una tag ("***", "5/10", "0", "best", etc.). @it
comment: Propriété utilisée pour indiquer qu'une ressource est évaluée, classée, etc. à l'aide d'un libellé ("***", "5/10", "0", "le meilleur", etc.). @fr
label: Is waaard @nl
comment: Eigenschap die gebruikt wordt op het moment dat een een bron wordt gewaardeerd, geklassificeerd met een label ("***", "5/10", "0", "het beste", etc.). @nl
label: Tiene valor @es
label: Vaut @fr

topic_interest
term status: testing
type: Thing
sub property of: topObjectProperty
property disjoint with: bottomObjectProperty
type: ObjectProperty
type: Property
comment: A thing of interest to this person.
domain: Agent
range: Thing

group of
sub property of: topObjectProperty
property disjoint with: bottomObjectProperty
inverse of: has group
type: ObjectProperty
type: DeprecatedProperty
version info: This property has been renamed. Use sioc:usergroup_of instead.

has URI string value
property disjoint with: num items
property disjoint with: num threads
property disjoint with: num authors
sub property of: topDataProperty
type: DatatypeProperty
type: FunctionalProperty
property disjoint with: num views
property disjoint with: num replies
property disjoint with: bottomDataProperty
comment: The value of the URI, a string compliant with the URI specification.
range: anyURI
domain: uri
comment: The name of this datatype property previously was "hasURI", but in this ontology a URI is modelled as a class, hence I though that it's better to clarify, even in the property name that it refers to the string value of a URI.

subscriber of
property disjoint with: next by date
property disjoint with: Sent by
property disjoint with: previous by date
property disjoint with: modifier of
property disjoint with: attachment
property disjoint with: host of
property disjoint with: space of
property disjoint with: scope of
property disjoint with: Belongs to tag collection
property disjoint with: has administrator
property disjoint with: parent of
type: ObjectProperty
property disjoint with: has modifier
property disjoint with: has creator
property disjoint with: has discussion
property disjoint with: latest version
property disjoint with: earlier version
property disjoint with: has container
property disjoint with: reply of
property disjoint with: later version
property disjoint with: sibling
property disjoint with: has owner
property disjoint with: bottomObjectProperty
sub property of: topObjectProperty
property disjoint with: follows
property disjoint with: Sent to
property disjoint with: previous version
property disjoint with: embeds knowledge
property disjoint with: has scope
property disjoint with: addressed to
property disjoint with: function of
property disjoint with: about
property disjoint with: next version
property disjoint with: reference
property disjoint with: has parent
property disjoint with: usergroup of
property disjoint with: account
property disjoint with: has subscriber
property disjoint with: has reply
property disjoint with: has host
inverse of: has subscriber
property disjoint with: has usergroup
property disjoint with: has moderator
property disjoint with: has member
property disjoint with: container of
property disjoint with: has function
property disjoint with: member of
comment: A Container that a UserAccount is subscribed to.
domain: User Account
range: Container

num items
property disjoint with: last name
type: DatatypeProperty
property disjoint with: ip address
property disjoint with: content
property disjoint with: email sha1
property disjoint with: created at
property disjoint with: bottomDataProperty
property disjoint with: description
property disjoint with: has URI string value
property disjoint with: first name
property disjoint with: title
property disjoint with: content encoded
property disjoint with: modified at
sub property of: topDataProperty
property disjoint with: subject
comment: The number of Posts (or Items) in a Forum (or a Container).
domain: Container
range: nonNegativeInteger

firstName
term status: testing
type: Thing
sub property of: topDataProperty
property disjoint with: bottomDataProperty
type: DatatypeProperty
type: Property
comment: The first name of a person.
domain: Person
range: Literal

account
term status: archaic
type: Thing
sub property of: topObjectProperty
property disjoint with: bottomObjectProperty
type: ObjectProperty
type: Property
comment: Indicates an account held by this agent.
domain: Agent
range: Online Account

previous by date
property disjoint with: has host
property disjoint with: member of
property disjoint with: usergroup of
property disjoint with: function of
property disjoint with: scope of
property disjoint with: has owner
property disjoint with: owner of
property disjoint with: has moderator
property disjoint with: container of
property disjoint with: avatar
property disjoint with: creator of
property disjoint with: has subscriber
sub property of: topObjectProperty
property disjoint with: subscriber of
property disjoint with: has administrator
property disjoint with: has function
inverse of: next by date
property disjoint with: bottomObjectProperty
property disjoint with: email
property disjoint with: parent of
property disjoint with: space of
property disjoint with: moderator of
property disjoint with: follows
property disjoint with: has scope
property disjoint with: has member
type: ObjectProperty
property disjoint with: Sent to
property disjoint with: Sent by
property disjoint with: has container
property disjoint with: has space
property disjoint with: account
property disjoint with: has parent
property disjoint with: has modifier
property disjoint with: modifier of
property disjoint with: account of
property disjoint with: has creator
property disjoint with: administrator of
property disjoint with: has usergroup
property disjoint with: host of
comment: Previous Item or Post in a given Container sorted by date.
domain: Item
range: Item

moderator of
property disjoint with: container of
property disjoint with: modifier of
property disjoint with: has discussion
property disjoint with: Sent by
property disjoint with: account
property disjoint with: addressed to
property disjoint with: parent of
property disjoint with: about
property disjoint with: latest version
property disjoint with: Belongs to tag collection
property disjoint with: next by date
property disjoint with: has parent
property disjoint with: has container
property disjoint with: attachment
property disjoint with: has creator
property disjoint with: follows
property disjoint with: has member
property disjoint with: has modifier
property disjoint with: has function
property disjoint with: embeds knowledge
property disjoint with: has reply
property disjoint with: has administrator
property disjoint with: reference
property disjoint with: space of
property disjoint with: previous by date
type: ObjectProperty
property disjoint with: member of
property disjoint with: has scope
property disjoint with: scope of
property disjoint with: later version
property disjoint with: earlier version
property disjoint with: reply of
property disjoint with: has subscriber
property disjoint with: host of
inverse of: has moderator
property disjoint with: has moderator
property disjoint with: previous version
property disjoint with: next version
property disjoint with: sibling
sub property of: topObjectProperty
property disjoint with: has owner
property disjoint with: usergroup of
property disjoint with: has host
property disjoint with: function of
property disjoint with: bottomObjectProperty
property disjoint with: has usergroup
property disjoint with: Sent to
comment: A Forum that a UserAccount is a moderator of.
domain: User Account
range: Forum

identifies
sub property of: topObjectProperty
property disjoint with: bottomObjectProperty
inverse of: is identified by
type: FunctionalProperty
type: ObjectProperty
domain: uri
range: Thing
range: resource
comment: The relashionship between a URI and a resource. A URI identify only one resource, it acts as a "virtual" delegate for that resource on the Web. This is different from the refersTo relashionships. This latter holds between Resources, and it's not functional. For example, http://www.example.com#me identifies only john, while john's homepage http://www.example.com/john.html refersTo me, the place where he works, his job, his personal interests, etc. If I want to describe John's characteristics e.g. his name, age, etc. on the Web, I will attach them to http://www.example.com#john. On the other hand, http://www.example.com/john.html identifies john's homepage, which is an information resource.

last item date
property disjoint with: content encoded
property disjoint with: email sha1
property disjoint with: subject
property disjoint with: title
property disjoint with: ip address
property disjoint with: last name
type: DatatypeProperty
property disjoint with: description
property disjoint with: first name
property disjoint with: bottomDataProperty
sub property of: date
sub property of: topDataProperty
property disjoint with: created at
property disjoint with: modified at
property disjoint with: content
comment: The date and time of the last Post (or Item) in a Forum (or a Container), in ISO 8601 format.
domain: Container
range: Literal

has usergroup
property disjoint with: later version
property disjoint with: about
property disjoint with: usergroup of
property disjoint with: has space
property disjoint with: account
property disjoint with: has parent
property disjoint with: member of
sub property of: topObjectProperty
property disjoint with: account of
property disjoint with: owner of
property disjoint with: scope of
property disjoint with: bottomObjectProperty
property disjoint with: container of
property disjoint with: has owner
property disjoint with: reference
type: ObjectProperty
property disjoint with: has moderator
property disjoint with: previous by date
property disjoint with: subscriber of
property disjoint with: reply of
property disjoint with: earlier version
property disjoint with: has creator
property disjoint with: embeds knowledge
property disjoint with: has member
property disjoint with: has container
property disjoint with: addressed to
property disjoint with: Sent by
property disjoint with: email
property disjoint with: parent of
property disjoint with: has function
property disjoint with: previous version
property disjoint with: has discussion
property disjoint with: has subscriber
property disjoint with: has administrator
property disjoint with: function of
inverse of: usergroup of
property disjoint with: moderator of
property disjoint with: has reply
property disjoint with: has host
property disjoint with: creator of
property disjoint with: attachment
property disjoint with: modifier of
property disjoint with: host of
property disjoint with: avatar
property disjoint with: Sent to
property disjoint with: has modifier
property disjoint with: next by date
property disjoint with: latest version
property disjoint with: sibling
property disjoint with: has scope
property disjoint with: administrator of
property disjoint with: next version
property disjoint with: Belongs to tag collection
property disjoint with: follows
comment: Points to a Usergroup that has certain access to this Space.
domain: Space
range: Usergroup

container of
property disjoint with: has modifier
property disjoint with: reply of
property disjoint with: modifier of
property disjoint with: addressed to
property disjoint with: has space
property disjoint with: bottomObjectProperty
property disjoint with: has parent
property disjoint with: has function
property disjoint with: has discussion
property disjoint with: previous version
property disjoint with: embeds knowledge
property disjoint with: moderator of
property disjoint with: member of
property disjoint with: later version
property disjoint with: reference
property disjoint with: email
property disjoint with: attachment
property disjoint with: account
property disjoint with: owner of
property disjoint with: avatar
property disjoint with: has usergroup
property disjoint with: scope of
property disjoint with: next version
property disjoint with: parent of
property disjoint with: administrator of
property disjoint with: has moderator
property disjoint with: subscriber of
property disjoint with: has subscriber
property disjoint with: next by date
type: ObjectProperty
property disjoint with: has owner
property disjoint with: earlier version
property disjoint with: account of
property disjoint with: has host
property disjoint with: about
sub property of: topObjectProperty
property disjoint with: previous by date
property disjoint with: Sent to
property disjoint with: Sent by
property disjoint with: follows
property disjoint with: has reply
property disjoint with: has administrator
property disjoint with: has container
property disjoint with: has member
property disjoint with: sibling
property disjoint with: function of
property disjoint with: creator of
property disjoint with: Belongs to tag collection
property disjoint with: latest version
property disjoint with: has creator
property disjoint with: usergroup of
inverse of: has container
property disjoint with: host of
property disjoint with: has scope
comment: An Item that this Container contains.
domain: Container
range: Item

Given name
term status: archaic
type: Thing
sub property of: topDataProperty
property disjoint with: bottomDataProperty
type: DatatypeProperty
type: Property
comment: The given name of some person.

has creator
property disjoint with: has function
property disjoint with: reply of
property disjoint with: bottomObjectProperty
property disjoint with: previous version
property disjoint with: host of
inverse of: creator of
property disjoint with: previous by date
property disjoint with: has space
property disjoint with: subscriber of
property disjoint with: has host
property disjoint with: usergroup of
property disjoint with: has parent
type: ObjectProperty
property disjoint with: scope of
property disjoint with: earlier version
property disjoint with: has container
property disjoint with: next version
property disjoint with: modifier of
property disjoint with: next by date
property disjoint with: container of
property disjoint with: parent of
property disjoint with: member of
property disjoint with: latest version
property disjoint with: has reply
property disjoint with: later version
sub property of: topObjectProperty
property disjoint with: moderator of
property disjoint with: has usergroup
property disjoint with: sibling
property disjoint with: administrator of
comment: This is the UserAccount that made this resource.
range: User Account

ip address
type: DatatypeProperty
property disjoint with: bottomDataProperty
property disjoint with: email sha1
sub property of: topDataProperty
property disjoint with: first name
property disjoint with: num threads
property disjoint with: num items
property disjoint with: last name
property disjoint with: last item date
comment: The IP address used when creating this Item. This can be associated with a creator. Some wiki articles list the IP addresses for the creator or modifiers when the usernames are absent.
domain: Item
range: Literal

tipjar
term status: testing
type: Thing
sub property of: topObjectProperty
sub property of: page
property disjoint with: bottomObjectProperty
type: ObjectProperty
type: Property
comment: A tipjar document for this agent, describing means for payment and reward.
domain: Agent
range: Document

familyName
term status: testing
type: Thing
sub property of: topDataProperty
property disjoint with: bottomDataProperty
type: DatatypeProperty
type: Property
comment: The family name of some person.
domain: Person
range: Literal

past project
term status: testing
type: Thing
sub property of: topObjectProperty
property disjoint with: bottomObjectProperty
type: ObjectProperty
type: Property
comment: A project this person has previously worked on.
domain: Person
range: Thing

encodes
sub property of: topObjectProperty
property disjoint with: bottomObjectProperty
property disjoint with: is topic of
inverse of: encoded in
type: ObjectProperty
range: awww representation
domain: media type

http://lodlaundromat.org/.well-known/genid/samples/pellet///class//0b7a6cec83cd7a6ef81ffd016aefb0e4/7c71b10046805dc486cf71431721ea93#1
type: Restriction
min cardinality: 1
on property: redirects to

SIOC Core Ontology Specification

http://lodlaundromat.org/.well-known/genid/samples/pellet///class//0b7a6cec83cd7a6ef81ffd016aefb0e4/f32d8dc45613bef895570d2297255a7b#7
type: Restriction
on property: is identified by
min cardinality: 1

http://lodlaundromat.org/.well-known/genid/samples/pellet///class//0b7a6cec83cd7a6ef81ffd016aefb0e4/7c71b10046805dc486cf71431721ea93#4
type: Restriction
on property: encoded in
cardinality: 1

http://lodlaundromat.org/.well-known/genid/samples/pellet///class//0b7a6cec83cd7a6ef81ffd016aefb0e4/f32d8dc45613bef895570d2297255a7b#2
type: Restriction
cardinality: 1
on property: has URI string value

http://lodlaundromat.org/.well-known/genid/samples/pellet///class//0b7a6cec83cd7a6ef81ffd016aefb0e4/7c71b10046805dc486cf71431721ea93#7
type: Restriction
on property: is identified by
min cardinality: 1

http://lodlaundromat.org/.well-known/genid/samples/pellet///class//0b7a6cec83cd7a6ef81ffd016aefb0e4/7c71b10046805dc486cf71431721ea93#2
type: Restriction
cardinality: 1
on property: has URI string value

http://lodlaundromat.org/.well-known/genid/samples/pellet///class//0b7a6cec83cd7a6ef81ffd016aefb0e4/f32d8dc45613bef895570d2297255a7b#8
type: Restriction
min cardinality: 1
on property: isRealizedBy

The Identity of Resources on the Web ontology (IRW).
type: Ontology
imports: informationrealization.owl
version info: Created by Valentina Presutti with support from Harry Halpin and Aldo Gangemi
comment: This ontology is an evolution of IRE ontology. It describes identification of resources on the Web, through the definition of relationships between resources and their representations on the Web. The requirement is to describe what can be identified by URIs and how this is handled e.g. in form of HTTP requests and reponds.

http://lodlaundromat.org/.well-known/genid/samples/pellet///class//0b7a6cec83cd7a6ef81ffd016aefb0e4/f32d8dc45613bef895570d2297255a7b#3
type: Restriction
min cardinality: 1
on property: identifies

http://lodlaundromat.org/.well-known/genid/samples/pellet///class//0b7a6cec83cd7a6ef81ffd016aefb0e4/7c71b10046805dc486cf71431721ea93#8
type: Restriction
min cardinality: 1
on property: isRealizedBy

http://lodlaundromat.org/.well-known/genid/samples/pellet///class//0b7a6cec83cd7a6ef81ffd016aefb0e4/f32d8dc45613bef895570d2297255a7b#6
type: Restriction
min cardinality: 1
on property: is resolution of

http://lodlaundromat.org/.well-known/genid/samples/pellet///class//0b7a6cec83cd7a6ef81ffd016aefb0e4/7c71b10046805dc486cf71431721ea93#3
type: Restriction
min cardinality: 1
on property: identifies

http://lodlaundromat.org/.well-known/genid/samples/pellet///class//0b7a6cec83cd7a6ef81ffd016aefb0e4/f32d8dc45613bef895570d2297255a7b#1
type: Restriction
min cardinality: 1
on property: redirects to

http://lodlaundromat.org/.well-known/genid/samples/pellet///class//0b7a6cec83cd7a6ef81ffd016aefb0e4/7c71b10046805dc486cf71431721ea93#6
type: Restriction
min cardinality: 1
on property: is resolution of

http://lodlaundromat.org/.well-known/genid/samples/pellet///class//0b7a6cec83cd7a6ef81ffd016aefb0e4/f32d8dc45613bef895570d2297255a7b#4
type: Restriction
on property: encoded in
cardinality: 1