http://lodlaundromat.org/.well-known/genid/samples/jena///class//0b7a6cec83cd7a6ef81ffd016aefb0e4/f32d8dc45613bef895570d2297255a7b#8
subclass of: Resource
type: Class
subclass of: Thing
type: Restriction
min cardinality: 1
on property: isRealizedBy
subclass of: http://lodlaundromat.org/.well-known/genid/samples/jena///class//0b7a6cec83cd7a6ef81ffd016aefb0e4/7c71b10046805dc486cf71431721ea93#8
equivalent class: http://lodlaundromat.org/.well-known/genid/samples/jena///class//0b7a6cec83cd7a6ef81ffd016aefb0e4/7c71b10046805dc486cf71431721ea93#8

has function
range: Thing
domain: Thing
type: ObjectProperty
inverse of: function of
comment: A Role that this UserAccount has.
range: Role
type: Property
range: Resource
domain: Resource

Visitor tag action
subclass of: Tag action
subclass of: Resource
type: Class
subclass of: Thing
label: Acción de etiquetado de un visitante @es
comment: Usado para describir una acción de etiquetado realizada por una persona que ha tenido acceso a la representación de un recurso en la Web. @es
comment: Utilisé pour décrire l'acte de taguer accompli par une personne ayant eu accès à la représentation d'une ressource sur le Web. @fr
disjoint with: Owner tag action
label: Azione di tagging di un visitatore @it
comment: Beschrijft een taghandeling verricht door een bezoeker van de web-representatie van een bron. @nl
comment: Used to describe an act of tagging performed by a the person who browsed a Web representation.
label: Taghandeling bezoeker @nl
label: Acte de taguer d'un visiteur @fr
comment: Usato per descrivere un'azione di tagging svolta da una persona che ha avuto accesso alla rappresentazione di una risorsa Web. @it
subclass of: Graph
subclass of: Item

N-tuple tag action
subclass of: Resource
type: Class
subclass of: Thing
label: Azione di tagging con una tag n-dimensionale @it
comment: Utilisé pour décrire des actes de taguer impliquant des tags dont les libellés ont n-dimensions (double tags, triple tags, etc.). @fr
comment: Descrive azioni di tagging basate su tag n-dimensionali (doppie tag, triple tag, ecc.). @it
comment: Describes tagging involving N-tuple tags (double tags, triple tags, etc.).
label: Acte de taguer avec un tag à n-dimensions @fr
comment: Describe acciones de etiquetado que incluyan etiquetas n-dimensionales (etiquetas dobles, triples, etc.). @es
comment: Wordt gebruikt om taghandelingen te beschrijven waarbij de labels meerdere (n) dimensies kunnen hebben (dubbele tags, driedubbele tags, etc.). @nl
label: Taghandeling met n-tuple @nl
label: Acción de etiquetado con una etiqueta n-dimensional @es
subclass of: Syntactic Tag Action
subclass of: Tag action
subclass of: Graph
subclass of: Item

is referenced by
range: Thing
domain: Thing
type: ObjectProperty
sub property of: requests
range: uri
inverse of: refers to
comment: The relation between a resource and the information resource that is about it.
domain: resource
type: Property
range: Resource
range: http://lodlaundromat.org/.well-known/genid/samples/jena///class//0b7a6cec83cd7a6ef81ffd016aefb0e4/7c71b10046805dc486cf71431721ea93#10
range: http://lodlaundromat.org/.well-known/genid/samples/jena///class//0b7a6cec83cd7a6ef81ffd016aefb0e4/f32d8dc45613bef895570d2297255a7b#10
range: http://lodlaundromat.org/.well-known/genid/samples/jena///class//0b7a6cec83cd7a6ef81ffd016aefb0e4/f32d8dc45613bef895570d2297255a7b#2
range: http://lodlaundromat.org/.well-known/genid/samples/jena///class//0b7a6cec83cd7a6ef81ffd016aefb0e4/f32d8dc45613bef895570d2297255a7b#3
range: http://lodlaundromat.org/.well-known/genid/samples/jena///class//0b7a6cec83cd7a6ef81ffd016aefb0e4/7c71b10046805dc486cf71431721ea93#2
range: http://lodlaundromat.org/.well-known/genid/samples/jena///class//0b7a6cec83cd7a6ef81ffd016aefb0e4/7c71b10046805dc486cf71431721ea93#3
range: resource
range: Tagged resource
domain: Resource
domain: Tagged resource
domain: http://lodlaundromat.org/.well-known/genid/samples/jena///class//0b7a6cec83cd7a6ef81ffd016aefb0e4/f32d8dc45613bef895570d2297255a7b#10
domain: http://lodlaundromat.org/.well-known/genid/samples/jena///class//0b7a6cec83cd7a6ef81ffd016aefb0e4/7c71b10046805dc486cf71431721ea93#10

has administrator
range: Thing
domain: Thing
type: ObjectProperty
inverse of: administrator of
comment: A UserAccount that is an administrator of this Site.
domain: Site
range: User Account
type: Property
range: Resource
range: Online Account
range: User
domain: Resource
domain: Space

Annotated resource
subclass of: Thing
subclass of: Resource
type: Class
subclass of: awww representation
comment: Usato per rappresentare la realizzazione di una risorsa informazionale accessibile sul Web mediante il protocollo HTTP. La risorsa annotata è quella che generalmente provaoca l'azione di tagging. Essendo per definizione dereferenziabile, fornisce anche l'indirizzo che sarà salvato su sistemi di bookmarking come delicious, e che avrà funzione di ancoraggio per le tag. In ogni caso, la risorsa taggata non è limitata a dati accessibili sul Web (ciò che è taggato può anche essere ciò che la rappresentazione Web di una risorsa rappresenta, per esempio una risorsa non-informazionale, piuttosto che la sua rappresentazione) @it
comment: Utilisé pour représenter la réalisation d'une ressource informationnelle accessible sur le Web via le protocole HTTP. La ressource annotée, consultable en ligne, est celle-là même qui déclenche généralement l'acte de taguer. En quoi d'ailleurs elle est l'équivalent de la classe irw:WebRepresentation. Etant par définition déréférençable, elle fournit également l'adresse qui servira d'ancrage aux tags par l'intermédiaire du signet, selon le modèle proposé par delicious. Par contraste, la ressource taguée n'est, quant à elle, aucunement limitée à des données accessibles sur le Web (ce qui est taguée peut bien se révéler ne pas être autre chose que ce que la représentation d'un ressource représente, une ressource non-informationnelle par exemple, plutôt que cette représentation elle-même). @fr
equivalent class: awww representation
comment: Usado para representar la realización de un recurso informacional accesible en la Web mediante el protocolo HTTP. El recurso anotado es aquel que generalmente provoca la acción de etiquetado. Siendo por definición dereferenciable, dota tambien de la dirección que quedarà guardada en sistemas de "bookmarking" como delicious, y que tendrà una función de anclaje para las etiqueta. De todas maneras, el recurso etiquetado no se limita a los datos accesibles en la Web (aquello que es etiquetado puede ser también lo que la representación Web de un recurso representa, por ejemplo un recurso no-informacional, en lugar de su representación) @es
label: Bron met aantekeningen @nl
label: Ressource annotée @fr
comment: Wordt gebruikt om een via het HTTP protocol op het web toegankelijke informatiebron te representeren. De bron met annototies, online beschikbaar en gelijkwaardig aan een irw:WebRepresentation, is wat aanzet tot de taghandeling. Aangezien de bron via het web toegankelijk is, is het per definitie mogelijk om ernaar te verwijzen, dus de bron levert ook het adres dat gebookmarkt kan worden en als anker voor de tags dient. Echter, de bron die getagd wordt is op geen enkele wijze beperkt tot http-toegankelijke data (wat getagd wordt is hetgen waar de web-representatie voor staat, bijvoorbeeld een non-informatie bron, en niet de representatie zelf). @nl
comment: Used to represent the HTTP-accessible realization of an information resource on the Web. The equivalent of irw:WebRepresentation, the Annotated Resource is that which generally triggers the act of tagging. Being dereferenceable by definition, it also provides the address that will be bookmarked on delicious-like sites and work like an anchor for tags. This said, the resource being tagged is in no way limited to HTTP-accessible data (indeed, what supports an act of tagging may very well be what the Web representation represents, a non-information resource for example, instead of the Web representation itself).
label: Recurso anotado @es
label: Risorsa annotata @it
subclass of: http://lodlaundromat.org/.well-known/genid/samples/jena///class//0b7a6cec83cd7a6ef81ffd016aefb0e4/7c71b10046805dc486cf71431721ea93#4
subclass of: http://lodlaundromat.org/.well-known/genid/samples/jena///class//0b7a6cec83cd7a6ef81ffd016aefb0e4/f32d8dc45613bef895570d2297255a7b#4
subclass of: http://lodlaundromat.org/.well-known/genid/samples/jena///class//0b7a6cec83cd7a6ef81ffd016aefb0e4/f32d8dc45613bef895570d2297255a7b#5
subclass of: http://lodlaundromat.org/.well-known/genid/samples/jena///class//0b7a6cec83cd7a6ef81ffd016aefb0e4/7c71b10046805dc486cf71431721ea93#5
subclass of: http://lodlaundromat.org/.well-known/genid/samples/jena///class//0b7a6cec83cd7a6ef81ffd016aefb0e4/7c71b10046805dc486cf71431721ea93#10
subclass of: Tagged resource
subclass of: resource
subclass of: http://lodlaundromat.org/.well-known/genid/samples/jena///class//0b7a6cec83cd7a6ef81ffd016aefb0e4/f32d8dc45613bef895570d2297255a7b#10
subclass of: non-information resources
subclass of: physical resource
subclass of: InformationRealization

interest
range: Thing
domain: Thing
type: Property
type: ObjectProperty
comment: A page about a topic of interest to this person.
domain: Agent
range: Document
term status: testing
range: Resource
domain: Resource

http://lodlaundromat.org/.well-known/genid/samples/jena///class//0b7a6cec83cd7a6ef81ffd016aefb0e4/f32d8dc45613bef895570d2297255a7b#3
subclass of: Resource
type: Class
subclass of: Thing
type: Restriction
min cardinality: 1
on property: identifies
subclass of: http://lodlaundromat.org/.well-known/genid/samples/jena///class//0b7a6cec83cd7a6ef81ffd016aefb0e4/7c71b10046805dc486cf71431721ea93#3
equivalent class: http://lodlaundromat.org/.well-known/genid/samples/jena///class//0b7a6cec83cd7a6ef81ffd016aefb0e4/7c71b10046805dc486cf71431721ea93#3

work info homepage
range: Thing
domain: Thing
type: Property
type: ObjectProperty
comment: A work info homepage of some person; a page about their work for some organization.
domain: Person
range: Document
term status: testing
range: Resource
domain: Agent
domain: Resource
domain: SpatialThing

is location of
range: Thing
domain: Thing
type: ObjectProperty
inverse of: located on
range: awww representation
domain: web server
comment: A relation between a WebServer and a WebRepresentation. It indicates that a WebServer concretely can respond to an HTTP request with a particular Web Representation.
type: Property
range: http://lodlaundromat.org/.well-known/genid/samples/jena///class//0b7a6cec83cd7a6ef81ffd016aefb0e4/f32d8dc45613bef895570d2297255a7b#5
range: Resource
range: non-information resources
range: Annotated resource
range: http://lodlaundromat.org/.well-known/genid/samples/jena///class//0b7a6cec83cd7a6ef81ffd016aefb0e4/f32d8dc45613bef895570d2297255a7b#4
range: resource
range: http://lodlaundromat.org/.well-known/genid/samples/jena///class//0b7a6cec83cd7a6ef81ffd016aefb0e4/f32d8dc45613bef895570d2297255a7b#10
range: http://lodlaundromat.org/.well-known/genid/samples/jena///class//0b7a6cec83cd7a6ef81ffd016aefb0e4/7c71b10046805dc486cf71431721ea93#4
range: Tagged resource
range: http://lodlaundromat.org/.well-known/genid/samples/jena///class//0b7a6cec83cd7a6ef81ffd016aefb0e4/7c71b10046805dc486cf71431721ea93#10
range: http://lodlaundromat.org/.well-known/genid/samples/jena///class//0b7a6cec83cd7a6ef81ffd016aefb0e4/7c71b10046805dc486cf71431721ea93#5
range: physical resource
range: InformationRealization
domain: http://lodlaundromat.org/.well-known/genid/samples/jena///class//0b7a6cec83cd7a6ef81ffd016aefb0e4/7c71b10046805dc486cf71431721ea93#10
domain: resource
domain: Resource
domain: http://lodlaundromat.org/.well-known/genid/samples/jena///class//0b7a6cec83cd7a6ef81ffd016aefb0e4/f32d8dc45613bef895570d2297255a7b#6
domain: http://lodlaundromat.org/.well-known/genid/samples/jena///class//0b7a6cec83cd7a6ef81ffd016aefb0e4/f32d8dc45613bef895570d2297255a7b#10
domain: http://lodlaundromat.org/.well-known/genid/samples/jena///class//0b7a6cec83cd7a6ef81ffd016aefb0e4/7c71b10046805dc486cf71431721ea93#6
domain: Tagged resource

topic
range: Thing
domain: Thing
type: ObjectProperty
comment: A topic of interest, linking to the appropriate URI, e.g. in the Open Directory Project or of a SKOS category.
sub property of: subject
type: Property
range: Resource
domain: Resource

account service homepage
range: Thing
domain: Thing
type: Property
type: ObjectProperty
comment: Indicates a homepage of the service provide for this online account.
domain: Online Account
range: Document
term status: testing
range: Resource
domain: Resource

requests
range: Thing
domain: Thing
type: ObjectProperty
range: uri
domain: web client
comment: Expresses the notion behind of a request operation of a web client, exempliﬁed by a typical HTTP GET request.
inverse of: is requested by
type: Property
range: http://lodlaundromat.org/.well-known/genid/samples/jena///class//0b7a6cec83cd7a6ef81ffd016aefb0e4/f32d8dc45613bef895570d2297255a7b#10
range: http://lodlaundromat.org/.well-known/genid/samples/jena///class//0b7a6cec83cd7a6ef81ffd016aefb0e4/f32d8dc45613bef895570d2297255a7b#2
range: resource
range: Resource
range: http://lodlaundromat.org/.well-known/genid/samples/jena///class//0b7a6cec83cd7a6ef81ffd016aefb0e4/7c71b10046805dc486cf71431721ea93#2
range: Tagged resource
range: http://lodlaundromat.org/.well-known/genid/samples/jena///class//0b7a6cec83cd7a6ef81ffd016aefb0e4/f32d8dc45613bef895570d2297255a7b#3
range: http://lodlaundromat.org/.well-known/genid/samples/jena///class//0b7a6cec83cd7a6ef81ffd016aefb0e4/7c71b10046805dc486cf71431721ea93#10
range: http://lodlaundromat.org/.well-known/genid/samples/jena///class//0b7a6cec83cd7a6ef81ffd016aefb0e4/7c71b10046805dc486cf71431721ea93#3
domain: http://lodlaundromat.org/.well-known/genid/samples/jena///class//0b7a6cec83cd7a6ef81ffd016aefb0e4/f32d8dc45613bef895570d2297255a7b#10
domain: resource
domain: Resource
domain: Tagged resource
domain: http://lodlaundromat.org/.well-known/genid/samples/jena///class//0b7a6cec83cd7a6ef81ffd016aefb0e4/7c71b10046805dc486cf71431721ea93#10

accesses
range: Thing
domain: Thing
type: TransitiveProperty
domain: uri
comment: A causal connection from a resource to the thing identiﬁed.
range: resource
inverse of: requests
type: ObjectProperty
type: Property
range: Resource
range: http://lodlaundromat.org/.well-known/genid/samples/jena///class//0b7a6cec83cd7a6ef81ffd016aefb0e4/f32d8dc45613bef895570d2297255a7b#10
range: Tagged resource
range: http://lodlaundromat.org/.well-known/genid/samples/jena///class//0b7a6cec83cd7a6ef81ffd016aefb0e4/7c71b10046805dc486cf71431721ea93#10
domain: http://lodlaundromat.org/.well-known/genid/samples/jena///class//0b7a6cec83cd7a6ef81ffd016aefb0e4/f32d8dc45613bef895570d2297255a7b#10
domain: http://lodlaundromat.org/.well-known/genid/samples/jena///class//0b7a6cec83cd7a6ef81ffd016aefb0e4/f32d8dc45613bef895570d2297255a7b#2
domain: resource
domain: Resource
domain: http://lodlaundromat.org/.well-known/genid/samples/jena///class//0b7a6cec83cd7a6ef81ffd016aefb0e4/7c71b10046805dc486cf71431721ea93#2
domain: Tagged resource
domain: http://lodlaundromat.org/.well-known/genid/samples/jena///class//0b7a6cec83cd7a6ef81ffd016aefb0e4/f32d8dc45613bef895570d2297255a7b#3
domain: http://lodlaundromat.org/.well-known/genid/samples/jena///class//0b7a6cec83cd7a6ef81ffd016aefb0e4/7c71b10046805dc486cf71431721ea93#10
domain: http://lodlaundromat.org/.well-known/genid/samples/jena///class//0b7a6cec83cd7a6ef81ffd016aefb0e4/7c71b10046805dc486cf71431721ea93#3

Forum
subclass of: Thing
subclass of: Resource
type: Class
comment: A discussion area on which Posts or entries are made.
subclass of: Container

http://lodlaundromat.org/.well-known/genid/samples/jena///class//0b7a6cec83cd7a6ef81ffd016aefb0e4/7c71b10046805dc486cf71431721ea93#6
type: Class
subclass of: Resource
subclass of: Thing
type: Restriction
min cardinality: 1
on property: is resolution of
subclass of: http://lodlaundromat.org/.well-known/genid/samples/jena///class//0b7a6cec83cd7a6ef81ffd016aefb0e4/f32d8dc45613bef895570d2297255a7b#6
equivalent class: http://lodlaundromat.org/.well-known/genid/samples/jena///class//0b7a6cec83cd7a6ef81ffd016aefb0e4/f32d8dc45613bef895570d2297255a7b#6

Site
subclass of: Thing
subclass of: Resource
type: Class
comment: A Site can be the location of an online community or set of communities, with UserAccounts and Usergroups creating Items in a set of Containers. It can be thought of as a web-accessible data Space.
subclass of: Space

web resource
subclass of: Thing
subclass of: Resource
subclass of: InformationObject
type: Class
comment: InformationResources that have at least one WebRepresentation and at least a URI. For example, a WebResource containing the text of Moby Dick and its WebRepresentation encoded in HTML in English language.
subclass of: http://lodlaundromat.org/.well-known/genid/samples/jena///class//0b7a6cec83cd7a6ef81ffd016aefb0e4/f32d8dc45613bef895570d2297255a7b#9
subclass of: http://lodlaundromat.org/.well-known/genid/samples/jena///class//0b7a6cec83cd7a6ef81ffd016aefb0e4/7c71b10046805dc486cf71431721ea93#9
subclass of: http://lodlaundromat.org/.well-known/genid/samples/jena///class//0b7a6cec83cd7a6ef81ffd016aefb0e4/f32d8dc45613bef895570d2297255a7b#8
subclass of: http://lodlaundromat.org/.well-known/genid/samples/jena///class//0b7a6cec83cd7a6ef81ffd016aefb0e4/7c71b10046805dc486cf71431721ea93#8
subclass of: http://lodlaundromat.org/.well-known/genid/samples/jena///class//0b7a6cec83cd7a6ef81ffd016aefb0e4/f32d8dc45613bef895570d2297255a7b#7
subclass of: information resource
subclass of: http://lodlaundromat.org/.well-known/genid/samples/jena///class//0b7a6cec83cd7a6ef81ffd016aefb0e4/7c71b10046805dc486cf71431721ea93#7
subclass of: resource
subclass of: http://lodlaundromat.org/.well-known/genid/samples/jena///class//0b7a6cec83cd7a6ef81ffd016aefb0e4/7c71b10046805dc486cf71431721ea93#10
subclass of: http://lodlaundromat.org/.well-known/genid/samples/jena///class//0b7a6cec83cd7a6ef81ffd016aefb0e4/f32d8dc45613bef895570d2297255a7b#10
subclass of: Tagged resource

member
range: Thing
domain: Thing
type: Property
type: ObjectProperty
comment: Indicates a member of a Group
domain: Group
range: Agent
term status: stable
range: Resource
domain: Agent
domain: Resource

has modifier
range: Thing
domain: Thing
type: ObjectProperty
inverse of: modifier of
comment: A UserAccount that modified this Item.
domain: Item
range: User Account
type: Property
range: Resource
range: Online Account
range: User
domain: Resource

personal mailbox
domain: Thing
type: Property
type: InverseFunctionalProperty
type: ObjectProperty
comment: A personal mailbox, ie. an Internet mailbox associated with exactly one owner, the first owner of this mailbox. This is a 'static inverse functional property', in that there is (across time and change) at most one individual that ever has any particular value for foaf:mbox.
domain: Agent
range: Thing
term status: stable
range: Resource
domain: Resource

account of
range: Thing
domain: Thing
domain: Online Account
type: ObjectProperty
comment: Refers to the foaf:Agent or foaf:Person who owns this sioc:UserAccount.
domain: User Account
range: Agent
inverse of: account
type: Property
range: Resource
domain: Resource
domain: User

previous by date
range: Thing
domain: Thing
type: ObjectProperty
inverse of: next by date
comment: Previous Item or Post in a given Container sorted by date.
domain: Item
range: Item
type: Property
range: Resource
domain: Resource

Evaluate
subclass of: Resource
type: Class
subclass of: Thing
label: Evaluar @es
comment: Describes the action that is performed with a tag whenever it is used to give a notation, a mark of approval and disapproval, or, more generally speaking, an evaluation.
comment: Beschrijft de handeling die verricht wordt met een tag wanneer deze gebruikt wordt om een klassering, een teken van goedkeuring of afkeuring, of meer algemeen een beoordeling te geven. @nl
comment: Descrive l'azione che si compie con una tag quando questa è usata per esprimere approvazione o disapprovazione, o, più in generale, una valutazione. @it
label: Beoordelen @nl
comment: Décrit l'action que l'on accomplit avec un tag dès lors que celui-ci est utilisé pour donner une note, marquer son approbation ou sa désapprobation ou, plus généralement, produirez une évaluation. @fr
label: Evaluer @fr
comment: Describe la acción que se realiza con una etiqueta cuando es usada para expresar aprobación o desaprobación o, mas en general, una evaluación. @es
subclass of: Tag action
label: Valutare @it
subclass of: Item
subclass of: Graph

weblog
range: Thing
domain: Thing
sub property of: page
type: Property
range: Document
term status: testing
comment: A weblog of some thing (whether person, group, company etc.).
domain: Agent
type: InverseFunctionalProperty
type: ObjectProperty
range: Resource
domain: Resource

Online Account
subclass of: Resource
type: Class
comment: An online account.
subclass of: Thing
term status: testing

reference
range: Thing
domain: Thing
type: DeprecatedProperty
type: ObjectProperty
comment: Links either created explicitly or extracted implicitly on the HTML level from the Post.
domain: Post
version info: Renamed to sioc:links_to.
type: Property
range: Resource
domain: Resource
domain: Document
domain: Item

conceptual resource
subclass of: Resource
type: Class
subclass of: Thing
disjoint with: abstract resource
subclass of: non-information resources
comment: Resources that are created in the social communication process. A conceptual resource does not exist if it's not in a social communication. For example: legal entities, political entities, social relations, concepts, etc.
disjoint with: physical resource
subclass of: http://lodlaundromat.org/.well-known/genid/samples/jena///class//0b7a6cec83cd7a6ef81ffd016aefb0e4/f32d8dc45613bef895570d2297255a7b#5
subclass of: http://lodlaundromat.org/.well-known/genid/samples/jena///class//0b7a6cec83cd7a6ef81ffd016aefb0e4/7c71b10046805dc486cf71431721ea93#5
subclass of: resource
subclass of: http://lodlaundromat.org/.well-known/genid/samples/jena///class//0b7a6cec83cd7a6ef81ffd016aefb0e4/7c71b10046805dc486cf71431721ea93#10
subclass of: http://lodlaundromat.org/.well-known/genid/samples/jena///class//0b7a6cec83cd7a6ef81ffd016aefb0e4/f32d8dc45613bef895570d2297255a7b#10
subclass of: Tagged resource

Assert
subclass of: Resource
type: Class
subclass of: Thing
label: Asserter @fr
comment: Describes the action that is performed with a tag whenever it is used to assert anything about a resource.
comment: Décrit l'action que l'on accomplit avec un tag dès lors que celui-ci est utilisé pour affirmer quoi que ce soit à propos d'une ressource. @fr
label: Asserire @it
subclass of: Tag action
comment: Descrive l'azione che viene svolta con una tag quando questa è utilizzata per affermare qualcosa a proposito di una risorsa. @it
label: Bevestigen @nl
comment: Describe la acción realizada con una tag quando esta es usada para afirmar algo sobre un recurso. @es
comment: Beschrijft de handeling die verricht wordt met een tag wanneer deze gebruikt wordt om iets over een bron te bevestigen. @nl
label: Afirmar @es
subclass of: Graph
subclass of: Item

member of
range: Thing
domain: Thing
type: ObjectProperty
inverse of: has member
comment: A Usergroup that this UserAccount is a member of.
domain: User Account
range: Usergroup
type: Property
range: Resource
domain: Resource
domain: Online Account
domain: User

abstract resource
subclass of: Resource
type: Class
subclass of: Thing
subclass of: non-information resources
disjoint with: conceptual resource
comment: Abstract things. They are combinatorial spaces. They cannot be located in space-time. Examples are: the infinite set of integers, real numbers, formal entities, relations, functions, the infinite set of names that can be defined in namespaces.
disjoint with: physical resource
subclass of: http://lodlaundromat.org/.well-known/genid/samples/jena///class//0b7a6cec83cd7a6ef81ffd016aefb0e4/f32d8dc45613bef895570d2297255a7b#5
subclass of: http://lodlaundromat.org/.well-known/genid/samples/jena///class//0b7a6cec83cd7a6ef81ffd016aefb0e4/7c71b10046805dc486cf71431721ea93#5
subclass of: http://lodlaundromat.org/.well-known/genid/samples/jena///class//0b7a6cec83cd7a6ef81ffd016aefb0e4/f32d8dc45613bef895570d2297255a7b#10
subclass of: http://lodlaundromat.org/.well-known/genid/samples/jena///class//0b7a6cec83cd7a6ef81ffd016aefb0e4/7c71b10046805dc486cf71431721ea93#10
subclass of: resource
subclass of: Tagged resource

link
range: Thing
domain: Thing
type: ObjectProperty
comment: A URI of a document which contains this SIOC object.
type: Property
range: Resource
domain: Resource

Online Chat Account
subclass of: Resource
subclass of: Thing
type: Class
comment: An online chat account.
subclass of: Online Account
term status: unstable

Post
subclass of: Thing
subclass of: Resource
type: Class
comment: An article or message that can be posted to a Forum.
subclass of: Item
subclass of: Document

Community
subclass of: Resource
type: Class
subclass of: Thing
comment: Community is a high-level concept that defines an online community and what it consists of.
disjoint with: Item
disjoint with: Role
disjoint with: User Account

knows
range: Thing
domain: Thing
type: Property
type: ObjectProperty
comment: A person known by this person (indicating some level of reciprocated interaction between the parties).
domain: Person
range: Person
term status: stable
range: Agent
range: Resource
range: SpatialThing
domain: Agent
domain: Resource
domain: SpatialThing

http://lodlaundromat.org/.well-known/genid/samples/jena///class//0b7a6cec83cd7a6ef81ffd016aefb0e4/7c71b10046805dc486cf71431721ea93#1
subclass of: Resource
type: Class
subclass of: Thing
type: Restriction
min cardinality: 1
on property: redirects to
subclass of: http://lodlaundromat.org/.well-known/genid/samples/jena///class//0b7a6cec83cd7a6ef81ffd016aefb0e4/f32d8dc45613bef895570d2297255a7b#1
equivalent class: http://lodlaundromat.org/.well-known/genid/samples/jena///class//0b7a6cec83cd7a6ef81ffd016aefb0e4/f32d8dc45613bef895570d2297255a7b#1

function of
range: Thing
domain: Thing
type: ObjectProperty
inverse of: has function
comment: A UserAccount that has this Role.
domain: Role
type: Property
range: Resource
domain: Resource

page
range: Thing
type: Property
type: ObjectProperty
comment: A page or document about this thing.
domain: Thing
range: Document
inverse of: topic
term status: testing
range: Resource
domain: Resource

has creator
range: Thing
domain: Thing
type: ObjectProperty
inverse of: creator of
comment: This is the UserAccount that made this resource.
range: User Account
type: Property
range: Resource
range: Online Account
range: User
domain: Resource

Usergroup
subclass of: Thing
subclass of: Resource
type: Class
comment: A set of UserAccounts whose owners have a common purpose or interest. Can be used for access control purposes.
disjoint with: Container
disjoint with: Item
disjoint with: Role
disjoint with: Space
disjoint with: User Account
disjoint with: User

container of
range: Thing
domain: Thing
type: ObjectProperty
inverse of: has container
comment: An Item that this Container contains.
domain: Container
range: Item
type: Property
range: Resource
domain: Resource

Tag action
subclass of: Thing
subclass of: Resource
type: Class
subclass of: Graph
union of: http://lodlaundromat.org/.well-known/genid/samples/jena///class//0b7a6cec83cd7a6ef81ffd016aefb0e4/0b7a6cec83cd7a6ef81ffd016aefb0e4#1
label: Acte de taguer @fr
comment: A super class to describe every tag action as modelled by a named graph according to RDF Graph model (RDFG).
label: Taghandeling @nl
label: Acción de etiquetado @es
comment: Une super-classe qui permet de décrire et de modéliser les actes de taguer à l'aide d'un graphe nommé et au moyen du modèle de graphe RDF (RDFG). @fr
comment: Een overkoepelende categorie die toestaat elke taghandeling te beschrijving als een gelabelde graaf binnen het RDF graph model (RDFG). @nl
subclass of: Item
comment: Una super-clase que permite describir y modelar cada acción de etiquetado utilizando un named graph según el modelo del grafo RDF (RDFG). @es
label: Azione di tagging @it
comment: Una super-classe che permette di descrivere e di modellare ogni azione di tagging con un named graph secondo il modello del grafo RDF (RDFG). @it

identifies
domain: Thing
type: ObjectProperty
inverse of: is identified by
domain: uri
range: Thing
range: resource
comment: The relashionship between a URI and a resource. A URI identify only one resource, it acts as a "virtual" delegate for that resource on the Web. This is different from the refersTo relashionships. This latter holds between Resources, and it's not functional. For example, http://www.example.com#me identifies only john, while john's homepage http://www.example.com/john.html refersTo me, the place where he works, his job, his personal interests, etc. If I want to describe John's characteristics e.g. his name, age, etc. on the Web, I will attach them to http://www.example.com#john. On the other hand, http://www.example.com/john.html identifies john's homepage, which is an information resource.
type: FunctionalProperty
type: Property
range: Resource
range: http://lodlaundromat.org/.well-known/genid/samples/jena///class//0b7a6cec83cd7a6ef81ffd016aefb0e4/f32d8dc45613bef895570d2297255a7b#10
range: Tagged resource
range: http://lodlaundromat.org/.well-known/genid/samples/jena///class//0b7a6cec83cd7a6ef81ffd016aefb0e4/7c71b10046805dc486cf71431721ea93#10
domain: http://lodlaundromat.org/.well-known/genid/samples/jena///class//0b7a6cec83cd7a6ef81ffd016aefb0e4/f32d8dc45613bef895570d2297255a7b#10
domain: http://lodlaundromat.org/.well-known/genid/samples/jena///class//0b7a6cec83cd7a6ef81ffd016aefb0e4/f32d8dc45613bef895570d2297255a7b#2
domain: resource
domain: Resource
domain: http://lodlaundromat.org/.well-known/genid/samples/jena///class//0b7a6cec83cd7a6ef81ffd016aefb0e4/7c71b10046805dc486cf71431721ea93#2
domain: Tagged resource
domain: http://lodlaundromat.org/.well-known/genid/samples/jena///class//0b7a6cec83cd7a6ef81ffd016aefb0e4/f32d8dc45613bef895570d2297255a7b#3
domain: http://lodlaundromat.org/.well-known/genid/samples/jena///class//0b7a6cec83cd7a6ef81ffd016aefb0e4/7c71b10046805dc486cf71431721ea93#10
domain: http://lodlaundromat.org/.well-known/genid/samples/jena///class//0b7a6cec83cd7a6ef81ffd016aefb0e4/7c71b10046805dc486cf71431721ea93#3

is requested by
range: Thing
domain: Thing
type: ObjectProperty
domain: uri
range: web client
inverse of: requests
comment: WebClients that have requested a URI, like in typical HTTP GET requests.
type: Property
range: http://lodlaundromat.org/.well-known/genid/samples/jena///class//0b7a6cec83cd7a6ef81ffd016aefb0e4/f32d8dc45613bef895570d2297255a7b#10
range: resource
range: Resource
range: Tagged resource
range: http://lodlaundromat.org/.well-known/genid/samples/jena///class//0b7a6cec83cd7a6ef81ffd016aefb0e4/7c71b10046805dc486cf71431721ea93#10
domain: http://lodlaundromat.org/.well-known/genid/samples/jena///class//0b7a6cec83cd7a6ef81ffd016aefb0e4/f32d8dc45613bef895570d2297255a7b#10
domain: http://lodlaundromat.org/.well-known/genid/samples/jena///class//0b7a6cec83cd7a6ef81ffd016aefb0e4/f32d8dc45613bef895570d2297255a7b#2
domain: resource
domain: Resource
domain: http://lodlaundromat.org/.well-known/genid/samples/jena///class//0b7a6cec83cd7a6ef81ffd016aefb0e4/7c71b10046805dc486cf71431721ea93#2
domain: Tagged resource
domain: http://lodlaundromat.org/.well-known/genid/samples/jena///class//0b7a6cec83cd7a6ef81ffd016aefb0e4/f32d8dc45613bef895570d2297255a7b#3
domain: http://lodlaundromat.org/.well-known/genid/samples/jena///class//0b7a6cec83cd7a6ef81ffd016aefb0e4/7c71b10046805dc486cf71431721ea93#10
domain: http://lodlaundromat.org/.well-known/genid/samples/jena///class//0b7a6cec83cd7a6ef81ffd016aefb0e4/7c71b10046805dc486cf71431721ea93#3

Auto tag action
subclass of: Resource
type: Class
subclass of: Thing
label: Azione di tagging automatica @it
subclass of: Tag action
comment: Descrive delle tag generate e/o associate automaticamente a una risorsa da un computer. @it
label: Acte de taguer automatique @fr
comment: Décrit des tags générés et/ou associés automatiquement à une ressource par une machine. @fr
label: Geautomatiseerde taghandeling @nl
comment: Describe etiquetas generadas y/o asociadas manualmente a un recurso por un ordenador. @es
comment: Describes tags as automatically generated and/or associated to a resource by a computer.
label: Acción de etiquetado automática @es
comment: Beschrijft tags als zijnde gegenereerd en/of automatisch met een bron geasoccieerd, door een computerprogramma. @nl
subclass of: Item
subclass of: Graph

follows
range: Thing
domain: Thing
type: ObjectProperty
comment: Indicates that one UserAccount follows another UserAccount (e.g. for microblog posts or other content item updates).
domain: User Account
range: User Account
type: Property
range: Resource
range: Online Account
range: User
domain: Resource
domain: Online Account
domain: User

http://lodlaundromat.org/.well-known/genid/samples/jena///class//0b7a6cec83cd7a6ef81ffd016aefb0e4/f32d8dc45613bef895570d2297255a7b#4
type: Class
subclass of: Resource
subclass of: Thing
type: Restriction
on property: encoded in
cardinality: 1
subclass of: http://lodlaundromat.org/.well-known/genid/samples/jena///class//0b7a6cec83cd7a6ef81ffd016aefb0e4/7c71b10046805dc486cf71431721ea93#4
equivalent class: http://lodlaundromat.org/.well-known/genid/samples/jena///class//0b7a6cec83cd7a6ef81ffd016aefb0e4/7c71b10046805dc486cf71431721ea93#4

account
range: User Account
inverse of: account of
range: Thing
domain: Thing
type: Property
type: ObjectProperty
comment: Indicates an account held by this agent.
domain: Agent
range: Online Account
term status: testing
range: Resource
range: User
domain: Resource

located on
range: Thing
domain: Thing
type: ObjectProperty
comment: A relation between a WebRepresentation and a WebServer, indicating that the WebRepresentation can be obtained by e.g. an HTTP request to the WebServer.
inverse of: is location of
range: web server
domain: awww representation
type: Property
range: http://lodlaundromat.org/.well-known/genid/samples/jena///class//0b7a6cec83cd7a6ef81ffd016aefb0e4/7c71b10046805dc486cf71431721ea93#10
range: resource
range: Resource
range: http://lodlaundromat.org/.well-known/genid/samples/jena///class//0b7a6cec83cd7a6ef81ffd016aefb0e4/f32d8dc45613bef895570d2297255a7b#6
range: http://lodlaundromat.org/.well-known/genid/samples/jena///class//0b7a6cec83cd7a6ef81ffd016aefb0e4/f32d8dc45613bef895570d2297255a7b#10
range: http://lodlaundromat.org/.well-known/genid/samples/jena///class//0b7a6cec83cd7a6ef81ffd016aefb0e4/7c71b10046805dc486cf71431721ea93#6
range: Tagged resource
domain: http://lodlaundromat.org/.well-known/genid/samples/jena///class//0b7a6cec83cd7a6ef81ffd016aefb0e4/f32d8dc45613bef895570d2297255a7b#5
domain: Resource
domain: non-information resources
domain: Annotated resource
domain: http://lodlaundromat.org/.well-known/genid/samples/jena///class//0b7a6cec83cd7a6ef81ffd016aefb0e4/f32d8dc45613bef895570d2297255a7b#4
domain: resource
domain: http://lodlaundromat.org/.well-known/genid/samples/jena///class//0b7a6cec83cd7a6ef81ffd016aefb0e4/f32d8dc45613bef895570d2297255a7b#10
domain: http://lodlaundromat.org/.well-known/genid/samples/jena///class//0b7a6cec83cd7a6ef81ffd016aefb0e4/7c71b10046805dc486cf71431721ea93#4
domain: Tagged resource
domain: http://lodlaundromat.org/.well-known/genid/samples/jena///class//0b7a6cec83cd7a6ef81ffd016aefb0e4/7c71b10046805dc486cf71431721ea93#10
domain: http://lodlaundromat.org/.well-known/genid/samples/jena///class//0b7a6cec83cd7a6ef81ffd016aefb0e4/7c71b10046805dc486cf71431721ea93#5
domain: physical resource
domain: InformationRealization

homepage
range: Thing
comment: A homepage for some thing.
range: Document
type: Property
term status: stable
sub property of: page
sub property of: is primary topic of
domain: Thing
type: ObjectProperty
type: InverseFunctionalProperty
range: Resource
domain: Resource

Label Property
subclass of: Resource
subclass of: Thing
type: Class
comment: A foaf:LabelProperty is any RDF property with texual values that serve as labels.
term status: unstable

has subscriber
range: Thing
domain: Thing
type: ObjectProperty
inverse of: subscriber of
comment: A UserAccount that is subscribed to this Container.
domain: Container
range: User Account
type: Property
range: Resource
range: Online Account
range: User
domain: Resource

PersonalProfileDocument
subclass of: Resource
subclass of: Thing
type: Class
comment: A personal profile RDF document.
subclass of: Document
term status: testing

has member
range: Thing
domain: Thing
type: ObjectProperty
inverse of: member of
comment: A UserAccount that is a member of this Usergroup.
domain: Usergroup
range: User Account
type: Property
range: Resource
range: Online Account
range: User
domain: Resource

N-tuple tag action with machine tag syntax
equivalent class: Machine tag action
subclass of: Resource
type: Class
subclass of: Thing
subclass of: Machine tag action
label: Azione di tagging con una tag a n-dimensionale e sintassi delle machine tag @it
comment: Utilisé pour décrire un acte de taguer impliquant des tags dont les libellés ont n-dimensions et suivent la syntaxe des machine tags mais dans un contexte où des APIs semblables à celle de Flickr font défaut. @fr
comment: Descrive azioni di tagging basate su tag n-dimensionali che seguono la sintassi delle machine tag, ma in un contesto dove mancano API simili a quelle di Flickr. @it
label: Acción de etiquetado con una etiqueta n-dimensional y sintaxis de las machine tags @es
subclass of: N-tuple tag action
comment: Describes tagging involving N-tuple tags which follow machine tags typed syntax in acontext where Flickr-like APIs are lacking.
label: Taghandeling met een n-tuple met machinetag syntaxis @nl
comment: Describe acciones de etiquetado basadas en etiquetas n-dimensionales que siguen la sintaxis de las machine tag, pero en un contexto en el que faltan API parecidas a las de Flickr. @es
comment: Wordt gebruikt om een taghandeling te beschrijven wanneer de labels meerdere dimensies hebben en machinetag syntaxis volgen, maar er geen Flickr-gelijkende API besachikbaar is. @nl
label: Acte de taguer avec un tag à n-dimensions et syntaxe de machine tags @fr
label: Acte de taguer avec machine tag @fr
comment: Décrit des tags dont les libellés mobilisent la syntaxe des machine tags telle qu'implémentée d'abord sur le site Flickr.com. @fr
comment: Describes tags whose labels are using the syntax of machine tags as implemented first in Flickr.com.
comment: Describe etiquetas cuyo texto sigue la sintaxis de las machine tag como implementada en Flickr.com. @es
label: Azione di tagging con machine tag @it
comment: Beschrijft tags waarvan de labels gebruik maken van de machine-tag syntaxis, zoals voor het eerst geimplementeerd op flickr.com. @nl
comment: Descrive delle tag il cui testo segue la sintassi delle machine tag come implementata su Flickr.com. @it
label: Taghandeling met machinetag @nl
label: Acción de etiquetado con machine tag @es
subclass of: Syntactic Tag Action
label: Machine tag action
type: Thing
subclass of: Tag action
subclass of: Graph
subclass of: Item

Container
subclass of: Thing
subclass of: Resource
type: Class
comment: An area in which content Items are contained.
disjoint with: Item
disjoint with: Role
disjoint with: User Account
disjoint with: Usergroup
disjoint with: User

http://lodlaundromat.org/.well-known/genid/samples/jena///class//0b7a6cec83cd7a6ef81ffd016aefb0e4/7c71b10046805dc486cf71431721ea93#7
type: Class
subclass of: Resource
subclass of: Thing
type: Restriction
on property: is identified by
min cardinality: 1
subclass of: http://lodlaundromat.org/.well-known/genid/samples/jena///class//0b7a6cec83cd7a6ef81ffd016aefb0e4/f32d8dc45613bef895570d2297255a7b#7
equivalent class: http://lodlaundromat.org/.well-known/genid/samples/jena///class//0b7a6cec83cd7a6ef81ffd016aefb0e4/f32d8dc45613bef895570d2297255a7b#7

scope of
range: Thing
domain: Thing
type: ObjectProperty
inverse of: has scope
comment: A Role that has a scope of this resource.
range: Role
type: Property
range: Resource
domain: Resource

is topic of
range: Thing
domain: Thing
type: ObjectProperty
domain: resource
range: information resource
inverse of: is about
type: Property
range: resource
range: Resource
range: InformationObject
range: http://lodlaundromat.org/.well-known/genid/samples/jena///class//0b7a6cec83cd7a6ef81ffd016aefb0e4/f32d8dc45613bef895570d2297255a7b#10
range: Tagged resource
range: http://lodlaundromat.org/.well-known/genid/samples/jena///class//0b7a6cec83cd7a6ef81ffd016aefb0e4/7c71b10046805dc486cf71431721ea93#10
domain: Resource
domain: http://lodlaundromat.org/.well-known/genid/samples/jena///class//0b7a6cec83cd7a6ef81ffd016aefb0e4/f32d8dc45613bef895570d2297255a7b#10
domain: Tagged resource
domain: http://lodlaundromat.org/.well-known/genid/samples/jena///class//0b7a6cec83cd7a6ef81ffd016aefb0e4/7c71b10046805dc486cf71431721ea93#10

topic
domain: Thing
type: Property
type: ObjectProperty
comment: A topic of some page or document.
domain: Document
range: Thing
inverse of: page
term status: testing
range: Resource
domain: Resource

refers to
range: Thing
domain: Thing
type: ObjectProperty
comment: The relation between a URI and the resources it refers to.
domain: uri
inverse of: is referenced by
range: resource
sub property of: accesses
type: Property
range: Resource
range: Tagged resource
range: http://lodlaundromat.org/.well-known/genid/samples/jena///class//0b7a6cec83cd7a6ef81ffd016aefb0e4/f32d8dc45613bef895570d2297255a7b#10
range: http://lodlaundromat.org/.well-known/genid/samples/jena///class//0b7a6cec83cd7a6ef81ffd016aefb0e4/7c71b10046805dc486cf71431721ea93#10
domain: Resource
domain: http://lodlaundromat.org/.well-known/genid/samples/jena///class//0b7a6cec83cd7a6ef81ffd016aefb0e4/7c71b10046805dc486cf71431721ea93#10
domain: http://lodlaundromat.org/.well-known/genid/samples/jena///class//0b7a6cec83cd7a6ef81ffd016aefb0e4/f32d8dc45613bef895570d2297255a7b#10
domain: http://lodlaundromat.org/.well-known/genid/samples/jena///class//0b7a6cec83cd7a6ef81ffd016aefb0e4/f32d8dc45613bef895570d2297255a7b#2
domain: http://lodlaundromat.org/.well-known/genid/samples/jena///class//0b7a6cec83cd7a6ef81ffd016aefb0e4/f32d8dc45613bef895570d2297255a7b#3
domain: http://lodlaundromat.org/.well-known/genid/samples/jena///class//0b7a6cec83cd7a6ef81ffd016aefb0e4/7c71b10046805dc486cf71431721ea93#2
domain: http://lodlaundromat.org/.well-known/genid/samples/jena///class//0b7a6cec83cd7a6ef81ffd016aefb0e4/7c71b10046805dc486cf71431721ea93#3
domain: resource
domain: Tagged resource

next by date
range: Thing
domain: Thing
type: ObjectProperty
inverse of: previous by date
comment: Next Item or Post in a given Container sorted by date.
domain: Item
range: Item
type: Property
range: Resource
domain: Resource

maker
sub property of: creator
range: Thing
equivalent property: creator
comment: An agent that made this thing.
term status: stable
domain: Thing
inverse of: made
type: Property
range: Agent
type: ObjectProperty
range: Resource
domain: Resource

resource
subclass of: Tagged resource
subclass of: http://lodlaundromat.org/.well-known/genid/samples/jena///class//0b7a6cec83cd7a6ef81ffd016aefb0e4/f32d8dc45613bef895570d2297255a7b#10
subclass of: http://lodlaundromat.org/.well-known/genid/samples/jena///class//0b7a6cec83cd7a6ef81ffd016aefb0e4/7c71b10046805dc486cf71431721ea93#10
subclass of: Resource
type: Class
equivalent class: http://lodlaundromat.org/.well-known/genid/samples/jena///class//0b7a6cec83cd7a6ef81ffd016aefb0e4/f32d8dc45613bef895570d2297255a7b#10
comment: This class is meant to express the same intuition of rdfs:Resource but it is defined here in order to have OWL-DL compaibility. In an OWL Full version of this ontology we would have this class owl:equivalentClass rdfs:Resource.
subclass of: Thing
equivalent class: http://lodlaundromat.org/.well-known/genid/samples/jena///class//0b7a6cec83cd7a6ef81ffd016aefb0e4/7c71b10046805dc486cf71431721ea93#10
equivalent class: Tagged resource

administrator of
range: Thing
domain: Thing
type: ObjectProperty
inverse of: has administrator
comment: A Site that the UserAccount is an administrator of.
domain: User Account
range: Site
type: Property
range: Resource
range: Space
domain: Resource
domain: Online Account
domain: User

information resource
subclass of: Thing
subclass of: InformationObject
subclass of: http://lodlaundromat.org/.well-known/genid/samples/jena///class//0b7a6cec83cd7a6ef81ffd016aefb0e4/f32d8dc45613bef895570d2297255a7b#10
subclass of: http://lodlaundromat.org/.well-known/genid/samples/jena///class//0b7a6cec83cd7a6ef81ffd016aefb0e4/7c71b10046805dc486cf71431721ea93#10
subclass of: Resource
type: Class
disjoint with: InformationRealization
disjoint with: awww representation
disjoint with: Nothing
equivalent class: InformationObject
comment: They are *about* something, this something can be everything (rdfs:Resource, owl:Thing, ire:Entity) including AnalogResource. Their essential characteristics can be conveyed in a single message. They can be associated with a URI, and can have a WebRepresentation, in this case they are called WebResource. They have some realization, for example: the text of Moby Dick is an InformationResource, a book containing the text of Moby Dick is one of its realization. The intuition behind the class InformationResource is the same behind the class ir:InformationRealization (cloned from Dolce Ultra Lite).
subclass of: resource
disjoint with: non-information resources
subclass of: Tagged resource

openid
sub property of: page
range: Thing
domain: Thing
range: Document
type: ObjectProperty
term status: testing
type: Property
domain: Agent
type: InverseFunctionalProperty
sub property of: is primary topic of
comment: An OpenID for an Agent.
range: Resource
domain: Resource

http://lodlaundromat.org/.well-known/genid/samples/jena///class//0b7a6cec83cd7a6ef81ffd016aefb0e4/7c71b10046805dc486cf71431721ea93#2
type: Class
subclass of: Thing
subclass of: Resource
type: Restriction
cardinality: 1
on property: has URI string value
subclass of: http://lodlaundromat.org/.well-known/genid/samples/jena///class//0b7a6cec83cd7a6ef81ffd016aefb0e4/f32d8dc45613bef895570d2297255a7b#2
equivalent class: http://lodlaundromat.org/.well-known/genid/samples/jena///class//0b7a6cec83cd7a6ef81ffd016aefb0e4/f32d8dc45613bef895570d2297255a7b#2

space of
range: Thing
domain: Thing
type: ObjectProperty
inverse of: has space
comment: A resource which belongs to this data Space.
domain: Space
type: Property
range: Resource
domain: Resource

web server
subclass of: Thing
subclass of: http://lodlaundromat.org/.well-known/genid/samples/jena///class//0b7a6cec83cd7a6ef81ffd016aefb0e4/f32d8dc45613bef895570d2297255a7b#10
type: Class
subclass of: Resource
subclass of: http://lodlaundromat.org/.well-known/genid/samples/jena///class//0b7a6cec83cd7a6ef81ffd016aefb0e4/7c71b10046805dc486cf71431721ea93#10
subclass of: http://lodlaundromat.org/.well-known/genid/samples/jena///class//0b7a6cec83cd7a6ef81ffd016aefb0e4/f32d8dc45613bef895570d2297255a7b#6
subclass of: http://lodlaundromat.org/.well-known/genid/samples/jena///class//0b7a6cec83cd7a6ef81ffd016aefb0e4/7c71b10046805dc486cf71431721ea93#6
subclass of: resource
subclass of: Tagged resource

related to
range: Thing
domain: Thing
type: ObjectProperty
comment: Related Posts for this Post, perhaps determined implicitly from topics or references.
type: Property
range: Resource
domain: Resource

Share
subclass of: Resource
type: Class
subclass of: Thing
comment: Describe la acción que se realiza con una etiqueta cuando es usada para compartir la representación de un recurso en un servicio Web, por ejemplo Delicious o Twitter, con el titular de una cuenta en este servicio (sioc:UserAccount, que no es necesariamente una foaf:Person, porqué puede ser también un robot o una institución cuyos representantes pueden variar en el tiempo. @es
label: Condividere @it
comment: Describes the action that is performed with a tag whenever it is used to share the representation of a WebResource on various services - Twitter or Delicious for instance - with the owner of a sioc:UserAccount (not necessarily a foaf:Person as it might be either a bot, a person or an institution whose representatives may well vary over time).
subclass of: Tag action
label: Compartir @es
comment: Descrive l'azione che si compie con una tag quando questa è usata per condividere la rappresentazizone di una risorsa su uno specifico servizio Web, per esempio Delicious o Twitter, con il titolare di un account su tale servizio (sioc:UserAccount, che non è necessariamente una foaf:Person, ma può trattarsi anche di un robot, o di una istituzione i cui rappresentanti possono variare nel tempo). @it
label: Partager @fr
comment: Beschrijft de handeling die verricht wordt met een tag wanneer deze gebruikt wordt om de representatie van een bron op het web te delen met een gebruiker van een dienst als Twitter of Delicious. (sioc:UserAccount, wat niet per se een foaf:Person is aangezien het ook om een bot kan gaan of een instelling die met het verlopen van de tijd door verschillende personen vertegenwoordigd kan worden). @nl
label: Delen @nl
comment: Décrit l'action que l'on accomplit avec un tag dès lors que celui-ci est utilisé pour partager une représentation d'une ressource sur le Web, notamment sur Delicious ou Twitter. Ce partage ne se fait pas nécessairement avec une autre personne mais plutôt avec le titulaire d'un compte sur l'un ou l'autre de ces services (sioc:UserAccount, qui n'est pas nécessairement une foaf:Person étant donné qu'il peut s'agir aussi bien d'un robot, d'une personne ou encore d'une institution dont les représentants sont potentiellement amenés à varier au fil du temps). @fr
subclass of: Item
subclass of: Graph

Tag collection
subclass of: Thing
subclass of: Resource
type: Class
comment: Una generica collezione di tag. @it
label: Tagverzameling @nl
label: Collection de tags @fr
comment: Undefined collection of tags.
comment: Une collection de tags ne répondant à aucune définition particulière. @fr
label: Colección de etiquetas @es
comment: Een verzameling tags zonder verdere specifieke definitie. @nl
label: Collezione di tag @it
comment: Una genérica colección de etiquetas. @es

Owner tag action
subclass of: Resource
type: Class
subclass of: Thing
subclass of: Tag action
comment: Utilisé pour décrire un acte de taguer accompli par le propriétaire de l'URI qui identifie la ressource taguée. @fr
comment: Usato per descrivere un'azione di tagging svolta dal proprietario dell'URI che identifica la risorsa taggata. @it
comment: Used to describe an act of tagging performed by the owner of the URI that identifies the tagged resource.
label: Acción de etiquetado del propietario @es
comment: Beschrijft een taghandeling verricht door de eigenaar van de URI waarmee de getagde bron geïdentificeerd wordt. @nl
label: Taghandeling eigenaar @nl
comment: Usado para describir una acción de etiquetado realizada por el propietario del URI que identifica el recurso etiquetado. @es
label: Azione di tagging del proprietario @it
label: Acte de taguer d'un propriétaire @fr
subclass of: Graph
subclass of: Item
disjoint with: Visitor tag action

Manual tag action
subclass of: Resource
type: Class
subclass of: Thing
label: Azione di tagging manuale @it
label: Handmatige taghandeling @nl
comment: Descrive delle tag associate manualmente a una risorsa da un essere umano. @it
label: Acción de etiquetado manual @es
subclass of: Tag action
comment: Describes tags as manually associated to a resource by a human.
comment: Describe etiquetas asociadas manualmente a un recurso por un ser humano. @es
comment: Décrit des tags associés manuellement à une ressource par un être humain. @fr
label: Acte de taguer manuel @fr
comment: Beschrijft tags als handmatig met een bron geasssocieerd door een mens @nl
subclass of: Graph
subclass of: Item

Machine tag action
subclass of: Resource
equivalent class: N-tuple tag action with machine tag syntax
subclass of: N-tuple tag action with machine tag syntax
type: Class
subclass of: Thing
label: Acte de taguer avec machine tag @fr
comment: Décrit des tags dont les libellés mobilisent la syntaxe des machine tags telle qu'implémentée d'abord sur le site Flickr.com. @fr
comment: Describes tags whose labels are using the syntax of machine tags as implemented first in Flickr.com.
comment: Describe etiquetas cuyo texto sigue la sintaxis de las machine tag como implementada en Flickr.com. @es
label: Azione di tagging con machine tag @it
comment: Beschrijft tags waarvan de labels gebruik maken van de machine-tag syntaxis, zoals voor het eerst geimplementeerd op flickr.com. @nl
comment: Descrive delle tag il cui testo segue la sintassi delle machine tag come implementata su Flickr.com. @it
label: Taghandeling met machinetag @nl
label: Acción de etiquetado con machine tag @es
subclass of: Syntactic Tag Action
label: N-tuple tag action with machine tag syntax
label: Azione di tagging con una tag a n-dimensionale e sintassi delle machine tag @it
comment: Utilisé pour décrire un acte de taguer impliquant des tags dont les libellés ont n-dimensions et suivent la syntaxe des machine tags mais dans un contexte où des APIs semblables à celle de Flickr font défaut. @fr
comment: Descrive azioni di tagging basate su tag n-dimensionali che seguono la sintassi delle machine tag, ma in un contesto dove mancano API simili a quelle di Flickr. @it
label: Acción de etiquetado con una etiqueta n-dimensional y sintaxis de las machine tags @es
subclass of: N-tuple tag action
comment: Describes tagging involving N-tuple tags which follow machine tags typed syntax in acontext where Flickr-like APIs are lacking.
label: Taghandeling met een n-tuple met machinetag syntaxis @nl
comment: Describe acciones de etiquetado basadas en etiquetas n-dimensionales que siguen la sintaxis de las machine tag, pero en un contexto en el que faltan API parecidas a las de Flickr. @es
comment: Wordt gebruikt om een taghandeling te beschrijven wanneer de labels meerdere dimensies hebben en machinetag syntaxis volgen, maar er geen Flickr-gelijkende API besachikbaar is. @nl
label: Acte de taguer avec un tag à n-dimensions et syntaxe de machine tags @fr
type: Thing
subclass of: Tag action
subclass of: Graph
subclass of: Item

Role
subclass of: Thing
subclass of: Resource
type: Class
comment: A Role is a function of a UserAccount within a scope of a particular Forum, Site, etc.
disjoint with: Container
disjoint with: Item
disjoint with: Space
disjoint with: User Account
disjoint with: Usergroup
disjoint with: User
disjoint with: Community

has owner
range: Thing
domain: Thing
type: ObjectProperty
inverse of: owner of
comment: A UserAccount that this resource is owned by.
range: User Account
type: Property
range: Resource
range: Online Account
range: User
domain: Resource

awww representation
subclass of: Resource
subclass of: Annotated resource
subclass of: Thing
type: Class
subclass of: http://lodlaundromat.org/.well-known/genid/samples/jena///class//0b7a6cec83cd7a6ef81ffd016aefb0e4/f32d8dc45613bef895570d2297255a7b#4
subclass of: http://lodlaundromat.org/.well-known/genid/samples/jena///class//0b7a6cec83cd7a6ef81ffd016aefb0e4/7c71b10046805dc486cf71431721ea93#4
comment: The realization of a message encoding that 'goes on the wire' according to an interaction protocol (e.g. http) in order to resolve a Web accessible resource. Representation have neither a URL nor a URI, they are associated with the URL of the Web Resource they represent. Representation are disjoint with Web resources
subclass of: InformationRealization
disjoint with: Nothing
disjoint with: information resource
subclass of: http://lodlaundromat.org/.well-known/genid/samples/jena///class//0b7a6cec83cd7a6ef81ffd016aefb0e4/7c71b10046805dc486cf71431721ea93#5
subclass of: http://lodlaundromat.org/.well-known/genid/samples/jena///class//0b7a6cec83cd7a6ef81ffd016aefb0e4/f32d8dc45613bef895570d2297255a7b#5
subclass of: resource
subclass of: http://lodlaundromat.org/.well-known/genid/samples/jena///class//0b7a6cec83cd7a6ef81ffd016aefb0e4/f32d8dc45613bef895570d2297255a7b#10
subclass of: Tagged resource
subclass of: http://lodlaundromat.org/.well-known/genid/samples/jena///class//0b7a6cec83cd7a6ef81ffd016aefb0e4/7c71b10046805dc486cf71431721ea93#10
subclass of: non-information resources
subclass of: physical resource
equivalent class: Annotated resource

moderator of
range: Thing
domain: Thing
type: ObjectProperty
inverse of: has moderator
comment: A Forum that a UserAccount is a moderator of.
domain: User Account
range: Forum
type: Property
range: Resource
range: Container
domain: Resource
domain: Online Account
domain: User

owner of
range: Thing
domain: Thing
type: ObjectProperty
inverse of: has owner
comment: A resource owned by a particular UserAccount, for example, a weblog or image gallery.
domain: User Account
type: Property
range: Resource
domain: Resource
domain: Online Account
domain: User

creator of
range: Thing
domain: Thing
type: ObjectProperty
inverse of: has creator
comment: A resource that the UserAccount is a creator of.
domain: User Account
type: Property
range: Resource
domain: Resource
domain: Online Account
domain: User

feed
range: Thing
domain: Thing
type: ObjectProperty
comment: A feed (e.g. RSS, Atom, etc.) pertaining to this resource (e.g. for a Forum, Site, UserAccount, etc.).
type: Property
range: Resource
domain: Resource

has space
range: Thing
domain: Thing
type: ObjectProperty
inverse of: space of
comment: A data Space which this resource is a part of.
range: Space
type: Property
range: Resource
domain: Resource

embeds knowledge
range: Thing
domain: Thing
type: ObjectProperty
comment: This links Items to embedded statements, facts and structured content.
domain: Item
range: Graph
type: Property
range: Resource
domain: Resource

media type
subclass of: Thing
subclass of: http://lodlaundromat.org/.well-known/genid/samples/jena///class//0b7a6cec83cd7a6ef81ffd016aefb0e4/f32d8dc45613bef895570d2297255a7b#10
subclass of: http://lodlaundromat.org/.well-known/genid/samples/jena///class//0b7a6cec83cd7a6ef81ffd016aefb0e4/7c71b10046805dc486cf71431721ea93#10
subclass of: Resource
type: Class
subclass of: resource
subclass of: Tagged resource

Online E-commerce Account
subclass of: Resource
subclass of: Thing
type: Class
comment: An online e-commerce account.
subclass of: Online Account
term status: unstable

http://lodlaundromat.org/.well-known/genid/samples/jena///class//0b7a6cec83cd7a6ef81ffd016aefb0e4/7c71b10046805dc486cf71431721ea93#8
subclass of: Resource
type: Class
subclass of: Thing
type: Restriction
min cardinality: 1
on property: isRealizedBy
subclass of: http://lodlaundromat.org/.well-known/genid/samples/jena///class//0b7a6cec83cd7a6ef81ffd016aefb0e4/f32d8dc45613bef895570d2297255a7b#8
equivalent class: http://lodlaundromat.org/.well-known/genid/samples/jena///class//0b7a6cec83cd7a6ef81ffd016aefb0e4/f32d8dc45613bef895570d2297255a7b#8

non-information resources
subclass of: Resource
type: Class
subclass of: Thing
subclass of: http://lodlaundromat.org/.well-known/genid/samples/jena///class//0b7a6cec83cd7a6ef81ffd016aefb0e4/f32d8dc45613bef895570d2297255a7b#10
subclass of: http://lodlaundromat.org/.well-known/genid/samples/jena///class//0b7a6cec83cd7a6ef81ffd016aefb0e4/7c71b10046805dc486cf71431721ea93#10
subclass of: http://lodlaundromat.org/.well-known/genid/samples/jena///class//0b7a6cec83cd7a6ef81ffd016aefb0e4/f32d8dc45613bef895570d2297255a7b#5
subclass of: resource
subclass of: http://lodlaundromat.org/.well-known/genid/samples/jena///class//0b7a6cec83cd7a6ef81ffd016aefb0e4/7c71b10046805dc486cf71431721ea93#5
disjoint with: information resource
comment: All Semantic Web resources that are not information resources. They include abstract, conceptual, and physical resources.
subclass of: Tagged resource

Set task
subclass of: Resource
type: Class
subclass of: Thing
label: Définir une tâche @fr
label: Taak definiëren @nl
comment: Décrit l'action que l'on accomplit avec un tag de type "àfaire" dès lors que celui-ci est utilisé pour définir une tâche attendant sa réalisation. @fr
label: Definir una tarea @es
comment: Describe la acción que se realiza con una etiqueta de tipo "quehacer" cuando es usada para crear una tarea en espera de realización. @es
comment: Describes the action that is performed with a "todo" tag whenever it is used to create a task awaiting performance.
label: Definire un compito @it
comment: Descrive l'azione che si compie con una tag di tipo "dafare", quando questa è usata per creare un compito in attesa di realizzazione. @it
subclass of: Visitor tag action
comment: Beschrijft de handeling die verricht wordt met een tag van het type “te doen” wanneer deze gebruikt wordt om een taak te maken in afwachting van haar realisatie. @nl
subclass of: Tag action
subclass of: Item
subclass of: Graph

Group
subclass of: Resource
subclass of: Thing
subclass of: Agent
type: Class
comment: A class of Agents.
term status: stable

subscriber of
range: Thing
domain: Thing
type: ObjectProperty
inverse of: has subscriber
comment: A Container that a UserAccount is subscribed to.
domain: User Account
range: Container
type: Property
range: Resource
domain: Resource
domain: Online Account
domain: User

Part Of Web representation
subclass of: Thing
subclass of: Resource
type: Class
comment: Usato per rappresentare la parte della rappresentazione di una risorsa Web quando si è fatto uso dell'atto di tagging "Point". @it
label: Onderdeel van de representatie van een bron op het web @nl
comment: Utilisé pour représenter la partie de la représentation d'une ressource qui est taguée lorsque qu'il est fait usage de l'acte de taguer "Pointer". @fr
subclass of: WebRepresentation
label: Partie de la représentation d'une ressource sur le Web @fr
comment: Used to represent the part of the Web representation resource being tagged after the "Point" TagAction is used.
comment: Wordt gebruikt om het getagde deel van een web-representatie aan te geven wanneer gebruikt is gemaakt van de "Aanwijs" taghandeling. @nl
label: Parte della rappresentazione di una risorsa Web @it
label: Parte de la representación de un recurso en la Web @es
comment: Usado para representar la parte de la representación de un recurso Web quando se ha hecho uso del acto de etiquetado "Point". @es

workplace homepage
range: Thing
domain: Thing
type: Property
type: ObjectProperty
comment: A workplace homepage of some person; the homepage of an organization they work for.
domain: Person
range: Document
term status: testing
range: Resource
domain: Agent
domain: Resource
domain: SpatialThing

Point
subclass of: Resource
type: Class
subclass of: Thing
comment: Décrit l'action que l'on accomplit avec un tag dès lors que celui-ci est utilisé pour faire référence à une portion spécifique de la représentation d'une ressource sur le Web (le segment d'une vidéo, un commentaire produit par les utilisateurs au pied d'un article, etc.). @fr
label: Puntare @it
label: Pointer @fr
label: Puntar @es
subclass of: Tag action
label: Aanwijzen @nl
comment: Beschrijft de handeling die verricht wordt met een tag wanneer deze gebruikt wordt om naar een specifiek deel van een web-representatie te verwijzen (een segment van een video, een door een gebruiker gegenereerd commentaar bij een krantenartikel, etc.). @nl
comment: Descrive l'azione che si compie con una tag quando questa è usata per fare riferimento a una parte specifica della rappresentazione di una risorsa Web (il segmento di un video, il commento generato dagli utenti a un articolo di un quotidiano, ecc.). @it
comment: Describe la acción que se realiza con una etiqueta cuando es usada para referirse a una parte específica de un recurso Web (el segmento de un video, comentarios generados por los usuarios a un artículo de periódico). @es
comment: Describes the action that is performed with a tag whenever it is used to point to a specific part of a Web representation (the segment of a video, a user-generated commentary to a newspaper article, etc.).
subclass of: Item
subclass of: Graph

has scope
range: Thing
domain: Thing
type: ObjectProperty
inverse of: scope of
comment: A resource that this Role applies to.
domain: Role
type: Property
range: Resource
domain: Resource

account
range: Thing
domain: Thing
type: Property
type: ObjectProperty
comment: Indicates an account held by this agent.
domain: Agent
range: Online Account
term status: archaic
range: Resource
domain: Resource

User Account
subclass of: User
subclass of: Thing
subclass of: Resource
type: Class
disjoint with: Role
subclass of: Online Account
disjoint with: Usergroup
disjoint with: Space
comment: A user account in an online community site.
disjoint with: Container
disjoint with: Item
disjoint with: Community
equivalent class: User

uri
type: Class
subclass of: http://lodlaundromat.org/.well-known/genid/samples/jena///class//0b7a6cec83cd7a6ef81ffd016aefb0e4/7c71b10046805dc486cf71431721ea93#10
subclass of: Resource
subclass of: Thing
subclass of: http://lodlaundromat.org/.well-known/genid/samples/jena///class//0b7a6cec83cd7a6ef81ffd016aefb0e4/f32d8dc45613bef895570d2297255a7b#10
subclass of: http://lodlaundromat.org/.well-known/genid/samples/jena///class//0b7a6cec83cd7a6ef81ffd016aefb0e4/f32d8dc45613bef895570d2297255a7b#2
subclass of: http://lodlaundromat.org/.well-known/genid/samples/jena///class//0b7a6cec83cd7a6ef81ffd016aefb0e4/f32d8dc45613bef895570d2297255a7b#3
subclass of: http://lodlaundromat.org/.well-known/genid/samples/jena///class//0b7a6cec83cd7a6ef81ffd016aefb0e4/7c71b10046805dc486cf71431721ea93#2
subclass of: http://lodlaundromat.org/.well-known/genid/samples/jena///class//0b7a6cec83cd7a6ef81ffd016aefb0e4/7c71b10046805dc486cf71431721ea93#3
subclass of: resource
subclass of: Tagged resource

Image
subclass of: Resource
subclass of: Thing
type: Class
comment: An image.
subclass of: Document
term status: testing

Person
subclass of: Resource
subclass of: Thing
subclass of: Agent
comment: A person.
term status: stable
subclass of: SpatialThing
disjoint with: Project
type: Class
subclass of: Person
disjoint with: Organization

Thread
subclass of: Resource
type: Class
subclass of: Thing
comment: A container for a series of threaded discussion Posts or Items.
subclass of: Container

phone
range: Thing
domain: Thing
type: Property
type: ObjectProperty
comment: A phone, specified using fully qualified tel: URI scheme (refs: http://www.w3.org/Addressing/schemes.html#tel).
term status: testing
range: Resource
domain: Resource

resolves to
range: Thing
domain: Thing
type: ObjectProperty
inverse of: is resolution of
comment: Relates a URI to a concrete Web server, which currently is done by mapping a URI to an IP address or addresses.
domain: uri
sub property of: accesses
range: web server
type: Property
range: resource
range: Resource
range: Tagged resource
range: http://lodlaundromat.org/.well-known/genid/samples/jena///class//0b7a6cec83cd7a6ef81ffd016aefb0e4/f32d8dc45613bef895570d2297255a7b#10
range: http://lodlaundromat.org/.well-known/genid/samples/jena///class//0b7a6cec83cd7a6ef81ffd016aefb0e4/7c71b10046805dc486cf71431721ea93#10
domain: Resource
domain: http://lodlaundromat.org/.well-known/genid/samples/jena///class//0b7a6cec83cd7a6ef81ffd016aefb0e4/7c71b10046805dc486cf71431721ea93#10
domain: http://lodlaundromat.org/.well-known/genid/samples/jena///class//0b7a6cec83cd7a6ef81ffd016aefb0e4/f32d8dc45613bef895570d2297255a7b#10
domain: http://lodlaundromat.org/.well-known/genid/samples/jena///class//0b7a6cec83cd7a6ef81ffd016aefb0e4/f32d8dc45613bef895570d2297255a7b#2
domain: http://lodlaundromat.org/.well-known/genid/samples/jena///class//0b7a6cec83cd7a6ef81ffd016aefb0e4/f32d8dc45613bef895570d2297255a7b#3
domain: http://lodlaundromat.org/.well-known/genid/samples/jena///class//0b7a6cec83cd7a6ef81ffd016aefb0e4/7c71b10046805dc486cf71431721ea93#2
domain: http://lodlaundromat.org/.well-known/genid/samples/jena///class//0b7a6cec83cd7a6ef81ffd016aefb0e4/7c71b10046805dc486cf71431721ea93#3
domain: resource
domain: Tagged resource
range: http://lodlaundromat.org/.well-known/genid/samples/jena///class//0b7a6cec83cd7a6ef81ffd016aefb0e4/f32d8dc45613bef895570d2297255a7b#6
range: http://lodlaundromat.org/.well-known/genid/samples/jena///class//0b7a6cec83cd7a6ef81ffd016aefb0e4/7c71b10046805dc486cf71431721ea93#6

encoded in
range: Thing
domain: Thing
type: FunctionalProperty
type: ObjectProperty
inverse of: encodes
domain: awww representation
range: media type
type: Property
range: resource
range: Resource
range: http://lodlaundromat.org/.well-known/genid/samples/jena///class//0b7a6cec83cd7a6ef81ffd016aefb0e4/f32d8dc45613bef895570d2297255a7b#10
range: Tagged resource
range: http://lodlaundromat.org/.well-known/genid/samples/jena///class//0b7a6cec83cd7a6ef81ffd016aefb0e4/7c71b10046805dc486cf71431721ea93#10
domain: http://lodlaundromat.org/.well-known/genid/samples/jena///class//0b7a6cec83cd7a6ef81ffd016aefb0e4/f32d8dc45613bef895570d2297255a7b#5
domain: Resource
domain: non-information resources
domain: Annotated resource
domain: http://lodlaundromat.org/.well-known/genid/samples/jena///class//0b7a6cec83cd7a6ef81ffd016aefb0e4/f32d8dc45613bef895570d2297255a7b#4
domain: resource
domain: http://lodlaundromat.org/.well-known/genid/samples/jena///class//0b7a6cec83cd7a6ef81ffd016aefb0e4/f32d8dc45613bef895570d2297255a7b#10
domain: http://lodlaundromat.org/.well-known/genid/samples/jena///class//0b7a6cec83cd7a6ef81ffd016aefb0e4/7c71b10046805dc486cf71431721ea93#4
domain: Tagged resource
domain: http://lodlaundromat.org/.well-known/genid/samples/jena///class//0b7a6cec83cd7a6ef81ffd016aefb0e4/7c71b10046805dc486cf71431721ea93#10
domain: http://lodlaundromat.org/.well-known/genid/samples/jena///class//0b7a6cec83cd7a6ef81ffd016aefb0e4/7c71b10046805dc486cf71431721ea93#5
domain: physical resource
domain: InformationRealization

depicts
domain: Thing
type: Property
type: ObjectProperty
comment: A thing depicted in this representation.
domain: Image
range: Thing
inverse of: depiction
term status: testing
range: Resource
domain: Resource
domain: Document

http://lodlaundromat.org/.well-known/genid/samples/jena///class//0b7a6cec83cd7a6ef81ffd016aefb0e4/7c71b10046805dc486cf71431721ea93#3
subclass of: Thing
type: Class
subclass of: Resource
type: Restriction
min cardinality: 1
on property: identifies
subclass of: http://lodlaundromat.org/.well-known/genid/samples/jena///class//0b7a6cec83cd7a6ef81ffd016aefb0e4/f32d8dc45613bef895570d2297255a7b#3
equivalent class: http://lodlaundromat.org/.well-known/genid/samples/jena///class//0b7a6cec83cd7a6ef81ffd016aefb0e4/f32d8dc45613bef895570d2297255a7b#3

part of
range: Thing
domain: Thing
type: DeprecatedProperty
type: ObjectProperty
inverse of: has part
comment: A resource that the subject is a part of.
version info: This property is deprecated. Use dcterms:isPartOf from the Dublin Core ontology instead.
type: Property
range: Resource
domain: Resource

Disambiguate Tag Action
subclass of: Resource
type: Class
subclass of: Thing
comment: Used when the sign used to tag is disambiguated.
label: Acte de taguer avec désambigüisation @fr
comment: Utilisé lorsque le signe utilisé pour taguer est désambiguïsé. @fr
comment: Usado quando el signo usado para etiquetar es desambiguado. @es
comment: Wordt gebruikt wanneer het teken waarmee getagd wordt gedesambigueerd is. @nl
subclass of: Tag action
label: Azione di tagging con disambiguazione @it
comment: Usato quando il segno usato per taggare è disambiguato. @it
label: Taghandeling met gedisambigueerd teken @nl
label: Acción de etiquetado con desambiguación @es
subclass of: Item
subclass of: Graph

Personal tag collection
subclass of: Resource
type: Class
subclass of: Thing
label: Collection de tags personnelle @fr
label: Collezione di tag personale @it
label: Colección de etiquetas personal @es
label: Persoonlijke tagverzameling @nl
subclass of: Tag collection
comment: A collection of tags generated by a single user.
comment: Une collection de tags constituée par un utilisateur précis. @fr

is resolution of
range: Thing
domain: Thing
type: ObjectProperty
sub property of: requests
inverse of: resolves to
range: uri
domain: web server
type: Property
range: Resource
range: http://lodlaundromat.org/.well-known/genid/samples/jena///class//0b7a6cec83cd7a6ef81ffd016aefb0e4/7c71b10046805dc486cf71431721ea93#10
range: http://lodlaundromat.org/.well-known/genid/samples/jena///class//0b7a6cec83cd7a6ef81ffd016aefb0e4/f32d8dc45613bef895570d2297255a7b#10
range: http://lodlaundromat.org/.well-known/genid/samples/jena///class//0b7a6cec83cd7a6ef81ffd016aefb0e4/f32d8dc45613bef895570d2297255a7b#2
range: http://lodlaundromat.org/.well-known/genid/samples/jena///class//0b7a6cec83cd7a6ef81ffd016aefb0e4/f32d8dc45613bef895570d2297255a7b#3
range: http://lodlaundromat.org/.well-known/genid/samples/jena///class//0b7a6cec83cd7a6ef81ffd016aefb0e4/7c71b10046805dc486cf71431721ea93#2
range: http://lodlaundromat.org/.well-known/genid/samples/jena///class//0b7a6cec83cd7a6ef81ffd016aefb0e4/7c71b10046805dc486cf71431721ea93#3
range: resource
range: Tagged resource
domain: resource
domain: Resource
domain: Tagged resource
domain: http://lodlaundromat.org/.well-known/genid/samples/jena///class//0b7a6cec83cd7a6ef81ffd016aefb0e4/f32d8dc45613bef895570d2297255a7b#10
domain: http://lodlaundromat.org/.well-known/genid/samples/jena///class//0b7a6cec83cd7a6ef81ffd016aefb0e4/7c71b10046805dc486cf71431721ea93#10
domain: http://lodlaundromat.org/.well-known/genid/samples/jena///class//0b7a6cec83cd7a6ef81ffd016aefb0e4/f32d8dc45613bef895570d2297255a7b#6
domain: http://lodlaundromat.org/.well-known/genid/samples/jena///class//0b7a6cec83cd7a6ef81ffd016aefb0e4/7c71b10046805dc486cf71431721ea93#6

has discussion
range: Thing
domain: Thing
type: ObjectProperty
comment: The discussion that is related to this Item.
domain: Item
type: Property
range: Resource
domain: Resource

is identified by
range: Thing
type: InverseFunctionalProperty
type: ObjectProperty
domain: Thing
inverse of: identifies
range: uri
domain: resource
type: Property
range: http://lodlaundromat.org/.well-known/genid/samples/jena///class//0b7a6cec83cd7a6ef81ffd016aefb0e4/f32d8dc45613bef895570d2297255a7b#10
range: http://lodlaundromat.org/.well-known/genid/samples/jena///class//0b7a6cec83cd7a6ef81ffd016aefb0e4/f32d8dc45613bef895570d2297255a7b#2
range: resource
range: Resource
range: http://lodlaundromat.org/.well-known/genid/samples/jena///class//0b7a6cec83cd7a6ef81ffd016aefb0e4/7c71b10046805dc486cf71431721ea93#2
range: Tagged resource
range: http://lodlaundromat.org/.well-known/genid/samples/jena///class//0b7a6cec83cd7a6ef81ffd016aefb0e4/f32d8dc45613bef895570d2297255a7b#3
range: http://lodlaundromat.org/.well-known/genid/samples/jena///class//0b7a6cec83cd7a6ef81ffd016aefb0e4/7c71b10046805dc486cf71431721ea93#10
range: http://lodlaundromat.org/.well-known/genid/samples/jena///class//0b7a6cec83cd7a6ef81ffd016aefb0e4/7c71b10046805dc486cf71431721ea93#3
domain: Resource
domain: http://lodlaundromat.org/.well-known/genid/samples/jena///class//0b7a6cec83cd7a6ef81ffd016aefb0e4/f32d8dc45613bef895570d2297255a7b#10
domain: Tagged resource
domain: http://lodlaundromat.org/.well-known/genid/samples/jena///class//0b7a6cec83cd7a6ef81ffd016aefb0e4/7c71b10046805dc486cf71431721ea93#10

http://lodlaundromat.org/.well-known/genid/samples/jena///class//0b7a6cec83cd7a6ef81ffd016aefb0e4/f32d8dc45613bef895570d2297255a7b#6
type: Class
subclass of: Resource
subclass of: Thing
type: Restriction
min cardinality: 1
on property: is resolution of
subclass of: http://lodlaundromat.org/.well-known/genid/samples/jena///class//0b7a6cec83cd7a6ef81ffd016aefb0e4/7c71b10046805dc486cf71431721ea93#6
equivalent class: http://lodlaundromat.org/.well-known/genid/samples/jena///class//0b7a6cec83cd7a6ef81ffd016aefb0e4/7c71b10046805dc486cf71431721ea93#6

attachment
range: Thing
domain: Thing
type: ObjectProperty
comment: The URI of a file attached to an Item.
domain: Item
type: Property
range: Resource
domain: Resource

current project
domain: Thing
type: Property
type: ObjectProperty
comment: A current project this person works on.
domain: Person
range: Thing
term status: testing
range: Resource
domain: Agent
domain: Resource
domain: SpatialThing

Express feelings
subclass of: Resource
type: Class
subclass of: Thing
label: Expresar un sentimiento @es
comment: Beschrijft de handeling die verricht wordt met een tag wanneer deze gebruikt wordt om een gevoel, emotie, etc. uit te drukken. @nl
comment: Décrit l'action que l'on accomplit avec un tag dès lors que celui-ci est utilisé pour exprimer un sentiment, une émotion, etc. @fr
subclass of: Tag action
label: Exprimer un ressenti @fr
label: Esprimere un sentimento @it
comment: Descrive l'azione che si compie con una tag quando questa è usata per esprimere un sentimento, un'emozione, ecc. @it
comment: Describes the action that is performed with a tag whenever it is used to express a feeling, an emotion, etc.
comment: Describe la acción que se realiza con una etiqueta cuando es usada para expresar un sentimiento, una emoción, etc. @es
label: Gevoelens uitdrukken @nl
subclass of: Item
subclass of: Graph

has container
range: Thing
domain: Thing
type: ObjectProperty
inverse of: container of
comment: The Container to which this Item belongs.
domain: Item
range: Container
type: Property
range: Resource
domain: Resource

Ask
subclass of: Resource
type: Class
subclass of: Thing
label: Porre una domanda @it
comment: Beschrijft de handeling die met de tag verricht wordt als het stellen van een vraag. @nl
comment: Describes the action that is performed with a tag by asking a question.
comment: Descrive l'azione che viene compiuta con una tag quando questa viene usata per porre una domanda. @it
label: Preguntar @es
label: Vraag stellen @nl
label: Poser une question @fr
subclass of: Tag action
comment: Describe la acción que se realiza con una etiqueta cuando se usa para hacer una pregunta. @es
comment: Décrit l'action que l'on accomplit avec un tag dès lors que celui-ci est utilisé pour poser une question. @fr
subclass of: Graph
subclass of: Item

parent of
range: Thing
domain: Thing
type: ObjectProperty
inverse of: has parent
comment: A child Container or Forum that this Container or Forum is a parent of.
domain: Container
range: Container
type: Property
range: Resource
domain: Resource

http://lodlaundromat.org/.well-known/genid/samples/jena///class//0b7a6cec83cd7a6ef81ffd016aefb0e4/f32d8dc45613bef895570d2297255a7b#1
subclass of: Thing
type: Class
subclass of: Resource
type: Restriction
min cardinality: 1
on property: redirects to
subclass of: http://lodlaundromat.org/.well-known/genid/samples/jena///class//0b7a6cec83cd7a6ef81ffd016aefb0e4/7c71b10046805dc486cf71431721ea93#1
equivalent class: http://lodlaundromat.org/.well-known/genid/samples/jena///class//0b7a6cec83cd7a6ef81ffd016aefb0e4/7c71b10046805dc486cf71431721ea93#1

schoolHomepage
range: Thing
domain: Thing
type: Property
type: ObjectProperty
comment: A homepage of a school attended by the person.
domain: Person
range: Document
term status: testing
range: Resource
domain: Agent
domain: Resource
domain: SpatialThing

Organization
subclass of: Agent
subclass of: Resource
subclass of: Thing
type: Class
comment: An organization.
disjoint with: Person
disjoint with: Document
term status: stable

http://lodlaundromat.org/.well-known/genid/samples/jena///class//0b7a6cec83cd7a6ef81ffd016aefb0e4/7c71b10046805dc486cf71431721ea93#4
subclass of: Resource
type: Class
subclass of: Thing
type: Restriction
on property: encoded in
cardinality: 1
subclass of: http://lodlaundromat.org/.well-known/genid/samples/jena///class//0b7a6cec83cd7a6ef81ffd016aefb0e4/f32d8dc45613bef895570d2297255a7b#4
equivalent class: http://lodlaundromat.org/.well-known/genid/samples/jena///class//0b7a6cec83cd7a6ef81ffd016aefb0e4/f32d8dc45613bef895570d2297255a7b#4

is about
range: Thing
domain: Thing
type: ObjectProperty
domain: information resource
range: resource
inverse of: is topic of
type: Property
range: Resource
range: http://lodlaundromat.org/.well-known/genid/samples/jena///class//0b7a6cec83cd7a6ef81ffd016aefb0e4/f32d8dc45613bef895570d2297255a7b#10
range: Tagged resource
range: http://lodlaundromat.org/.well-known/genid/samples/jena///class//0b7a6cec83cd7a6ef81ffd016aefb0e4/7c71b10046805dc486cf71431721ea93#10
domain: resource
domain: Resource
domain: InformationObject
domain: http://lodlaundromat.org/.well-known/genid/samples/jena///class//0b7a6cec83cd7a6ef81ffd016aefb0e4/f32d8dc45613bef895570d2297255a7b#10
domain: Tagged resource
domain: http://lodlaundromat.org/.well-known/genid/samples/jena///class//0b7a6cec83cd7a6ef81ffd016aefb0e4/7c71b10046805dc486cf71431721ea93#10

focus
domain: Thing
type: Property
type: ObjectProperty
comment: The underlying or 'focal' entity associated with some SKOS-described concept.
domain: Concept
range: Thing
term status: testing
range: Resource
domain: Resource

has part
range: Thing
domain: Thing
type: DeprecatedProperty
type: ObjectProperty
inverse of: part of
comment: An resource that is a part of this subject.
version info: This property is deprecated. Use dcterms:hasPart from the Dublin Core ontology instead.
type: Property
range: Resource
domain: Resource

Item
subclass of: Thing
subclass of: Resource
type: Class
comment: An Item is something which can be in a Container.
disjoint with: Container
disjoint with: Role
disjoint with: Space
disjoint with: User Account
disjoint with: Usergroup
disjoint with: User
disjoint with: Community

modifier of
range: Thing
domain: Thing
type: ObjectProperty
inverse of: has modifier
comment: An Item that this UserAccount has modified.
domain: User Account
range: Item
type: Property
range: Resource
domain: Resource
domain: Online Account
domain: User

topic_interest
domain: Thing
type: Property
type: ObjectProperty
comment: A thing of interest to this person.
domain: Agent
range: Thing
term status: testing
range: Resource
domain: Resource

made
domain: Thing
type: Property
type: ObjectProperty
comment: Something that was made by this agent.
domain: Agent
range: Thing
inverse of: maker
term status: stable
range: Resource
domain: Resource

Graph
subclass of: Resource
type: Class
comment: An RDF graph (with intensional semantics).

past project
domain: Thing
type: Property
type: ObjectProperty
comment: A project this person has previously worked on.
domain: Person
range: Thing
term status: testing
range: Resource
domain: Agent
domain: Resource
domain: SpatialThing

group of
range: Thing
domain: Thing
type: DeprecatedProperty
type: ObjectProperty
inverse of: has group
version info: This property has been renamed. Use sioc:usergroup_of instead.
type: Property
range: Resource
domain: Resource

based near
range: Thing
domain: Thing
type: Property
type: ObjectProperty
comment: A location that something is based near, for some broadly human notion of near.
domain: SpatialThing
range: SpatialThing
term status: testing
range: Resource
domain: Resource

primary topic
domain: Thing
domain: Document
type: FunctionalProperty
range: Thing
type: Property
term status: stable
type: ObjectProperty
comment: The primary topic of some page or document.
inverse of: is primary topic of
range: Resource
domain: Resource

Give access rights to
subclass of: Resource
type: Class
subclass of: Thing
comment: Beschrijft de handeling die verricht wordt met een tag wanneer deze gebruikt wordt om vast te stellen aaan wie toegangsrechten tot een bron worden toegekend of ontzegd. @nl
label: Accorder des droits d'accès à @fr
label: Acordar derechos de acceso a @es
comment: Descrive l'azione che si compie con una tag quando questa è usata per definire a chi sono accordati o negati i diritti di accesso a una risorsa. @it
label: Toegangsrechten verlenen aan @nl
comment: Describes the action that is performed with a tag whenever it is used to define to whom access rights to a resource are granted or denied.
label: Accordare diritti di accesso a @it
subclass of: Tag action
comment: Décrit l'action que l'on accomplit avec un tag dès lors que celui-ci est utilisé pour définir les personnes auxquelles sont octroyés des droits d'accès à des ressource en ligne (permission ou refus). @fr
comment: Describe la acción que se realiza con una etiqueta cuando es usada para definir a quien son concedidos o negados derechos de acceso a un recurso.. @es
subclass of: Graph
subclass of: Item

usergroup of
range: Thing
domain: Thing
type: ObjectProperty
inverse of: has usergroup
comment: A Space that the Usergroup has access to.
domain: Usergroup
range: Space
type: Property
range: Resource
domain: Resource

http://lodlaundromat.org/.well-known/genid/samples/jena///class//0b7a6cec83cd7a6ef81ffd016aefb0e4/f32d8dc45613bef895570d2297255a7b#7
type: Class
subclass of: Thing
subclass of: Resource
type: Restriction
on property: is identified by
min cardinality: 1
subclass of: http://lodlaundromat.org/.well-known/genid/samples/jena///class//0b7a6cec83cd7a6ef81ffd016aefb0e4/7c71b10046805dc486cf71431721ea93#7
equivalent class: http://lodlaundromat.org/.well-known/genid/samples/jena///class//0b7a6cec83cd7a6ef81ffd016aefb0e4/7c71b10046805dc486cf71431721ea93#7

is primary topic of
range: Thing
comment: A document that this thing is the primary topic of.
domain: Thing
sub property of: page
type: InverseFunctionalProperty
range: Document
type: Property
term status: stable
inverse of: primary topic
type: ObjectProperty
range: Resource
domain: Resource

web client
subclass of: Thing
subclass of: http://lodlaundromat.org/.well-known/genid/samples/jena///class//0b7a6cec83cd7a6ef81ffd016aefb0e4/f32d8dc45613bef895570d2297255a7b#10
subclass of: http://lodlaundromat.org/.well-known/genid/samples/jena///class//0b7a6cec83cd7a6ef81ffd016aefb0e4/7c71b10046805dc486cf71431721ea93#10
subclass of: Resource
type: Class
subclass of: resource
subclass of: Tagged resource

has group
range: Thing
domain: Thing
type: DeprecatedProperty
type: ObjectProperty
inverse of: group of
version info: This property has been renamed. Use sioc:has_usergroup instead.
type: Property
range: Resource
domain: Resource

reply of
range: Thing
domain: Thing
type: ObjectProperty
inverse of: has reply
sub property of: related to
comment: Links to an Item or Post which this Item or Post is a reply to.
domain: Item
range: Item
type: Property
range: Resource
domain: Resource

Tagged resource
subclass of: http://lodlaundromat.org/.well-known/genid/samples/jena///class//0b7a6cec83cd7a6ef81ffd016aefb0e4/7c71b10046805dc486cf71431721ea93#10
subclass of: Resource
equivalent class: http://lodlaundromat.org/.well-known/genid/samples/jena///class//0b7a6cec83cd7a6ef81ffd016aefb0e4/f32d8dc45613bef895570d2297255a7b#10
type: Class
subclass of: Thing
subclass of: resource
equivalent class: http://lodlaundromat.org/.well-known/genid/samples/jena///class//0b7a6cec83cd7a6ef81ffd016aefb0e4/7c71b10046805dc486cf71431721ea93#10
subclass of: http://lodlaundromat.org/.well-known/genid/samples/jena///class//0b7a6cec83cd7a6ef81ffd016aefb0e4/f32d8dc45613bef895570d2297255a7b#10
comment: Usado para representar el recurso etiquetado. Equivalente a irw:Resource. @es
comment: Wordt gebruikt als representatie van de bron die getagd wordt. @nl
comment: Usato per rappresentare la risorsa taggata. Equivalente di irw:Resource. @it
comment: Used to represent the resource being tagged. Equivalent of irw:Resource.
label: Risorsa taggata @it
comment: Utilisé pour représenter la ressource taguée. Equivalent de irw:Resource. @fr
label: Ressource taguée @fr
equivalent class: resource
label: Getagde bron @nl
label: Recurso etiquetado @es

image
range: Thing
domain: Thing
type: Property
type: ObjectProperty
comment: An image that can be used to represent some thing (ie. those depictions which are particularly representative of something, eg. one's photo on a homepage).
domain: Person
range: Image
sub property of: depiction
term status: testing
range: Resource
range: Document
domain: Resource
domain: Agent
domain: SpatialThing

Project
subclass of: Resource
subclass of: Thing
type: Class
comment: A project (a collective endeavour of some kind).
disjoint with: Person
disjoint with: Document
term status: testing

next version
range: Thing
domain: Thing
type: ObjectProperty
inverse of: previous version
comment: Links to the next revision of this Item or Post.
domain: Item
range: Item
sub property of: later version
type: Property
range: Resource
domain: Resource

has reply
range: Thing
domain: Thing
type: ObjectProperty
inverse of: reply of
sub property of: related to
comment: Points to an Item or Post that is a reply or response to this Item or Post.
domain: Item
range: Item
type: Property
range: Resource
domain: Resource

email
range: Thing
domain: Thing
type: ObjectProperty
comment: An electronic mail address of the UserAccount.
domain: User Account
type: Property
range: Resource
domain: Resource
domain: Online Account
domain: User

encodes
type: InverseFunctionalProperty
range: Thing
domain: Thing
type: ObjectProperty
range: awww representation
domain: media type
inverse of: encoded in
type: Property
range: http://lodlaundromat.org/.well-known/genid/samples/jena///class//0b7a6cec83cd7a6ef81ffd016aefb0e4/f32d8dc45613bef895570d2297255a7b#5
range: Resource
range: non-information resources
range: Annotated resource
range: http://lodlaundromat.org/.well-known/genid/samples/jena///class//0b7a6cec83cd7a6ef81ffd016aefb0e4/f32d8dc45613bef895570d2297255a7b#4
range: resource
range: http://lodlaundromat.org/.well-known/genid/samples/jena///class//0b7a6cec83cd7a6ef81ffd016aefb0e4/f32d8dc45613bef895570d2297255a7b#10
range: http://lodlaundromat.org/.well-known/genid/samples/jena///class//0b7a6cec83cd7a6ef81ffd016aefb0e4/7c71b10046805dc486cf71431721ea93#4
range: Tagged resource
range: http://lodlaundromat.org/.well-known/genid/samples/jena///class//0b7a6cec83cd7a6ef81ffd016aefb0e4/7c71b10046805dc486cf71431721ea93#10
range: http://lodlaundromat.org/.well-known/genid/samples/jena///class//0b7a6cec83cd7a6ef81ffd016aefb0e4/7c71b10046805dc486cf71431721ea93#5
range: physical resource
range: InformationRealization
domain: resource
domain: Resource
domain: http://lodlaundromat.org/.well-known/genid/samples/jena///class//0b7a6cec83cd7a6ef81ffd016aefb0e4/f32d8dc45613bef895570d2297255a7b#10
domain: Tagged resource
domain: http://lodlaundromat.org/.well-known/genid/samples/jena///class//0b7a6cec83cd7a6ef81ffd016aefb0e4/7c71b10046805dc486cf71431721ea93#10

redirects to
range: Thing
domain: Thing
range: http://lodlaundromat.org/.well-known/genid/samples/jena///class//0b7a6cec83cd7a6ef81ffd016aefb0e4/f32d8dc45613bef895570d2297255a7b#13
type: ObjectProperty
domain: uri
range: http://lodlaundromat.org/.well-known/genid/samples/jena///class//0b7a6cec83cd7a6ef81ffd016aefb0e4/7c71b10046805dc486cf71431721ea93#13
sub property of: accesses
comment: Redirections can be used outside the Semantic Web between just normal information resources, their domain and range says nothing about the type of resource. The only important aspect is that the reseource that is the destination of the redirection must be associated with a WebRepresentation, hence it must be a WebResource. This property can be used as top property for expressing special types of redirections e.g. TAG's 303 redirection or hash convention.
type: Property
range: resource
range: Resource
range: Tagged resource
range: http://lodlaundromat.org/.well-known/genid/samples/jena///class//0b7a6cec83cd7a6ef81ffd016aefb0e4/f32d8dc45613bef895570d2297255a7b#10
range: http://lodlaundromat.org/.well-known/genid/samples/jena///class//0b7a6cec83cd7a6ef81ffd016aefb0e4/7c71b10046805dc486cf71431721ea93#10
domain: Resource
domain: http://lodlaundromat.org/.well-known/genid/samples/jena///class//0b7a6cec83cd7a6ef81ffd016aefb0e4/7c71b10046805dc486cf71431721ea93#10
domain: http://lodlaundromat.org/.well-known/genid/samples/jena///class//0b7a6cec83cd7a6ef81ffd016aefb0e4/f32d8dc45613bef895570d2297255a7b#10
domain: http://lodlaundromat.org/.well-known/genid/samples/jena///class//0b7a6cec83cd7a6ef81ffd016aefb0e4/f32d8dc45613bef895570d2297255a7b#2
domain: http://lodlaundromat.org/.well-known/genid/samples/jena///class//0b7a6cec83cd7a6ef81ffd016aefb0e4/f32d8dc45613bef895570d2297255a7b#3
domain: http://lodlaundromat.org/.well-known/genid/samples/jena///class//0b7a6cec83cd7a6ef81ffd016aefb0e4/7c71b10046805dc486cf71431721ea93#2
domain: http://lodlaundromat.org/.well-known/genid/samples/jena///class//0b7a6cec83cd7a6ef81ffd016aefb0e4/7c71b10046805dc486cf71431721ea93#3
domain: resource
domain: Tagged resource
range: http://lodlaundromat.org/.well-known/genid/samples/jena///class//0b7a6cec83cd7a6ef81ffd016aefb0e4/f32d8dc45613bef895570d2297255a7b#2
range: http://lodlaundromat.org/.well-known/genid/samples/jena///class//0b7a6cec83cd7a6ef81ffd016aefb0e4/7c71b10046805dc486cf71431721ea93#2
range: http://lodlaundromat.org/.well-known/genid/samples/jena///class//0b7a6cec83cd7a6ef81ffd016aefb0e4/f32d8dc45613bef895570d2297255a7b#3
range: uri
range: http://lodlaundromat.org/.well-known/genid/samples/jena///class//0b7a6cec83cd7a6ef81ffd016aefb0e4/7c71b10046805dc486cf71431721ea93#3
range: http://lodlaundromat.org/.well-known/genid/samples/jena///class//0b7a6cec83cd7a6ef81ffd016aefb0e4/f32d8dc45613bef895570d2297255a7b#16
range: http://lodlaundromat.org/.well-known/genid/samples/jena///class//0b7a6cec83cd7a6ef81ffd016aefb0e4/7c71b10046805dc486cf71431721ea93#16

has usergroup
range: Thing
domain: Thing
type: ObjectProperty
inverse of: usergroup of
comment: Points to a Usergroup that has certain access to this Space.
domain: Space
range: Usergroup
type: Property
range: Resource
domain: Resource

Online Gaming Account
subclass of: Resource
subclass of: Thing
type: Class
comment: An online gaming account.
subclass of: Online Account
term status: unstable

Document
subclass of: Resource
subclass of: Thing
type: Class
comment: A document.
disjoint with: Organization
disjoint with: Project
term status: testing

previous version
range: Thing
domain: Thing
type: ObjectProperty
inverse of: next version
comment: Links to the previous revision of this Item or Post.
domain: Item
range: Item
sub property of: earlier version
type: Property
range: Resource
domain: Resource

Space
subclass of: Thing
subclass of: Resource
type: Class
comment: A Space is a place where data resides, e.g. on a website, desktop, fileshare, etc.
disjoint with: Item
disjoint with: Role
disjoint with: User Account
disjoint with: Usergroup
disjoint with: User

avatar
range: Thing
domain: Thing
type: ObjectProperty
comment: An image or depiction used to represent this UserAccount.
domain: User Account
sub property of: depiction
type: Property
range: Image
range: Resource
range: Document
domain: Resource
domain: Online Account
domain: User

tipjar
range: Thing
domain: Thing
type: Property
type: ObjectProperty
comment: A tipjar document for this agent, describing means for payment and reward.
domain: Agent
range: Document
sub property of: page
term status: testing
range: Resource
domain: Resource

http://lodlaundromat.org/.well-known/genid/samples/jena///class//0b7a6cec83cd7a6ef81ffd016aefb0e4/f32d8dc45613bef895570d2297255a7b#2
subclass of: Thing
type: Class
subclass of: Resource
type: Restriction
cardinality: 1
on property: has URI string value
subclass of: http://lodlaundromat.org/.well-known/genid/samples/jena///class//0b7a6cec83cd7a6ef81ffd016aefb0e4/7c71b10046805dc486cf71431721ea93#2
equivalent class: http://lodlaundromat.org/.well-known/genid/samples/jena///class//0b7a6cec83cd7a6ef81ffd016aefb0e4/7c71b10046805dc486cf71431721ea93#2

host of
range: Thing
domain: Thing
type: ObjectProperty
inverse of: has host
comment: A Forum that is hosted on this Site.
domain: Site
range: Forum
type: Property
range: Resource
range: Container
domain: Resource
domain: Space

requests
range: Thing
domain: Thing
type: ObjectProperty
range: uri
inverse of: accesses
domain: resource
type: TransitiveProperty
type: Property
range: http://lodlaundromat.org/.well-known/genid/samples/jena///class//0b7a6cec83cd7a6ef81ffd016aefb0e4/f32d8dc45613bef895570d2297255a7b#10
range: http://lodlaundromat.org/.well-known/genid/samples/jena///class//0b7a6cec83cd7a6ef81ffd016aefb0e4/f32d8dc45613bef895570d2297255a7b#2
range: resource
range: Resource
range: http://lodlaundromat.org/.well-known/genid/samples/jena///class//0b7a6cec83cd7a6ef81ffd016aefb0e4/7c71b10046805dc486cf71431721ea93#2
range: Tagged resource
range: http://lodlaundromat.org/.well-known/genid/samples/jena///class//0b7a6cec83cd7a6ef81ffd016aefb0e4/f32d8dc45613bef895570d2297255a7b#3
range: http://lodlaundromat.org/.well-known/genid/samples/jena///class//0b7a6cec83cd7a6ef81ffd016aefb0e4/7c71b10046805dc486cf71431721ea93#10
range: http://lodlaundromat.org/.well-known/genid/samples/jena///class//0b7a6cec83cd7a6ef81ffd016aefb0e4/7c71b10046805dc486cf71431721ea93#3
domain: Resource
domain: http://lodlaundromat.org/.well-known/genid/samples/jena///class//0b7a6cec83cd7a6ef81ffd016aefb0e4/f32d8dc45613bef895570d2297255a7b#10
domain: Tagged resource
domain: http://lodlaundromat.org/.well-known/genid/samples/jena///class//0b7a6cec83cd7a6ef81ffd016aefb0e4/7c71b10046805dc486cf71431721ea93#10

publications
range: Thing
domain: Thing
type: Property
type: ObjectProperty
comment: A link to the publications of this person.
domain: Person
range: Document
term status: testing
range: Resource
domain: Agent
domain: Resource
domain: SpatialThing

links to
range: Thing
domain: Thing
type: ObjectProperty
comment: Links extracted from hyperlinks within a SIOC concept, e.g. Post or Site.
sub property of: references
type: Property
range: Resource
domain: Resource

addressed to
range: Thing
domain: Thing
type: ObjectProperty
comment: Refers to who (e.g. a UserAccount, e-mail address, etc.) a particular Item is addressed to.
domain: Item
type: Property
range: Resource
domain: Resource

about
range: Thing
domain: Thing
type: ObjectProperty
comment: Specifies that this Item is about a particular resource, e.g. a Post describing a book, hotel, etc.
domain: Item
type: Property
range: Resource
domain: Resource

Web concept tag action
subclass of: Resource
type: Class
subclass of: Thing
label: Acción de etiquetado con Web concept @es
label: Azione di tagging con Web concept @it
subclass of: Tag action
label: Taghandeling met webconcept @nl
comment: Usata per descrivere un'azioni di tagging effettuata con l'aiuto di un concetto Web (per esempio geonames). @it
comment: Wordt gebruikt om taghandelingen te beschrijven waarbij gebruikt gemaakt woord van webconcepten (zoals geonames). @nl
comment: Usada para describir una acción de etiquetado realizada con la ayuda de un concepto Web (por ejemplo geonames). @es
comment: Utilisé pour décrire un taggage effectué à l'aide de concepts Web (tels que geonames). @fr
label: Acte de taguer par concept Web @fr
comment: Describes tagging involving Web concepts (such as geonames).
subclass of: Item
subclass of: Graph

User
subclass of: User Account
disjoint with: Role
disjoint with: Usergroup
disjoint with: Container
disjoint with: Item
equivalent class: User Account
version info: This class is deprecated. Use sioc:UserAccount from the SIOC ontology instead.
disjoint with: Space
subclass of: Online Account
type: DeprecatedClass
comment: UserAccount is now preferred. This is a deprecated class for a User in an online community site.
type: Class

has host
range: Thing
domain: Thing
type: ObjectProperty
inverse of: host of
comment: The Site that hosts this Forum.
domain: Forum
range: Site
type: Property
range: Resource
range: Space
domain: Resource
domain: Container

has moderator
range: Thing
domain: Thing
inverse of: moderator of
type: ObjectProperty
comment: A UserAccount that is a moderator of this Forum.
domain: Forum
range: User Account
type: Property
range: Resource
range: Online Account
range: User
domain: Resource
domain: Container

depiction
range: Thing
type: Property
type: ObjectProperty
comment: A depiction of some thing.
domain: Thing
range: Image
inverse of: depicts
term status: testing
range: Resource
range: Document
domain: Resource

semantic web uri
type: Class
subclass of: Resource
subclass of: Thing
subclass of: http://lodlaundromat.org/.well-known/genid/samples/jena///class//0b7a6cec83cd7a6ef81ffd016aefb0e4/f32d8dc45613bef895570d2297255a7b#1
subclass of: http://lodlaundromat.org/.well-known/genid/samples/jena///class//0b7a6cec83cd7a6ef81ffd016aefb0e4/7c71b10046805dc486cf71431721ea93#1
comment: The subset of URI that identify typically analog things. In general they identify any resource but are not directly resolvable. They do not identify an accessible information resource.They act as a virtual delegate for exactly one resource, typically analog. They cause a re-direct or any other type of mechanism that makes the web server resolve another URI that is associated with a WebReource (see range of redirectTo)
subclass of: uri
subclass of: http://lodlaundromat.org/.well-known/genid/samples/jena///class//0b7a6cec83cd7a6ef81ffd016aefb0e4/7c71b10046805dc486cf71431721ea93#3
subclass of: http://lodlaundromat.org/.well-known/genid/samples/jena///class//0b7a6cec83cd7a6ef81ffd016aefb0e4/f32d8dc45613bef895570d2297255a7b#3
subclass of: http://lodlaundromat.org/.well-known/genid/samples/jena///class//0b7a6cec83cd7a6ef81ffd016aefb0e4/7c71b10046805dc486cf71431721ea93#2
subclass of: http://lodlaundromat.org/.well-known/genid/samples/jena///class//0b7a6cec83cd7a6ef81ffd016aefb0e4/f32d8dc45613bef895570d2297255a7b#2
subclass of: http://lodlaundromat.org/.well-known/genid/samples/jena///class//0b7a6cec83cd7a6ef81ffd016aefb0e4/7c71b10046805dc486cf71431721ea93#10
subclass of: http://lodlaundromat.org/.well-known/genid/samples/jena///class//0b7a6cec83cd7a6ef81ffd016aefb0e4/f32d8dc45613bef895570d2297255a7b#10
subclass of: Tagged resource
subclass of: resource

Aggregate
subclass of: Resource
type: Class
subclass of: Thing
label: Verzamelen @nl
comment: Descrive l'azione che viene compiuta quando delle risorse sono aggregate attorno a una tag definita collettivamente. @it
comment: Describes the action that is performed whenever resources are aggregated with a collectively defined tag.
comment: Décrit l'action que l'on accomplit lorsque des ressources sont aggrégées autour d'un tag défini de manière collective. @fr
comment: Beschrijft de handeling die verricht wordt wanneer bronnen worden bijeenverzameld onder een gezamenlijk gedefinieerde tag. @nl
label: Agréger @fr
label: Aggregare @it
comment: Describe la acción que se realiza cuando se agregan unos recursos alrededor de una etiqueta definita colectivamente. @es
label: Agregar @es
subclass of: Tag action
subclass of: Graph
subclass of: Item

Agent
subclass of: Thing
subclass of: Resource
subclass of: Agent
type: Class
comment: An agent (eg. person, group, software or physical artifact).
equivalent class: Agent
term status: stable

Community tag collection
subclass of: Resource
type: Class
subclass of: Thing
subclass of: Tag collection
comment: Una colección de etiquetas generada por los usuarios de una comunidad en linea o de un servicio Web dados. @es
label: Colección de etiquetas comunitaria @es
comment: Une collection de tag constituée par les utilisateurs d'une communauté ou d'un service donnés. @fr
label: Collection de tags communautaire @fr
label: Collezione di tag comunitaria @it
comment: Una collezione di tag generata dagli utenti di una comunità online o di un servizio Web dati. @it
comment: Een verzameling tags die gegenereerd is door een groep gebruikers van een gemeenschap of digitale dienst. @nl
label: Gemeenschapstagverzameling @nl
comment: A collection of tags generated by the users of a given online community or Web service.

has parent
range: Thing
domain: Thing
type: ObjectProperty
inverse of: parent of
comment: A Container or Forum that this Container or Forum is a child of.
domain: Container
range: Container
type: Property
range: Resource
domain: Resource

Syntactic Tag Action
subclass of: Resource
type: Class
subclass of: Thing
label: Acción de etiquetado sintáctica @es
subclass of: Tag action
label: Azione di tagging sintattica @it
comment: Describes tags whose labels are following a given syntax for improved precision and tractability.
comment: Describe etiquetas cuyo texto sigue una sintaxis determinada para una mayor precisión y tratabilidad. @es
comment: Décrit des tags dont les libellés mobilisent une certaine syntaxe pour accroître leur précision et leur capacité à être manipulés. @fr
label: Acte de taguer syntaxique @fr
label: Syntactische taghandeling @nl
comment: Descrive delle tag il cui testo segue una sintassi determinata per ottenere maggiore precisione e trattabilità. @it
comment: Beschrijft tags waarvan de labels van een bepaalde syntaxis gebruik maken om de precisie en manipuleerbaarheid te vergroten. @nl
subclass of: Item
subclass of: Graph

latest version
range: Thing
domain: Thing
type: ObjectProperty
comment: Links to the latest revision of this Item or Post.
domain: Item
range: Item
type: Property
range: Resource
domain: Resource

physical resource
subclass of: Resource
type: Class
subclass of: Thing
comment: Something that occupies its own space and has its own mass in the real world, and can have a "virtual delegate" on the Web. For example physical people, artifacts, places, bodies, chimical substances, biological entities, etc.
disjoint with: abstract resource
subclass of: non-information resources
disjoint with: conceptual resource
subclass of: http://lodlaundromat.org/.well-known/genid/samples/jena///class//0b7a6cec83cd7a6ef81ffd016aefb0e4/f32d8dc45613bef895570d2297255a7b#5
subclass of: http://lodlaundromat.org/.well-known/genid/samples/jena///class//0b7a6cec83cd7a6ef81ffd016aefb0e4/7c71b10046805dc486cf71431721ea93#5
subclass of: http://lodlaundromat.org/.well-known/genid/samples/jena///class//0b7a6cec83cd7a6ef81ffd016aefb0e4/f32d8dc45613bef895570d2297255a7b#10
subclass of: resource
subclass of: http://lodlaundromat.org/.well-known/genid/samples/jena///class//0b7a6cec83cd7a6ef81ffd016aefb0e4/7c71b10046805dc486cf71431721ea93#10
subclass of: Tagged resource

thumbnail
range: Thing
domain: Thing
type: Property
type: ObjectProperty
comment: A derived thumbnail image.
domain: Image
range: Image
term status: testing
range: Resource
range: Document
domain: Resource
domain: Document

Is related to
label: Está relacionado con @es
comment: Wordt gebruikt om een bron met een teken te verbinden. Dit teken kan om het even welk type zijn zolang de representatie toegankelijk is via een URI over HTTP. NiceTag definieert tags door een eigenschap die twee bronnen verbindt. Toch kunnen veel van de onderscheiden die te vinden zijn in de IRW ontologie gebruikt worden om een meer precies beeld te krijgen van nt:TaggedResource (in het bijzonder de klasse irw:Resource). @nl
label: È connesso con @it
comment: Usato per associare una risorsa a un segno che può essere, di per sè, di qualsiasi tipo, purchè la sua rappresentazione, identificata da un URI, sia accessibile tramite il protocollo HTTP. NiceTag definisce le tag per mezzo di una proprietà che associa due risorse; l'ontologia IRW permette di comprendere più precisamente il significato di nt:TaggedResource (in particolare la classe irw:Resource). @it
label: Est relié à @fr
comment: Used to link a resource to a sign, which can itself, be of any type, provided its representation is HTTP accessible from a URI. NiceTag defines tags by means of a mere property linking two Resources; this said, the many distinctions found in IRW ontology give a more precise account of nt:TaggedResource (see in particular irw:Resource).
type: Property
comment: Utilisé pour lier une ressource à un signe qui, lui-même, peut être de n'importe quel type pourvu que sa représentation, identifiée par une URI, soit accessible via le protocole HTTP. NiceTag définit les tags au moyen d'une propriété qui relie deux Resource; toutefois, l'ontologie IRW permet de comprendre plus précisément la signification de nt:TaggedResource (en particulier la classe irw:Resource). @fr
comment: Usado para asociar un recurso a un signo que puede ser, en sí mismo, de qualquier tipo, con tal que su representación, identificada por un URI, sea accesible mediante el protocolo HTTP. NiceTag define las etiquetas por medio de una propiedad que asocia dos recursos; la ontologia IRW permite comprender con mas claridad el significaso de nt:taggedResources(en especiàl la clase irw:Resource). @es
label: Houdt verband met @nl

id
type: DatatypeProperty
comment: An identifier of a SIOC concept instance. For example, a user ID. Must be unique for instances of each type of SIOC concept within the same site.
range: Literal
type: Property
range: Resource

age
type: Property
type: FunctionalProperty
type: DatatypeProperty
comment: The age in years of some agent.
domain: Agent
range: Literal
term status: unstable
range: Resource
domain: Resource
domain: Thing

Surname
type: Property
type: DatatypeProperty
comment: The surname of some person.
domain: Person
range: Literal
term status: archaic
range: Resource
domain: Agent
domain: Resource
domain: Thing
domain: SpatialThing

Makes me feel
comment: Propriété utilisée pour indiquer que le libellé d'un tag dénote/exprime une réaction émotionnelle. @fr
comment: Property used to indicate that the label of a tag denotes/expresses an emotional reaction.
sub property of: Is related to
label: Mi suscita @it
comment: Propriedad usada para indicar que el contenido de una etiqueta denota/expresa una reacción emocional. @es
label: Maakt dat ik me voel @nl
label: Me provoca @es
comment: Proprietà usata per indicare che il contenuto di una tag denota/esprime una reazione emotiva. @it
comment: Eigenschap die gebruikt wordt om aan te geven dat het label van een tag een emotionele reactie weergeeft of uitdrukt. @nl
type: Property
label: Produit sur moi @fr

SIOC Core Ontology Specification

geekcode
type: Property
type: DatatypeProperty
comment: A textual geekcode for this person, see http://www.geekcode.com/geek.html
domain: Person
range: Literal
term status: archaic
range: Resource
domain: Agent
domain: Resource
domain: Thing
domain: SpatialThing

first name
type: DeprecatedProperty
type: DatatypeProperty
comment: First (real) name of this User. Synonyms include given name or christian name.
domain: User Account
range: Literal
version info: This property is deprecated. Use foaf:name or foaf:firstName from the FOAF vocabulary instead.
type: Property
range: Resource
domain: Resource
domain: Thing
domain: Online Account
domain: User

Has for medium
comment: Proprietà usata quando il contenuto di una tag indica il medium a cui appartiene la rappresentazione Web della risorsa a cui si accede ("forum", "vidéo", "photo", "pagina Web", "Webservice", etc.). @it
label: Est un medium de type @fr
label: È un medium di tipo @it
domain: WebRepresentation
comment: Propriété utilisée quand le libellé d'un tag indique de quel média la représentation de la ressource à laquelle on accède ressortit ("forum", "vidéo", "photo", "page Web", "Webservice", etc.). @fr
sub property of: Is related to
type: Property
label: Es un medium de tipo @es
comment: Property used when the label of a tag indicates the medium which an HTTP-accessible Web representation belongs to ("forum", "video", "photo", "Webpage", "Webservice", etc.).
label: Is het medium @nl
comment: Propriedad usada cuando el contenido de una etiqueta indica el medium al que pertenece la representación Web del recurso al cual se accede ("forum", "video", "foto", "página Web", "Webservice", etc.). @es
comment: Eigenschap die gebruikt wordt wanneer het label van een tag aangeeft tot welk medium een via het web toegankelijke representatie behoort ("forum", "video", "foto", "webpagina", "webdienst", etc.) @nl
domain: Resource

content encoded
type: DeprecatedProperty
type: DatatypeProperty
comment: The encoded content of the Post, contained in CDATA areas.
domain: Post
range: Literal
version info: This property is deprecated. Use content:encoded from the RSS 1.0 content module instead.
type: Property
range: Resource
domain: Resource
domain: Thing
domain: Document
domain: Item

SIOC Core Ontology Namespace
type: Ontology
type: Thing
version info: Revision: 1.35
description: SIOC (Semantically-Interlinked Online Communities) is an ontology for describing the information in online communities. This information can be used to export information from online communities and to link them together. The scope of the application areas that SIOC can be used for includes (and is not limited to) weblogs, message boards, mailing lists and chat channels.

Elicits action
comment: Propriété utilisée quand une ressource suscite l'accomplissement d'une action. @fr
sub property of: Is related to
label: Suscita l'azione @it
type: Property
comment: Propriedad usada cuando un recurso suscita la realización de una acción. @es
comment: Property used when a resource elicits an action to be performed.
label: Ontlokt de handeling @nl
label: Suscita la acción @es
comment: Proprietà usata quando una risorsa suscita lo svolgimento di un'azione. @it
comment: Eigenschap die gebruikt wordt wanneer een bron aanzet tot het verrichten van een handeling. @nl
label: Suscite l'action @fr

MSN chat ID
sub property of: nickname
type: InverseFunctionalProperty
comment: An MSN chat ID
domain: Agent
type: DatatypeProperty
term status: testing
type: Property
range: Literal
type: ObjectProperty
range: Resource
domain: Resource
domain: Thing

Yahoo chat ID
domain: Agent
term status: testing
range: Literal
comment: A Yahoo chat ID
type: DatatypeProperty
sub property of: nickname
type: Property
type: InverseFunctionalProperty
type: ObjectProperty
range: Resource
domain: Resource
domain: Thing

email sha1
type: DatatypeProperty
comment: An electronic mail address of the UserAccount, encoded using SHA1.
domain: User Account
range: Literal
type: Property
range: Resource
domain: Resource
domain: Thing
domain: Online Account
domain: User

last activity date
type: DatatypeProperty
comment: The date and time of the last activity associated with a SIOC concept instance, and expressed in ISO 8601 format. This could be due to a reply Post or Comment, a modification to an Item, etc.
range: Literal
sub property of: date
type: Property
range: Resource

modified at
type: DeprecatedProperty
type: DatatypeProperty
comment: When this was modified, in ISO 8601 format.
domain: Post
range: Literal
version info: This property is deprecated. Use dcterms:modified from the Dublin Core ontology instead.
type: Property
range: Resource
domain: Resource
domain: Thing
domain: Document
domain: Item

Given name
type: Property
type: DatatypeProperty
comment: The given name of some person.
term status: testing

funded by
type: Property
type: ObjectProperty
comment: An organization funding a project or person.
domain: Thing
range: Thing
term status: archaic
range: Resource
domain: Resource

account name
type: Property
type: DatatypeProperty
comment: Indicates the name (identifier) associated with this online account.
domain: Online Account
range: Literal
term status: testing
range: Resource
domain: Resource
domain: Thing

Is about
comment: Property used when the label of a tag describes the topic of a resource.
label: A pour thème @fr
label: Ha come tema @it
comment: Eigenschap die gebruikt wordt wanneer het label van een tag het thema van een bron beschrijft. @nl
type: Property
sub property of: Is related to
label: Tiene como tema @es
label: Betreft @nl
comment: Proprietà usata quando il contenuto di una tag descrive il tema di una risorsa. @it
comment: Propriété utilisé pour indiquer que le libellé d'un tag décrit le thème d'une ressource. @fr
comment: Propriedad usada cuando el contenido de una etiqueta describe el tema de un recurso. @es

later version
type: TransitiveProperty
comment: Links to a later (newer) revision of this Item or Post.
domain: Item
range: Item
inverse of: earlier version
type: Property
type: ObjectProperty
range: Resource
range: Thing
domain: Resource
domain: Thing

subgraph of
type: Property
comment: The graph associated with the subject is a subgraph of a graph equivalent to that associated with the object.
domain: Graph
range: Graph
range: Resource
domain: Resource

status
type: Property
type: DatatypeProperty
comment: A string expressing what the user is happy for the general public (normally) to know about their current activity.
domain: Agent
range: Literal
term status: unstable
range: Resource
domain: Resource
domain: Thing

DNA checksum
type: Property
type: DatatypeProperty
comment: A checksum for the DNA of some thing. Joke.
range: Literal
term status: archaic
range: Resource

num authors
type: DatatypeProperty
comment: The number of unique authors (UserAccounts and unregistered posters) who have contributed to this Item, Thread, Post, etc.
range: nonNegativeInteger
type: Property
range: decimal
range: Resource
range: integer

content
type: DatatypeProperty
comment: The content of the Item in plain text format.
domain: Item
range: Literal
type: Property
range: Resource
domain: Resource
domain: Thing

Has personal sign
comment: Corresponde al uso de etiquetas definidas por el usuario, que pueden servir para recoger, categorizar o distinguir etiquetas, o para estructurar su propria colección de etiquetas @es
type: Property
comment: Correspond à l'emploi de libellés définis par un utilisateur pour rassembler, catégoriser ou distinguer des ressources voire simplement structurer sa propre collection de tags. @fr
label: Heeft een persoonlijk teken @nl
comment: Corresponds to uses of user-defined labels that can either serve to gather, categorize, distinguish resources or simply add structure to one's collection of tags.
label: Ha segno personale @it
comment: Corrisponde all'uso di tag definite dall'utente che possono servire per raccogliere, categorizzare o distinguere risorse, oppure semplicemente per strutturare la propria collezione di tag. @it
comment: Komt overeen met het gebruik van persoonlijk gedefinieerde labels die tot doel hebben bronnen te verzamelen, categoriseren en onderscheiden, of die simpelweg een verzameling tags structureren. @nl
sub property of: Is related to
label: Tiene signo personal @es
label: A pour signe personnel @fr

subject
type: DeprecatedProperty
type: DatatypeProperty
comment: Keyword(s) describing subject of the Post.
domain: Post
range: Literal
version info: This property is deprecated. Use dcterms:subject from the Dublin Core ontology for text keywords and sioc:topic if the subject can be represented by a URI instead.
type: Property
range: Resource
domain: Resource
domain: Thing
domain: Document
domain: Item

Is relevant to something
comment: Subproperty of 'is relevant to', used to link a resource to anything that it may be relevant to. In other words, in such a way that no immediate formal link can be inferrend between the two except from the point of view of the creator of the said link.
comment: Sotto-proprietà di 'isRelevantTo' usata per associare una risorsa a qualsiasi cosa che possa essere pertinente, in modo che nessun collegamento formale immediato possa essere inferito fra i due, eccetto dal punto di vista del creatore di tale collegamento. @it
label: Es pertinente para algo @es
label: Is relevant met betrekking tot iets @nl
comment: Deeleigenschap van ‘isRelevantTo’, gebruikt om een verband te leggen tussen de bron en iets anders, waarbij geen formeel verband is vast te stellen behalve vanuit het gezichtspunt van degene die dit verband legt. @nl
sub property of: isRelevantTo
type: Property
comment: Sous-propriété de "isRelevantTo', utilisée pour lier quoi que ce soit à une ressource de telle manière qu'aucun lien immédiat formel ne puisse être inféré entre les deux excepté du point de vue du créateur d'un tel lien. @fr
label: Est pertinent par rapport à quelque chose @fr
label: È pertinente a qualcosa @it
comment: Sub-propriedad de 'isRelevantTo' usada para asociar un recurso a qualquier cosa para la que pueda ser pertinente, de manera que ningun enlace formal inmediato pueda ser inferido entre los dos, excepto desde el punto de vista del creador de esa asociación. @es

Can be read by
comment: Eigenschap die gebruikt wordt wanneer het label van een tag aangeeft aan wie toegangsrechten tot de getagde bron worden toegekend. @nl
type: Property
domain: WebRepresentation
range: Person
label: Puede ser leído por @es
comment: Property used when the label of a tag indicates to whom access rights to the tagged resource are conferred.
label: Può essere letto da @it
sub property of: Is related to
comment: Corresponde al uso de etiquetas cuyo contenido indica el destinatario al cual vienen conferidos derechos de acceso a un recurso. @es
comment: Corrisponde all'uso di tag il cui contenuto indica il destinatario a cui vengono conferiti diritti di accesso a una risorsa. @it
label: Kan gelezen worden door @nl
label: Peut être lu par @fr
comment: Corresponds à l'utilisation de tags dont le libellé indique le destinataire auquel des droits d'accès définis sur une ressource donnée ont été octroyés. @fr
range: Agent
range: Resource
range: Thing
range: SpatialThing
domain: Resource

sha1sum (hex)
type: Property
type: DatatypeProperty
comment: A sha1sum hash, in hex.
domain: Document
term status: unstable
domain: Resource
domain: Thing

Raises question about
sub property of: Is related to
comment: Propriedad usada cuando el contenido de una etiqueta indica que se esta planteando una pregunta. @es
label: Plantea una cuestión sobre @es
comment: Propriété utilisée quand le libellé d'un tag indique qu'une question est posée. @fr
comment: Eigenschap die gebruikt wordt wanneer het label van een tag aangeeft dat een vraag gesteld wordt. @nl
label: Roept vragen op over @nl
comment: Proprietà usata quando il contenuto di una tag indica che si sta ponendo una domanda. @it
label: Solleva una domanda su @it
label: Soulève une interrogation au sujet de @fr
type: Property
comment: Property used when the label of a tag indicates that a question is being asked.

myersBriggs
type: Property
type: DatatypeProperty
comment: A Myers Briggs (MBTI) personality classification.
domain: Person
range: Literal
term status: testing
range: Resource
domain: Agent
domain: Resource
domain: Thing
domain: SpatialThing

logo
type: Property
type: ObjectProperty
type: InverseFunctionalProperty
comment: A logo representing some thing.
domain: Thing
range: Thing
term status: testing
range: Resource
domain: Resource

Cannot be read by
label: Kan niet gelezen worden door @nl
comment: Proprietà usata quando il contenuto di una tag indica il destinatario a cui sono negati diritti di accesso a una risorsa. @it
domain: WebRepresentation
label: Non può essere letto da @it
sub property of: Is related to
comment: Eigenschap die gebruikt wordt wanneer het label van een tag aangeeft aan wie de toegangsrechten tot de getagde bron worden ontzegd. @nl
comment: Propriété utilisée quand le libellé d'un tag indique le destinataire auquel des droits d'accès définis sur une ressource donnée ont été déniés. @fr
range: Person
label: No puede ser leído por @es
comment: Property used when the label of a tag indicates to whom access right to the tagged resource are denied.
type: Property
comment: Propriedad usada cuando el contenido de una etiqueta indica el destinatario al cual se han negado derechos de acceso a un recurso. @es
label: Ne peut être lu par @fr
range: Agent
range: Resource
range: Thing
range: SpatialThing
domain: Resource

description
type: DeprecatedProperty
type: DatatypeProperty
comment: The content of the Post.
domain: Post
range: Literal
version info: This property is deprecated. Use sioc:content or other methods (AtomOwl, content:encoded from RSS 1.0, etc.) instead.
type: Property
range: Resource
domain: Resource
domain: Thing
domain: Document
domain: Item

ICQ chat ID
sub property of: nickname
term status: testing
domain: Agent
range: Literal
comment: An ICQ chat ID
type: InverseFunctionalProperty
type: Property
type: DatatypeProperty
type: ObjectProperty
range: Resource
domain: Resource
domain: Thing

name
type: Property
type: DatatypeProperty
comment: A name for some thing.
domain: Thing
range: Literal
sub property of: label
term status: testing
range: Resource
domain: Resource

family_name
type: Property
type: DatatypeProperty
comment: The family name of some person.
domain: Person
range: Literal
term status: archaic
range: Resource
domain: Agent
domain: Resource
domain: Thing
domain: SpatialThing

earlier version
type: TransitiveProperty
comment: Links to a previous (older) revision of this Item or Post.
domain: Item
range: Item
inverse of: later version
type: Property
type: ObjectProperty
range: Resource
range: Thing
domain: Resource
domain: Thing

Is relevant to somebody
label: Est pertinent pour quelqu'un @fr
type: Property
comment: Subproperty of 'is relevant to' used to link a resource to the person whom it may be relevant to. In other words, in such a way that no immediate formal link can be inferred between the two except from the point of view of a precise person in addition to the user who defined the said link.
comment: Sub-propriedad de 'isRelevantTo' usada para asociar un recurso a la persona para la que puede ser pertinente, de manera que ningun enlace formal inmediato pueda ser inferido entre los dos, excepto desde el punto de vista del creador de esa asociación. @es
sub property of: isRelevantTo
range: Person
label: Es pertinente para alguien @es
comment: Sous-propriété de 'isRelevantTo', utilisée pour associer une ressource à une personne de telle manière qu'aucun lien formel ne puisse être inféré entre les deux excepté du point de vue du destinataire et du destinateur du tag. @fr
label: È pertinente a qualcuno @it
comment: Deeleigenschap van ‘isRelevantTo’, gebruikt om een verband tot stand te brengen tussen een bron en de persoon waar het betrekking tot kan hebben. In een zodanige vorm dat er geen onmiddelijke formele relatie tussen de twee afgeleid kan worden behalve vanuit het gezichtspunt van een specifiek persoon en de gebruiker die dit verband gelegd heeft. @nl
comment: Sotto-proprietà di 'isRelevantTo' usata per associare una risorsa alla persona a cui può essere pertinente, in modo tale che nessun collegamento formale immediato possa essere inferito fra i due, eccetto dal punto di vista del creatore di tale collegamento @it
label: Is relevant voor iemand @nl
range: Agent
range: Resource
range: Thing
range: SpatialThing

num views
type: DatatypeProperty
comment: The number of times this Item, Thread, UserAccount profile, etc. has been viewed.
range: nonNegativeInteger
type: Property
range: decimal
range: Resource
range: integer

Has part
comment: Proprietà usata quando il contenuto di una tag indica quale parte della rappresentazione di una risorsa su Web è taggata. @it
label: A pour partie @fr
comment: Property used when the label of a tag indicates which part of a Web representation is being tagged.
sub property of: Is related to
type: Property
label: Ha come parte @it
comment: Propriété utilisée quand le libellé d'un tag indique quelle partie de la représentation d'une ressource sur le Web est taguée. @fr
range: Part Of Web representation
label: Heeft als deel @nl
comment: Propriedad usada cuando el contenido de una etiqueta indica que parte de la representación de un recurso en la Web ha sido etiquetada. @es
label: Tiene como parte @es
comment: Eigenschap die gebruikt wordt wanneer het label van een tag aangeeft welk gedeelte van een web-representatie getagd wordt. @nl
domain: WebRepresentation
range: Thing
range: Resource
range: WebRepresentation
domain: Resource

num replies
type: DatatypeProperty
comment: The number of replies that this Item, Thread, Post, etc. has. Useful for when the reply structure is absent.
range: nonNegativeInteger
type: Property
range: decimal
range: Resource
range: integer

The Identity of Resources on the Web ontology (IRW).
type: Ontology
imports: informationrealization.owl
version info: Created by Valentina Presutti with support from Harry Halpin and Aldo Gangemi
comment: This ontology is an evolution of IRE ontology. It describes identification of resources on the Web, through the definition of relationships between resources and their representations on the Web. The requirement is to describe what can be identified by URIs and how this is handled e.g. in form of HTTP requests and reponds.

sibling
type: SymmetricProperty
comment: An Item may have a sibling or a twin that exists in a different Container, but the siblings may differ in some small way (for example, language, category, etc.). The sibling of this Item should be self-describing (that is, it should contain all available information).
domain: Item
range: Item
type: Property
type: ObjectProperty
range: Resource
range: Thing
domain: Resource
domain: Thing

lastName
type: Property
type: DatatypeProperty
comment: The last name of a person.
domain: Person
range: Literal
term status: testing
range: Resource
domain: Agent
domain: Resource
domain: Thing
domain: SpatialThing

gender
type: Property
type: FunctionalProperty
type: DatatypeProperty
comment: The gender of this Agent (typically but not necessarily 'male' or 'female').
domain: Agent
range: Literal
term status: testing
range: Resource
domain: Resource
domain: Thing

theme
type: Property
type: ObjectProperty
comment: A theme.
domain: Thing
range: Thing
term status: archaic
range: Resource
domain: Resource

jabber ID
type: Property
type: DatatypeProperty
type: InverseFunctionalProperty
comment: A jabber ID for something.
domain: Agent
range: Literal
term status: testing
type: ObjectProperty
range: Resource
domain: Resource
domain: Thing

AIM chat ID
type: Property
type: DatatypeProperty
domain: Agent
comment: An AIM chat ID
type: InverseFunctionalProperty
term status: testing
range: Literal
sub property of: nickname
type: ObjectProperty
range: Resource
domain: Resource
domain: Thing

Sent to
label: Envoyé à @fr
comment: Propriété utilisée quand le libellé d'un tag indique à quel utilisateur une ressource a été suggérée (modélise des fonctionalités existantes telles que les tags "for:-username" sur Delicious). @fr
comment: Propriedad usada cuando el contenido de una etiqueta indica a que usuario un recurso ha sido sugerido (modeliza funcionalidades existentes como las etiquetas "for:usuario" en Delicious). @es
sub property of: Is related to
comment: Proprietà usata quando il contenuto di una tag indica a quale utente una risorsa è stata suggerita (modellizza funzionalità esistenti come le tag "for:utente" in Delicious). @it
comment: Property used when the label of a tag indicates to whom a resource was suggested (models existing features like delicious "for:-username" tags).
label: Inviato a @it
label: Enviado a @es
range: User Account
comment: Eigenschap die gebruikt wordt wanneer het label van een tag aangeeft aan wie de bron is voorgesteld (modelleert bestaande functionaliteit zoals de "for:-username" tags op Delicious). @nl
domain: WebRepresentation
type: Property
label: Verstuurd aan @nl
range: Resource
range: Thing
range: Online Account
range: User
domain: Resource

equivalent graph
type: Property
comment: The graphs associated with the subject and object are equivalent.
domain: Graph
range: Graph
range: Resource
domain: Resource

Is relevant
comment: Propriété utilisée pour subsumer "isRelevantToSb" et "isRelevantToSt". @fr
label: È pertinente @it
comment: Proprietà usata per sussumere "isRelevantToSb" e "isRelevantToSt". @it
type: Property
comment: Eigenschap die gebruikt wordt om "isRelevantToSb" en "isRelevantToSt" onder één noemer te brengen. @nl
comment: Property used to subsume "isRelevantToSb" and "isRelevantToSt".
sub property of: Is related to
label: Est pertinent @fr
label: Es pertinente @es
comment: Propriedad usada para subsumir "isRelevantToSb" y "isRelevantToSt". @es

plan
type: Property
type: DatatypeProperty
comment: Aplan comment, in the tradition of finger and '.plan' files.
domain: Person
range: Literal
term status: testing
range: Resource
domain: Agent
domain: Resource
domain: Thing
domain: SpatialThing

Nice Tag Ontology
description: NiceTag è un'ontologia che descrive nel modo più generale possibile le tag, o meglio le azioni di tagging, come atti linguistici nel Web @it
version info: Version 0.5, 09 september 2010
title: L'ontologia Nice Tag @it
title: La ontología Nice Tag @es
attribution URL: http://ns.inria.fr/nicetag/
type: Text
description: NiceTag is een ontologie die zo algemeen mogelijk tags beschrijft, of meer precies de handeling van het taggen. NiceTag beschrijft de handeling van het taggen als een op het web plaats vindende taalhandeling. @nl
licence: http://creativecommons.org/licenses/by-sa/3.0/
description: NiceTag est une ontologie décrivant le plus généralement possible les tags ou plutôt les actes de taguer comme des actes de langage survenant sur le Web @fr
title: Nice Tag ontologie @nl
description: NiceTag es una ontología que describe de la manera mas general posible las etiquetas, o mejor las acciones de etiquetado, como actos de habla en la Web @es
title: L'Ontologie Nice Tag @fr
description: NiceTag Ontology is an ontology which describes as generally as possible tags or rather tag actions understood as a speech acts occurring on the Web
type: Ontology

membershipClass
type: Property
type: AnnotationProperty
comment: Indicates the class of individuals that are a member of a Group
term status: unstable

title
type: Property
type: DatatypeProperty
comment: Title (Mr, Mrs, Ms, Dr. etc)
term status: testing

last name
type: DeprecatedProperty
type: DatatypeProperty
comment: Last (real) name of this user. Synonyms include surname or family name.
domain: User Account
range: Literal
version info: This property is deprecated. Use foaf:name or foaf:surname from the FOAF vocabulary instead.
type: Property
range: Resource
domain: Resource
domain: Thing
domain: Online Account
domain: User

birthday
type: Property
type: FunctionalProperty
type: DatatypeProperty
comment: The birthday of this Agent, represented in mm-dd string form, eg. '12-31'.
domain: Agent
range: Literal
term status: unstable
range: Resource
domain: Resource
domain: Thing

sha1sum of a personal mailbox URI name
type: Property
type: InverseFunctionalProperty
type: DatatypeProperty
comment: The sha1sum of the URI of an Internet mailbox associated with exactly one owner, the first owner of the mailbox.
domain: Agent
range: Literal
term status: testing
type: ObjectProperty
range: Resource
domain: Resource
domain: Thing

note
type: DatatypeProperty
comment: A note associated with this resource, for example, if it has been edited by a UserAccount.
range: Literal
type: Property
range: Resource

nickname
type: Property
type: DatatypeProperty
comment: A short informal nickname characterising an agent (includes login identifiers, IRC and other chat nicknames).
term status: testing

Belongs to tag collection
type: Property
comment: Propriedad usada para asociar una singola acción de etiquetado a una colección de etiquetas, con el objetivo de dar cuenta de los diferentes niveles de agregación proporcionados por los servicios de etiquetado existentes. Hay varias maneras de agregar la etiquetas (por ejemplo, http://delicious.com/fabion_gandon/OWL permite de acceder a una reppresentación de todas las acciones de etiquetado realizadas por el titular de la cuenta "fabien_gandon", en las cuales aparece la etiqueta "OWL" en del.icio.us.com en un instante "t"). @es
label: Appartient à une collection de tags @fr
domain: Tag action
range: Tag collection
comment: Proprietà usata per associare una singola azione di tagging a una collezione di tag, con lo scopo di rendere conto dei vari livelli di aggregazione forniti dai servizi di tagging esistenti. Ci sono vari modi di aggregare delle tag (per esempio, http://delicious.com/fabion_gandon/OWL permette di accedere a una rappresentazione di tutte le azioni di tagging svolte dal titolare dell'account "fabien_gandon", nelle quali compare la tag "OWL" su del.icio.us.com in un istante "t"). @it
comment: Eigenschap die gebruikt wordt om een enkelvoudige taghandeling te koppelen aan een tagverzameling, zo rekenschap gevende van de verschillende niveaus waarop veelgebruikte tagdiensten tags bijeenverzamelen (http://delicious.com/fabion_gandon/OWL bijvoorbeeld, geeft een webrepresentatie van alle taghandelingen van de gebruiker "fabian_gandon" waar op een moment "t" het label "OWL" is gebruikt). @nl
comment: Propriété employée pour associer un acte de taguer singulier à une collection de tags. Ceci sert à rendre compte des multiples manières d'aggréger les tags offertes par les différents services existants (l'URI http://delicious.com/fabion_gandon/OWL permet par exemple d'accéder à une représentation de tous les actes de taguer accomplis par le titulaire du compte "fabien_gandon" où figure le libellé "OWL" sur delicious.com à un instant "t"). @fr
label: Pertenece a una colección de etiquetas @es
label: Appartiene a una collezione di tag @it
comment: Property used to link a single and well individuated TagAction to a TagCollection to account for the various levels of aggregation provided by common tagging applications. There exist different ways to aggregate tags (for instance, http://delicious.com/fabion_gandon/OWL gives a Web representation of all taggings of user "fabien_gandon" involving the tag labeled 'OWL' on delicious.com at time "t").
label: Behoort toe aan tagverzameling @nl
range: Resource
range: Thing
domain: Resource
domain: Thing
domain: Graph
domain: Item

Skype ID
type: Property
type: DatatypeProperty
comment: A Skype ID
domain: Agent
range: Literal
sub property of: nickname
term status: testing
range: Resource
domain: Resource
domain: Thing

num threads
type: DatatypeProperty
comment: The number of Threads (AKA discussion topics) in a Forum.
domain: Forum
range: nonNegativeInteger
type: Property
range: decimal
range: Resource
range: integer
domain: Resource
domain: Thing
domain: Container

name
type: DatatypeProperty
comment: The name of a SIOC concept instance, e.g. a username for a UserAccount, group name for a Usergroup, etc.
range: Literal
type: Property
range: Resource

last reply date
type: DatatypeProperty
comment: The date and time of the last reply Post or Comment, which could be associated with a starter Item or Post or with a Thread, and expressed in ISO 8601 format.
range: Literal
sub property of: date
type: Property
range: Resource

title
type: DeprecatedProperty
type: DatatypeProperty
comment: This is the title (subject line) of the Post. Note that for a Post within a threaded discussion that has no parents, it would detail the topic thread.
domain: Post
range: Literal
version info: This property is deprecated. Use dcterms:title from the Dublin Core ontology instead.
type: Property
range: Resource
domain: Resource
domain: Thing
domain: Document
domain: Item

Has community sign
comment: Corresponds to uses of collectively approved labels shared inside a community.
label: A pour signe collectif @fr
comment: Corresponde al uso de etiquetas elegidas por una comunidad. @es
type: Property
comment: Komt overeen met collectief afgestemd gebruik van door een gemeenschap gekozen labels. @nl
comment: Corrisponde all'uso di tag scelte da una comunità. @it
label: Ha segno collettivo @it
label: Heeft een gemeenschappelijk teken @nl
label: Tiene signo colectivo @es
sub property of: Is related to
comment: Correspond à des usages collectivement constitués de libellés choisis par une communauté. @fr

created at
type: DeprecatedProperty
type: DatatypeProperty
comment: When this was created, in ISO 8601 format.
domain: Post
range: Literal
version info: This property is deprecated. Use dcterms:created from the Dublin Core ontology instead.
type: Property
range: Resource
domain: Resource
domain: Thing
domain: Document
domain: Item

Sent by
comment: Komt overeen met het gebruik van labels die aangeven door wie deze bron is voorgesteld. @nl
comment: Corrisponde all'uso di tagche indicano da chi è stata suggerita una risorsa. @it
type: Property
domain: WebRepresentation
comment: Correspond à l'utilisation de signes qui indiquent à qui une ressource a été suggérée. @fr
range: User Account
label: Enviado por @es
comment: Corresponds to uses of labels that indicate by whom a resource was suggested.
label: Inviato da @it
label: Envoyé par @fr
sub property of: Is related to
label: Verstuurd door @nl
comment: Corresponde al uso de etiquetas que indican por quien ha sido sugerido un recurso. @es
range: Resource
range: Thing
range: Online Account
range: User
domain: Resource

Friend of a Friend (FOAF) vocabulary
type: Ontology
description: The Friend of a Friend (FOAF) RDF vocabulary, described using W3C RDF Schema and the Web Ontology Language.

Is worth
type: Property
comment: Property used whenever a resource is evaluated, ranked, etc. thanks to a label ("***", "5/10", "0", "best", etc.).
label: Ha valore @it
sub property of: Is related to
comment: Propriedad usada para indicar que un recurso es evaluado, clasificado, etc., por medio del contenido de una etiqueta ("***", "5/10", "0", "best", etc.). @es
comment: Proprietà usata per indicare che una risorsa è valutata, classificata, ecc. per mezzo del contenuto di una tag ("***", "5/10", "0", "best", etc.). @it
comment: Propriété utilisée pour indiquer qu'une ressource est évaluée, classée, etc. à l'aide d'un libellé ("***", "5/10", "0", "le meilleur", etc.). @fr
label: Is waaard @nl
label: Tiene valor @es
comment: Eigenschap die gebruikt wordt op het moment dat een een bron wordt gewaardeerd, geklassificeerd met een label ("***", "5/10", "0", "het beste", etc.). @nl
label: Vaut @fr

has URI string value
type: DatatypeProperty
comment: The value of the URI, a string compliant with the URI specification.
range: anyURI
domain: uri
comment: The name of this datatype property previously was "hasURI", but in this ontology a URI is modelled as a class, hence I though that it's better to clarify, even in the property name that it refers to the string value of a URI.
type: FunctionalProperty
type: Property
range: Resource
domain: http://lodlaundromat.org/.well-known/genid/samples/jena///class//0b7a6cec83cd7a6ef81ffd016aefb0e4/f32d8dc45613bef895570d2297255a7b#10
domain: http://lodlaundromat.org/.well-known/genid/samples/jena///class//0b7a6cec83cd7a6ef81ffd016aefb0e4/f32d8dc45613bef895570d2297255a7b#2
domain: resource
domain: Resource
domain: http://lodlaundromat.org/.well-known/genid/samples/jena///class//0b7a6cec83cd7a6ef81ffd016aefb0e4/7c71b10046805dc486cf71431721ea93#2
domain: Thing
domain: Tagged resource
domain: http://lodlaundromat.org/.well-known/genid/samples/jena///class//0b7a6cec83cd7a6ef81ffd016aefb0e4/f32d8dc45613bef895570d2297255a7b#3
domain: http://lodlaundromat.org/.well-known/genid/samples/jena///class//0b7a6cec83cd7a6ef81ffd016aefb0e4/7c71b10046805dc486cf71431721ea93#10
domain: http://lodlaundromat.org/.well-known/genid/samples/jena///class//0b7a6cec83cd7a6ef81ffd016aefb0e4/7c71b10046805dc486cf71431721ea93#3

num items
type: DatatypeProperty
comment: The number of Posts (or Items) in a Forum (or a Container).
domain: Container
range: nonNegativeInteger
type: Property
range: decimal
range: Resource
range: integer
domain: Resource
domain: Thing

firstName
type: Property
type: DatatypeProperty
comment: The first name of a person.
domain: Person
range: Literal
term status: testing
range: Resource
domain: Agent
domain: Resource
domain: Thing
domain: SpatialThing

last item date
type: DatatypeProperty
comment: The date and time of the last Post (or Item) in a Forum (or a Container), in ISO 8601 format.
domain: Container
range: Literal
sub property of: date
type: Property
range: Resource
domain: Resource
domain: Thing

Given name
type: Property
type: DatatypeProperty
comment: The given name of some person.
term status: archaic

ip address
type: DatatypeProperty
comment: The IP address used when creating this Item. This can be associated with a creator. Some wiki articles list the IP addresses for the creator or modifiers when the usernames are absent.
domain: Item
range: Literal
type: Property
range: Resource
domain: Resource
domain: Thing

familyName
type: Property
type: DatatypeProperty
comment: The family name of some person.
domain: Person
range: Literal
term status: testing
range: Resource
domain: Agent
domain: Resource
domain: Thing
domain: SpatialThing