Reader Tag
subclass of: Resource
type: Class
comment: A Tag asserted by the reader (consumer) of a content resource.
subclass of: Tag

Tagged Content
subclass of: Resource
type: Class
comment: Content which has one or more Common Tag.

Author Tag
subclass of: Resource
type: Class
comment: A Tag asserted by the author of a content resource.
subclass of: Tag

Auto Tag
subclass of: Resource
type: Class
comment: A Tag asserted by an automated tool on a content resource.
subclass of: Tag

Tag
subclass of: Resource
type: Class
comment: A Common Tag associating a URI and a keyword to annotate a resource.

means
type: Property
comment: A a resource (URI) representing the conceptual meaning of a Tag.
domain: Tag
domain: Resource

tagged
type: Property
comment: Links a resource to a Common Tag.
domain: Tagged Content
range: Tag
range: Resource
domain: Resource

is about
type: Property
comment: A resource (URI) representing the concepts described by the content.
domain: Tagged Content
domain: Resource

CommonTag mappings with other vocabularies

Common Tag vocabulary
contributor: Jamie Taylor
contributor: Andraz Tori
issued: 2009-06-08
type: Ontology
contributor: Alexandre Passant
contributor: Peter Mika
description: Common Tag RDF vocabulary, described using W3C RDF Schema. Common Tags allows documents and document fragments (any resource which can be identified by a URI) to be labeled with keywords and URIs, unambigiously idenfying the concepts covered by the resource.
contributor: Vuk Milicic
contributor: Scott Montgomerie
contributor: Alex Iskold

tag label
type: Property
comment: A local, human-readable name for a Tag.
domain: Tag
sub property of: label
domain: Resource

tagging date
type: Property
comment: The date the Tag was assigned.
domain: Tag
sub property of: created
domain: Resource